[gd_resource type="ShaderMaterial" load_steps=4 format=2]

[ext_resource path="res://shade/background.shader" type="Shader" id=1]

[sub_resource type="Gradient" id=1]
colors = PoolColorArray( 1, 0.605347, 0.046875, 1, 1, 0.179688, 0.179688, 1 )

[sub_resource type="GradientTexture" id=2]
gradient = SubResource( 1 )
width = 128

[resource]
shader = ExtResource( 1 )
shader_param/solved_color = Color( 1, 0.74902, 0, 1 )
shader_param/color_a = Color( 0.968627, 1, 0, 1 )
shader_param/color_b = Color( 0.639216, 1, 0, 1 )
shader_param/back_a = Color( 0.431373, 0, 1, 1 )
shader_param/back_b = Color( 0, 0, 1, 1 )
shader_param/cursor = null
shader_param/hovered = -1.0
shader_param/grabbed = 0.0
shader_param/offset = null
shader_param/win_time = 0.0
shader_param/win_rate = 10.0
shader_param/solved = SubResource( 2 )
