<?xml version="1.0" encoding="UTF-8" standalone="no"?>
<!-- Created with Inkscape (http://www.inkscape.org/) -->

<svg
   width="210mm"
   height="210mm"
   viewBox="0 0 210 210"
   version="1.1"
   id="svg5"
   inkscape:version="1.1.2 (0a00cf5339, 2022-02-04)"
   sodipodi:docname="airmouse_anim_rotate.svg"
   xmlns:inkscape="http://www.inkscape.org/namespaces/inkscape"
   xmlns:sodipodi="http://sodipodi.sourceforge.net/DTD/sodipodi-0.dtd"
   xmlns="http://www.w3.org/2000/svg"
   xmlns:svg="http://www.w3.org/2000/svg">
  <sodipodi:namedview
     id="namedview7"
     pagecolor="#505050"
     bordercolor="#eeeeee"
     borderopacity="1"
     inkscape:pageshadow="0"
     inkscape:pageopacity="0"
     inkscape:pagecheckerboard="0"
     inkscape:document-units="mm"
     showgrid="false"
     inkscape:zoom="1.6748036"
     inkscape:cx="433.78221"
     inkscape:cy="473.48836"
     inkscape:window-width="1920"
     inkscape:window-height="1043"
     inkscape:window-x="0"
     inkscape:window-y="0"
     inkscape:window-maximized="1"
     inkscape:current-layer="layer1-5" />
  <defs
     id="defs2">
    <inkscape:path-effect
       effect="bspline"
       id="path-effect32407"
       is_visible="true"
       lpeversion="1"
       weight="33.333333"
       steps="2"
       helper_size="0"
       apply_no_weight="true"
       apply_with_weight="true"
       only_selected="false" />
    <inkscape:path-effect
       effect="bspline"
       id="path-effect463"
       is_visible="true"
       lpeversion="1"
       weight="33.333333"
       steps="2"
       helper_size="0"
       apply_no_weight="true"
       apply_with_weight="true"
       only_selected="false" />
    <inkscape:path-effect
       effect="bspline"
       id="path-effect459"
       is_visible="true"
       lpeversion="1"
       weight="33.333333"
       steps="2"
       helper_size="0"
       apply_no_weight="true"
       apply_with_weight="true"
       only_selected="false" />
    <inkscape:path-effect
       effect="bspline"
       id="path-effect455"
       is_visible="true"
       lpeversion="1"
       weight="33.333333"
       steps="2"
       helper_size="0"
       apply_no_weight="true"
       apply_with_weight="true"
       only_selected="false" />
    <inkscape:path-effect
       effect="bspline"
       id="path-effect451"
       is_visible="true"
       lpeversion="1"
       weight="33.333333"
       steps="2"
       helper_size="0"
       apply_no_weight="true"
       apply_with_weight="true"
       only_selected="false" />
    <inkscape:path-effect
       effect="bspline"
       id="path-effect447"
       is_visible="true"
       lpeversion="1"
       weight="33.333333"
       steps="2"
       helper_size="0"
       apply_no_weight="true"
       apply_with_weight="true"
       only_selected="false" />
    <inkscape:path-effect
       effect="bspline"
       id="path-effect443"
       is_visible="true"
       lpeversion="1"
       weight="33.333333"
       steps="2"
       helper_size="0"
       apply_no_weight="true"
       apply_with_weight="true"
       only_selected="false" />
    <inkscape:path-effect
       effect="bspline"
       id="path-effect439"
       is_visible="true"
       lpeversion="1"
       weight="33.333333"
       steps="2"
       helper_size="0"
       apply_no_weight="true"
       apply_with_weight="true"
       only_selected="false" />
    <inkscape:path-effect
       effect="bspline"
       id="path-effect435"
       is_visible="true"
       lpeversion="1"
       weight="33.333333"
       steps="2"
       helper_size="0"
       apply_no_weight="true"
       apply_with_weight="true"
       only_selected="false" />
    <inkscape:path-effect
       effect="bspline"
       id="path-effect318"
       is_visible="true"
       lpeversion="1"
       weight="33.333333"
       steps="2"
       helper_size="0"
       apply_no_weight="true"
       apply_with_weight="true"
       only_selected="false" />
    <inkscape:path-effect
       effect="bspline"
       id="path-effect121"
       is_visible="true"
       lpeversion="1"
       weight="33.333333"
       steps="2"
       helper_size="0"
       apply_no_weight="true"
       apply_with_weight="true"
       only_selected="false" />
  </defs>
  <g
     inkscape:label="Layer 1"
     inkscape:groupmode="layer"
     id="layer1">
    <g
       inkscape:label="Layer 1"
       id="layer1-5"
       transform="translate(-1.2136341,23.309575)">
      <path
         style="fill:none;stroke:#ffffff;stroke-width:1;stroke-linecap:butt;stroke-linejoin:miter;stroke-miterlimit:4;stroke-dasharray:none;stroke-opacity:1"
         d="m 91.412675,98.247417 c 3.706174,4.059253 7.159278,10.226663 9.780965,15.726253 2.62169,5.49959 4.41195,10.33117 5.46693,14.04201 1.05499,3.71083 1.37475,6.30073 1.82037,8.13494 0.44562,1.8342 1.01695,2.91259 2.0185,4.0423 1.00155,1.12972 2.43312,2.31077 3.94993,3.24127 1.5168,0.9305 3.1187,1.6105 4.6701,2.07325 1.5514,0.46275 3.05219,0.70832 4.46481,0.6261 1.41262,-0.0822 2.73709,-0.49209 3.98539,-1.09047 1.2483,-0.59838 2.42048,-1.38523 3.63928,-2.67208 1.21879,-1.28685 2.48422,-3.07371 4.24684,-5.91919 1.76261,-2.84547 4.02232,-6.7494 5.74862,-10.61761 1.7263,-3.86822 2.91911,-7.70057 3.67019,-10.94467 0.75109,-3.2441 1.06039,-5.89983 1.30401,-8.98774 0.24362,-3.08791 0.42152,-6.607827 0.33742,-10.34216 -0.0841,-3.734333 -0.43025,-7.682912 -0.94841,-11.32241 -0.51816,-3.639499 -1.20835,-6.969731 -2.1287,-10.292875 -0.92035,-3.323145 -2.07083,-6.639005 -3.86084,-10.136933 -1.79001,-3.497928 -4.21952,-7.177694 -6.82879,-10.069956 -2.60927,-2.892261 -5.39823,-4.996774 -7.41673,-6.479725 -2.0185,-1.482951 -3.26643,-2.344245 -5.72854,-3.693334 -2.4621,-1.349089 -6.13824,-3.185836 -9.75622,-4.658233 -3.61798,-1.472397 -7.1776,-2.580305 -10.863778,-3.371122 -3.68618,-0.790816 -7.498675,-1.264439 -10.5146,-1.793046 -3.015925,-0.528607 -5.235134,-1.11221 -6.844276,-1.469743 -1.609141,-0.357533 -2.608113,-0.488935 -4.405748,0.49424 -1.797636,0.983175 -4.393549,3.080909 -6.393988,4.476587 -2.00044,1.395679 -3.40537,2.089259 -4.658114,3.264394 -1.252743,1.175134 -2.353078,2.831633 -3.152093,4.730157 -0.799016,1.898525 -1.296671,4.038823 -1.752928,6.645924 -0.456257,2.607101 -0.871103,5.680806 -0.773612,8.985445 0.09749,3.304639 0.707218,6.839938 1.734106,9.922483 1.026888,3.082546 2.470748,5.71215 4.159866,8.129415 1.689117,2.417264 3.623318,4.622091 5.898406,6.480916 2.275089,1.858825 4.890858,3.371645 8.178504,5.103548 3.287645,1.731904 7.246955,3.682811 10.95313,7.742065 z"
         id="path119"
         inkscape:path-effect="#path-effect121"
         inkscape:original-d="m 91.665571,96.138952 c 3.453369,6.167668 6.906467,12.335078 10.359309,18.502218 1.79059,4.83204 3.58085,9.66362 5.37088,14.49503 0.32003,2.59028 0.63979,5.18018 0.95928,7.76987 0.57162,1.0787 1.14294,2.15709 1.71402,3.23523 1.4319,1.18137 2.86348,2.36242 4.29482,3.54323 1.60224,0.68029 3.20414,1.36029 4.80581,2.04004 1.50114,0.24584 3.00194,0.4914 4.50252,0.73671 1.32479,-0.40964 2.64926,-0.81952 3.97349,-1.22967 1.17248,-0.78661 2.34466,-1.57346 3.51659,-2.36059 1.26575,-1.78667 2.53118,-3.57353 3.79637,-5.36069 2.26006,-3.90382 4.51976,-7.80775 6.77924,-11.71202 1.19312,-3.83224 2.38593,-7.66459 3.5785,-11.49728 0.30958,-2.65558 0.61888,-5.31131 0.92793,-7.96737 0.17818,-3.51978 0.35608,-7.039693 0.53372,-10.559928 -0.34589,-3.948466 -0.69203,-7.897045 -1.03844,-11.845961 -0.68995,-3.330102 -1.38014,-6.660334 -2.07061,-9.990893 -1.15027,-3.315742 -2.30075,-6.631604 -3.45153,-9.947793 -2.42934,-3.679652 -4.85884,-7.359421 -7.28866,-11.03952 -2.78882,-2.104338 -5.57778,-4.208856 -8.36707,-6.313674 -1.24772,-0.861064 -2.49565,-1.722358 -3.74387,-2.583935 -3.67601,-1.836548 -7.35214,-3.673299 -11.02861,-5.510347 -3.55949,-1.107686 -7.11911,-2.215594 -10.679062,-3.323788 -3.812384,-0.473377 -7.624879,-0.946999 -11.437716,-1.420897 -2.219033,-0.583362 -4.438242,-1.166966 -6.65776,-1.750846 -0.998747,-0.131143 -1.997718,-0.262546 -2.996973,-0.394213 -2.595753,2.098082 -5.191667,4.195815 -7.787896,6.293327 -1.404726,0.693874 -2.809658,1.387451 -4.214887,2.080788 -1.100108,1.656821 -2.200439,3.313322 -3.301058,4.96958 -0.497411,2.140658 -0.995068,4.280956 -1.492998,6.421044 -0.414597,3.074082 -0.829443,6.147787 -1.244561,9.221279 0.610018,3.535709 1.219745,7.071008 1.829221,10.60612 1.44418,2.629965 2.888038,5.25957 4.33166,7.888955 1.934541,2.205178 3.86874,4.410006 5.802715,6.614611 2.616136,1.513144 5.231905,3.025965 7.847459,4.538546 3.959733,1.951248 7.919043,3.902156 11.878167,5.852837 z" />
      <path
         style="fill:none;stroke:#ffffff;stroke-width:1;stroke-linecap:butt;stroke-linejoin:miter;stroke-miterlimit:4;stroke-dasharray:none;stroke-opacity:1"
         d="m 76.810303,54.425082 c 0.332723,0.226743 0.997854,0.680016 1.918012,1.501371 0.920159,0.821354 2.095335,2.010685 3.083048,3.057572 0.987713,1.046886 1.787927,1.95126 2.650448,3.016503 0.862522,1.065243 1.787325,2.291276 2.426468,3.273841 0.639142,0.982564 0.992661,1.721581 1.12617,2.116481 0.133509,0.3949 0.04708,0.446031 -0.683601,0.06464 -0.730683,-0.381386 -2.1058,-1.195491 -3.256068,-1.978977 -1.150267,-0.783486 -2.075596,-1.536355 -2.898868,-2.340293 -0.823271,-0.803939 -1.544379,-1.658937 -2.173532,-2.561735 -0.629153,-0.902799 -1.166244,-1.853357 -1.571761,-2.77046 -0.405518,-0.917103 -0.679358,-1.800697 -0.828864,-2.342176 -0.149505,-0.541479 -0.174609,-0.740808 -0.174604,-0.894371 4e-6,-0.153563 0.0252,-0.261255 0.03782,-0.315199 0.01262,-0.05394 0.01261,-0.05394 0.345336,0.172799 z"
         id="path316"
         inkscape:path-effect="#path-effect318"
         inkscape:original-d="m 76.477581,54.198339 c 0.665403,0.453547 1.330539,0.906814 1.995413,1.359831 1.175483,1.189634 2.350656,2.378968 3.525589,3.568052 0.80051,0.904674 1.600724,1.809048 2.400689,2.713175 0.925105,1.226341 1.849906,2.452375 2.774463,3.678169 0.353798,0.739314 0.707316,1.478331 1.060577,2.217095 -0.08617,0.0514 -0.172596,0.10253 -0.259289,0.1534 -1.374905,-0.813874 -2.750021,-1.627981 -4.125431,-2.442365 -0.925102,-0.752637 -1.850435,-1.505501 -2.776051,-2.258658 -0.720875,-0.854774 -1.441984,-1.709771 -2.163373,-2.565055 -0.53685,-0.950344 -1.073944,-1.900901 -1.611313,-2.851745 -0.273587,-0.883364 -0.547428,-1.766958 -0.821539,-2.650835 -0.02484,-0.199057 -0.04994,-0.398387 -0.07531,-0.597977 0.02545,-0.107437 0.05065,-0.215127 0.07558,-0.323087 z" />
      <path
         style="fill:none;stroke:#ffffff;stroke-width:1;stroke-linecap:butt;stroke-linejoin:miter;stroke-miterlimit:4;stroke-dasharray:none;stroke-opacity:1"
         d="m 117.9276,55.453471 c -0.46401,0.628202 -0.92434,1.626714 -1.02027,2.917009 -0.0959,1.290295 0.17245,2.872116 0.8151,4.487547 0.64265,1.61543 1.65938,3.264339 2.96966,4.743305 1.31028,1.478966 2.91391,2.787966 4.49877,3.685313 1.58485,0.897347 3.1508,1.38313 4.43608,1.508116 1.28529,0.124986 2.28995,-0.110683 3.06496,-0.60018 0.775,-0.489498 1.32053,-1.232885 1.74042,-2.401556 0.41989,-1.168672 0.71413,-2.762712 0.68949,-4.337775 -0.0246,-1.575062 -0.36823,-3.131153 -1.09864,-4.607739 -0.7304,-1.476587 -1.84771,-2.873548 -3.07419,-3.928715 -1.22649,-1.055167 -2.56215,-1.768357 -3.95622,-2.227631 -1.39408,-0.459275 -2.84646,-0.664486 -4.13388,-0.685724 -1.28741,-0.02124 -2.40971,0.141566 -3.20472,0.351831 -0.79501,0.210264 -1.26255,0.467997 -1.72656,1.096199 z"
         id="path433"
         inkscape:path-effect="#path-effect435"
         inkscape:original-d="m 117.92397,55.083053 c -0.46007,0.998764 -0.92039,1.997281 -1.38099,2.995525 0.26864,1.582161 0.53701,3.163982 0.80512,4.745583 1.01705,1.649251 2.03379,3.298159 3.05029,4.94685 1.60396,1.309314 3.20759,2.618315 4.81099,3.927079 1.56628,0.486067 3.13223,0.971854 4.69795,1.457381 1.00497,-0.235407 2.00963,-0.471087 3.01406,-0.707024 0.54581,-0.743147 1.09134,-1.486534 1.63662,-2.230198 0.2945,-1.593841 0.58873,-3.187882 0.88271,-4.782213 -0.34335,-1.555891 -0.68695,-3.111982 -1.03082,-4.668373 -1.1171,-1.396764 -2.23441,-2.793725 -3.35201,-4.190986 -1.33545,-0.712947 -2.67111,-1.426144 -4.00706,-2.139608 -1.45218,-0.20495 -2.90456,-0.41017 -4.35723,-0.615647 -1.12209,0.163077 -2.24439,0.325877 -3.36699,0.488427 -0.46729,0.257997 -0.93483,0.515737 -1.40264,0.773204 z" />
      <path
         style="fill:none;stroke:#ffffff;stroke-width:1;stroke-linecap:butt;stroke-linejoin:miter;stroke-miterlimit:4;stroke-dasharray:none;stroke-opacity:1"
         d="m 140.50156,85.247262 c 0.18922,-0.189151 0.56766,-0.567458 0.98282,-1.056775 0.41517,-0.489316 0.86707,-1.089666 1.24439,-1.749337 0.37732,-0.659672 0.68005,-1.378718 0.87731,-2.096569 0.19726,-0.71785 0.28902,-1.434581 0.33943,-2.128227 0.0504,-0.693647 0.0594,-1.364217 0.0828,-1.657167 0.0233,-0.29295 0.0608,-0.208381 0.15915,0.215808 0.0984,0.424188 0.25782,1.187971 0.47239,2.288894 0.21458,1.100922 0.4843,2.538903 0.77471,4.583162 0.29041,2.044258 0.60152,4.694672 0.79252,7.124213 0.191,2.429542 0.26193,4.638089 0.25308,6.877765 -0.009,2.239676 -0.0975,4.510371 -0.15751,5.881711 -0.0601,1.37135 -0.0916,1.84328 -0.3216,2.44673 -0.23005,0.60345 -0.6586,1.33853 -1.11314,1.99652 -0.45454,0.658 -0.93508,1.23893 -1.19727,1.49886 -0.26219,0.25992 -0.30629,0.19853 -0.30112,-0.14112 0.005,-0.33965 0.0599,-0.95747 0.0916,-1.5894 0.0318,-0.63192 0.0405,-1.27794 0.0127,-1.90462 -0.0279,-0.62668 -0.0925,-1.23402 -0.20088,-1.69951 -0.10838,-0.46549 -0.26063,-0.78913 -0.33909,-1.01374 -0.0785,-0.22461 -0.083,-0.35016 0.0892,-0.56761 0.17218,-0.21746 0.52105,-0.52655 0.86433,-0.94555 0.34329,-0.41901 0.68101,-0.94795 0.94872,-1.4818 0.2677,-0.533842 0.46538,-1.072593 0.63001,-1.691528 0.16464,-0.618935 0.29619,-1.318042 0.35147,-1.946991 0.0553,-0.628949 0.0342,-1.187724 -0.12532,-1.819389 -0.15953,-0.631666 -0.45762,-1.336192 -0.7858,-1.92288 -0.32818,-0.586688 -0.6861,-1.054918 -1.02394,-1.396342 -0.33784,-0.341423 -0.6539,-0.55425 -0.96065,-0.782013 -0.30675,-0.227763 -0.60299,-0.469656 -0.99025,-0.722676 -0.38726,-0.25302 -0.86667,-0.517788 -1.10122,-0.69486 -0.23455,-0.177073 -0.22432,-0.266661 -0.18525,-0.589022 0.0391,-0.322362 0.10697,-0.877445 0.0461,-1.396917 -0.0609,-0.519472 -0.25065,-1.0034 -0.33865,-1.285901 -0.088,-0.2825 -0.0741,-0.363415 -0.0671,-0.403992 0.007,-0.04058 0.007,-0.04058 0.19615,-0.229727 z"
         id="path441"
         inkscape:path-effect="#path-effect443"
         inkscape:original-d="m 140.31234,85.436412 c 0.3787,-0.378037 0.75714,-0.756347 1.13531,-1.134904 0.45219,-0.600117 0.9041,-1.200464 1.35575,-1.801088 0.30301,-0.718807 0.60574,-1.437854 0.90821,-2.157168 0.092,-0.716487 0.18379,-1.433214 0.27528,-2.150208 0.009,-0.670337 0.0183,-1.340904 0.0271,-2.011751 0.0377,0.0849 0.0752,0.16944 0.11233,0.25377 0.1597,0.764077 0.31912,1.527861 0.47828,2.291398 0.27,1.438311 0.53972,2.876292 0.80918,4.314036 0.31138,2.650785 0.62248,5.3012 0.93333,7.951392 0.0712,2.208908 0.14211,4.417456 0.21277,6.625784 -0.0883,2.271044 -0.17694,4.541737 -0.26581,6.812217 -0.0312,0.47222 -0.0627,0.94415 -0.0945,1.41583 -0.4283,0.73538 -0.85684,1.47046 -1.28566,2.20529 -0.48029,0.58122 -0.96083,1.16215 -1.44164,1.74282 -0.0438,-0.0611 -0.0879,-0.1225 -0.13228,-0.18415 0.0549,-0.61758 0.10962,-1.2354 0.16404,-1.8535 0.009,-0.64577 0.0178,-1.29179 0.0264,-1.93807 -0.0643,-0.60711 -0.12896,-1.21445 -0.19385,-1.82206 -0.15199,-0.3234 -0.30424,-0.64704 -0.45676,-0.97095 -0.004,-0.12527 -0.009,-0.2508 -0.0136,-0.37659 0.34915,-0.30884 0.69801,-0.61793 1.04664,-0.9273 0.33801,-0.52872 0.67573,-1.05766 1.0132,-1.58691 0.19796,-0.538523 0.39563,-1.077275 0.59305,-1.616323 0.13183,-0.698883 0.26339,-1.397989 0.39469,-2.097408 -0.0208,-0.558547 -0.0419,-1.11732 -0.0632,-1.676391 -0.29785,-0.704306 -0.59594,-1.408833 -0.89432,-2.113678 -0.35807,-0.468506 -0.71599,-0.936736 -1.07497,-1.406271 -0.31678,-0.213221 -0.63284,-0.42605 -0.95008,-0.639756 -0.29625,-0.241846 -0.59249,-0.48374 -0.88873,-0.725685 -0.4783,-0.264037 -0.95771,-0.528806 -1.43697,-0.793607 0.0105,-0.0894 0.0208,-0.17898 0.0307,-0.268867 0.0682,-0.554837 0.13607,-1.109924 0.20371,-1.665281 -0.18952,-0.483677 -0.3793,-0.967604 -0.56934,-1.451801 0.0142,-0.0807 0.0281,-0.16162 0.0418,-0.24282 z"
         sodipodi:nodetypes="cccccccccccccccccccccccccccccccccccc" />
      <path
         style="fill:none;stroke:#ffffff;stroke-width:1;stroke-linecap:butt;stroke-linejoin:miter;stroke-miterlimit:4;stroke-dasharray:none;stroke-opacity:1"
         d="m 127.06155,88.195257 c 0.0975,-0.13092 0.29259,-0.39279 0.55799,-0.575707 0.26539,-0.182918 0.6009,-0.286773 1.06018,-0.278213 0.45928,0.0086 1.04216,0.129417 1.75416,0.254872 0.712,0.125456 1.55308,0.255519 2.4865,0.296622 0.93342,0.0411 1.95916,-0.0067 2.93018,-0.173109 0.97102,-0.166412 1.88735,-0.451384 2.56877,-0.755194 0.68141,-0.303811 1.128,-0.626461 1.39239,-0.811768 0.26439,-0.185307 0.34647,-0.23322 0.44255,-0.128299 0.0961,0.10492 0.20606,0.362301 0.28162,0.743576 0.0756,0.381274 0.11682,0.886455 0.11887,1.302907 0.002,0.416452 -0.0351,0.744212 -0.11786,0.940238 -0.0828,0.196026 -0.21144,0.260594 -0.33135,0.450425 -0.11991,0.18983 -0.23093,0.504708 -0.29668,0.956551 -0.0657,0.451843 -0.0862,1.04051 -0.0575,1.741922 0.0288,0.701412 0.10683,1.515497 0.2355,2.554845 0.12867,1.039349 0.30793,2.303873 0.45952,3.367949 0.1516,1.064075 0.2755,1.927626 0.40822,2.562026 0.13273,0.63439 0.27419,1.03957 0.42799,1.38978 0.1538,0.35021 0.31987,0.64544 0.47306,0.84131 0.15319,0.19587 0.29333,0.29247 0.43188,0.31235 0.13855,0.0199 0.27568,-0.0367 0.39852,-0.0399 0.12284,-0.003 0.23118,0.0466 0.32193,0.17513 0.0908,0.12848 0.16413,0.33542 0.25349,0.83992 0.0894,0.5045 0.19478,1.30658 0.2253,2.05344 0.0305,0.74687 -0.0138,1.43852 -0.0536,2.02571 -0.0398,0.58719 -0.0752,1.06988 -0.13222,1.36613 -0.0571,0.29626 -0.13582,0.40625 -0.41528,0.60125 -0.27947,0.195 -0.75973,0.4751 -1.44443,0.69203 -0.68469,0.21693 -1.57388,0.37067 -2.56113,0.36959 -0.98725,-0.001 -2.07257,-0.15707 -3.11697,-0.53282 -1.0444,-0.37576 -2.04785,-0.97139 -2.95788,-1.7838 -0.91003,-0.8124 -1.72652,-1.84163 -2.3888,-3.18178 -0.66228,-1.34016 -1.17019,-2.99117 -1.58274,-4.40098 -0.41256,-1.409805 -0.72973,-2.578314 -1.12204,-4.033187 -0.39231,-1.454873 -0.85973,-3.19602 -1.11068,-4.364331 -0.25094,-1.16831 -0.28533,-1.763688 -0.2313,-2.364424 0.054,-0.600735 0.19653,-1.206702 0.31031,-1.588277 0.11378,-0.381574 0.19885,-0.538657 0.2414,-0.61724 0.0426,-0.07858 0.0426,-0.07858 0.14009,-0.209504 z"
         id="path445"
         inkscape:path-effect="#path-effect447"
         inkscape:original-d="m 126.96403,88.326177 c 0.19534,-0.26162 0.39041,-0.523487 0.58522,-0.785637 0.33578,-0.10359 0.67129,-0.20745 1.00654,-0.311567 0.58317,0.121117 1.16605,0.241977 1.74868,0.362577 0.84138,0.13033 1.68246,0.260387 2.52329,0.390197 1.02605,-0.0475 2.05179,-0.0953 3.07728,-0.1434 0.91664,-0.284717 1.83297,-0.569684 2.74905,-0.854934 0.44687,-0.322397 0.89346,-0.645047 1.33979,-0.967964 0.0824,-0.0477 0.16449,-0.0956 0.24634,-0.14379 0.11025,0.25767 0.22024,0.515047 0.32996,0.772177 0.0415,0.505457 0.0828,1.010634 0.12376,1.515561 -0.0368,0.328037 -0.0739,0.655797 -0.11132,0.983304 -0.12837,0.0648 -0.257,0.12939 -0.38589,0.19369 -0.11077,0.315157 -0.2218,0.630034 -0.33309,0.944664 -0.0202,0.588957 -0.0407,1.177624 -0.0615,1.766041 0.0783,0.814374 0.15635,1.628458 0.23413,2.442295 0.17954,1.264851 0.35881,2.529375 0.53781,3.793669 0.12418,0.863857 0.24809,1.72741 0.37173,2.59072 0.14173,0.40546 0.28319,0.81064 0.42439,1.21557 0.16634,0.29549 0.33241,0.59072 0.49822,0.88568 0.14043,0.0969 0.28058,0.19349 0.42047,0.28983 0.13739,-0.0563 0.27451,-0.1129 0.41137,-0.16974 0.10862,0.0502 0.21697,0.10004 0.32506,0.14966 0.0736,0.20719 0.14701,0.41411 0.22011,0.62077 0.10569,0.80237 0.2111,1.60445 0.31626,2.40628 -0.044,0.69195 -0.0884,1.3836 -0.13294,2.07501 -0.0351,0.48297 -0.0704,0.96566 -0.10601,1.4481 -0.0785,0.11026 -0.15726,0.22025 -0.23628,0.32998 -0.48003,0.28037 -0.96029,0.56047 -1.44084,0.84031 -0.88897,0.15401 -1.77816,0.30775 -2.66765,0.46123 -1.08509,-0.15572 -2.17041,-0.31171 -3.25601,-0.46796 -1.00322,-0.5954 -2.00667,-1.19103 -3.0104,-1.78695 -0.81625,-1.029 -1.63274,-2.05822 -2.4495,-3.08773 -0.50767,-1.65083 -1.01557,-3.30184 -1.52375,-4.95316 -0.31692,-1.168293 -0.63409,-2.336803 -0.95153,-3.505597 -0.46718,-1.740951 -0.9346,-3.482099 -1.4023,-5.22355 -0.0341,-0.595137 -0.0685,-1.190514 -0.10316,-1.786161 0.14277,-0.605737 0.28527,-1.211704 0.42751,-1.817948 0.0853,-0.15682 0.17039,-0.31389 0.25519,-0.471227 z" />
      <path
         style="fill:none;stroke:#ffffff;stroke-width:1;stroke-linecap:butt;stroke-linejoin:miter;stroke-miterlimit:4;stroke-dasharray:none;stroke-opacity:1"
         d="m 118.60873,48.959242 c 0.88014,-0.0077 1.97241,0.115551 3.2133,0.482269 1.24089,0.366718 2.63034,0.976762 3.98583,1.764813 1.35549,0.788051 2.67699,1.753982 3.84635,2.716786 1.16936,0.962804 2.18655,1.922385 3.17152,3.016587 0.98496,1.094202 1.93768,2.322921 2.72448,3.52187 0.7868,1.198949 1.40769,2.368034 2.04059,3.956767 0.6329,1.588732 1.27785,3.597008 1.56126,5.179725 0.28341,1.582718 0.20538,2.739859 -0.005,3.708594 -0.21046,0.968734 -0.55331,1.749138 -1.12813,2.464004 -0.57482,0.714865 -1.38166,1.364295 -2.29321,1.816766 -0.91155,0.45247 -1.92789,0.707972 -3.21984,0.716488 -1.29196,0.0085 -2.85956,-0.230046 -4.55592,-0.814888 -1.69636,-0.584842 -3.52141,-1.516041 -5.40317,-2.95655 -1.88177,-1.44051 -3.82008,-3.390329 -5.45702,-5.540849 -1.63694,-2.150519 -2.97233,-4.501642 -3.86383,-6.546198 -0.8915,-2.044556 -1.33897,-3.782413 -1.45044,-5.275332 -0.11146,-1.492918 0.11321,-2.740699 0.61467,-3.855556 0.50146,-1.114857 1.27967,-2.096551 1.99294,-2.752736 0.71327,-0.656185 1.36144,-0.986751 2.01954,-1.221415 0.65811,-0.234665 1.32601,-0.373432 2.20616,-0.381145 z"
         id="path449"
         inkscape:path-effect="#path-effect451"
         inkscape:original-d="m 118.3963,48.828229 c 1.09254,0.12353 2.18481,0.2468 3.27682,0.369797 1.38975,0.610327 2.77919,1.220374 4.16839,1.830161 1.32181,0.966234 2.6433,1.932168 3.96456,2.897855 1.01749,0.959884 2.03469,1.919458 3.05163,2.878792 0.95303,1.229034 1.90575,2.457755 2.85823,3.686239 0.62117,1.169394 1.24206,2.338478 1.8627,3.507322 0.64524,2.008618 1.29018,4.016896 1.93488,6.024954 -0.0778,1.157444 -0.15579,2.314588 -0.23408,3.471482 -0.3426,0.780694 -0.68544,1.561101 -1.02856,2.341255 -0.80661,0.649727 -1.61345,1.299154 -2.42057,1.948338 -1.01613,0.25578 -2.03247,0.511277 -3.0491,0.766527 -1.56739,-0.23831 -3.13499,-0.476867 -4.70288,-0.715697 -1.82485,-0.930974 -3.6499,-1.862168 -5.47525,-2.793652 -1.93813,-1.949641 -3.87644,-3.899459 -5.81506,-5.849587 -1.33518,-2.350958 -2.67056,-4.702083 -4.00624,-7.053521 -0.44723,-1.737671 -0.8947,-3.475529 -1.34245,-5.2137 0.22494,-1.247564 0.44961,-2.495345 0.67402,-3.743419 0.7785,-0.981464 1.55671,-1.963158 2.33467,-2.945132 0.64845,-0.33031 1.29662,-0.660877 1.94453,-0.991707 0.6682,-0.138507 1.33611,-0.277267 2.00376,-0.416307 z" />
      <path
         style="fill:none;stroke:#ffffff;stroke-width:1;stroke-linecap:butt;stroke-linejoin:miter;stroke-miterlimit:4;stroke-dasharray:none;stroke-opacity:1"
         d="m 93.140085,37.833044 c 0.13098,-0.07923 0.392867,-0.237637 0.590686,-0.321149 0.197818,-0.08351 0.331388,-0.09216 0.729691,0.03389 0.398303,0.12605 1.061232,0.386639 2.321227,0.8943 1.259994,0.507661 3.116973,1.262356 4.854641,2.009869 1.73767,0.747514 3.35591,1.487782 4.38096,1.998984 1.02504,0.511202 1.45683,0.79325 1.67537,1.000797 0.21854,0.207547 0.2241,0.34049 0.0704,0.490251 -0.15374,0.149762 -0.46687,0.316655 -0.95316,0.745602 -0.48629,0.428947 -1.14561,1.119857 -1.68244,1.938701 -0.53683,0.818845 -0.95108,1.765438 -1.24774,2.690713 -0.29666,0.925276 -0.47573,1.829088 -0.59122,2.518576 -0.11548,0.689488 -0.1674,1.16457 -0.27728,1.44619 -0.10988,0.281619 -0.27783,0.370026 -0.78301,0.435182 -0.50518,0.06515 -1.34772,0.107014 -2.284077,-0.06088 -0.936352,-0.167891 -1.966521,-0.545649 -3.046416,-1.244743 -1.079894,-0.699095 -2.209408,-1.719611 -3.219558,-2.855769 -1.01015,-1.136159 -1.900818,-2.387943 -2.4167,-3.620529 -0.515883,-1.232587 -0.656779,-2.445891 -0.603364,-3.543723 0.05342,-1.097831 0.301215,-2.080026 0.655275,-2.780632 0.354059,-0.700606 0.814301,-1.119401 1.114702,-1.355195 0.3004,-0.235793 0.440801,-0.28853 0.510932,-0.314873 0.07013,-0.02634 0.07014,-0.02634 0.201121,-0.10557 z"
         id="path453"
         inkscape:path-effect="#path-effect455"
         inkscape:original-d="m 93.009104,37.912272 c 0.262152,-0.15814 0.524039,-0.31655 0.785659,-0.475229 0.133843,-0.0084 0.267415,-0.01701 0.400723,-0.02593 0.663223,0.260869 1.326152,0.521459 1.988833,0.781786 1.857309,0.754987 3.714289,1.509681 5.571041,2.264128 1.61858,0.740567 3.23683,1.480831 4.85486,2.220858 0.43207,0.282327 0.86386,0.564377 1.2954,0.846164 0.006,0.13322 0.0114,0.26617 0.0167,0.398857 -0.31287,0.16717 -0.626,0.33406 -0.9394,0.500687 -0.65908,0.691207 -1.3184,1.382114 -1.978,2.072781 -0.41401,0.946904 -0.82826,1.893498 -1.24279,2.839852 -0.17881,0.904117 -0.35787,1.807931 -0.53721,2.711495 -0.0517,0.475377 -0.10357,0.950464 -0.15575,1.425301 -0.1677,0.0887 -0.33565,0.1771 -0.50387,0.26524 -0.8423,0.0421 -1.68484,0.084 -2.52767,0.12558 -1.029942,-0.37751 -2.060112,-0.755267 -3.090564,-1.133294 -1.129295,-1.020294 -2.258811,-2.040808 -3.388611,-3.061612 -0.890437,-1.251564 -1.781104,-2.503348 -2.672051,-3.755419 -0.140637,-1.213094 -0.281533,-2.426398 -0.422696,-3.639989 0.248073,-0.981967 0.495874,-1.964161 0.743413,-2.946635 0.460523,-0.418537 0.920763,-0.837334 1.380747,-1.256401 0.140676,-0.0525 0.281083,-0.10522 0.421227,-0.15822 z" />
      <path
         style="fill:none;stroke:#ffffff;stroke-width:1;stroke-linecap:butt;stroke-linejoin:miter;stroke-miterlimit:4;stroke-dasharray:none;stroke-opacity:1"
         d="m 102.81509,36.506353 c -0.0161,-0.0039 -0.0485,-0.01176 -0.52621,-0.06713 -0.47773,-0.05537 -1.40071,-0.158199 -2.357779,-0.171442 -0.957065,-0.01324 -1.948115,0.06315 -2.809717,0.202114 -0.861602,0.138964 -1.593654,0.340521 -1.986614,0.496796 -0.392959,0.156274 -0.446578,0.267097 -0.357187,0.408568 0.08939,0.141471 0.321431,0.313469 1.363064,0.778695 1.041632,0.465227 2.892756,1.223735 4.472513,1.889239 1.57975,0.665503 2.88804,1.237957 4.02204,1.760129 1.13399,0.522172 2.09362,0.994013 2.76325,1.27342 0.66962,0.279407 1.04921,0.366451 1.52482,0.322466 0.47561,-0.04399 1.04734,-0.218874 1.67976,-0.34555 0.63242,-0.126676 1.32543,-0.205157 2.39406,-0.196519 1.06863,0.0086 2.51277,0.104349 3.71282,0.303786 1.20005,0.199437 2.15592,0.502507 2.66718,0.626841 0.51126,0.124335 0.57815,0.07008 0.0619,-0.245075 -0.51623,-0.315159 -1.61583,-0.891378 -2.89297,-1.531416 -1.27714,-0.640038 -2.73175,-1.343843 -4.23526,-2.012978 -1.5035,-0.669134 -3.0558,-1.303538 -4.38547,-1.805352 -1.32967,-0.501813 -2.43662,-0.870984 -3.24847,-1.129319 -0.81186,-0.258336 -1.32858,-0.405808 -1.58711,-0.47959 -0.25852,-0.07378 -0.25856,-0.07378 -0.27464,-0.07768 z"
         id="path457"
         inkscape:path-effect="#path-effect459"
         inkscape:original-d="m 102.83117,36.510252 c -0.0322,-0.0076 -0.0646,-0.01548 -0.0973,-0.0236 -0.92275,-0.102568 -1.84573,-0.205396 -2.768992,-0.308491 -0.99082,0.07666 -1.98187,0.153054 -2.973194,0.229183 -0.731816,0.201829 -1.463868,0.403386 -2.196197,0.604681 -0.05336,0.111093 -0.106977,0.221917 -0.160862,0.332478 0.232318,0.17227 0.464357,0.344269 0.69614,0.516009 1.851459,0.758804 3.702583,1.517311 5.553475,2.275568 1.30861,0.572747 2.61691,1.145191 3.92497,1.717398 0.95993,0.472127 1.91956,0.943967 2.87895,1.415554 0.37987,0.0873 0.75946,0.174357 1.1388,0.261137 0.57202,-0.174627 1.14375,-0.349517 1.71523,-0.524677 0.6933,-0.0782 1.3863,-0.1567 2.07905,-0.235447 1.44446,0.096 2.8886,0.191687 4.33251,0.287137 0.95616,0.30335 1.91203,0.606417 2.86765,0.909224 0.0672,-0.054 0.13407,-0.108267 0.20071,-0.162797 -1.09938,-0.575977 -2.19898,-1.152194 -3.29886,-1.728691 -1.45441,-0.703567 -2.90902,-1.407371 -4.36392,-2.111458 -1.5521,-0.634167 -3.10441,-1.268564 -4.65701,-1.903248 -1.10673,-0.36892 -2.21368,-0.73809 -3.32091,-1.107533 -0.51648,-0.147214 -1.0332,-0.294688 -1.5502,-0.442426 z" />
      <path
         style="fill:none;stroke:#ffffff;stroke-width:1;stroke-linecap:butt;stroke-linejoin:miter;stroke-miterlimit:4;stroke-dasharray:none;stroke-opacity:1"
         d="m 90.727007,77.093209 c -0.0069,-0.03553 -0.02082,-0.106999 0.0127,-0.337119 0.03352,-0.230121 0.114554,-0.618838 0.07984,-1.224334 -0.03471,-0.605496 -0.185256,-1.427823 -0.394045,-2.258484 -0.20879,-0.830662 -0.475854,-1.669619 -0.75937,-2.415554 -0.283515,-0.745934 -0.583507,-1.398801 -0.753487,-1.776109 -0.16998,-0.377308 -0.209917,-0.479036 -0.254651,-0.495775 -0.04473,-0.01674 -0.09407,0.05175 -0.553555,0.755783 -0.459483,0.704035 -1.329062,2.043537 -2.00883,3.160988 -0.679767,1.117451 -1.169682,2.012767 -1.623473,2.848113 -0.45379,0.835345 -0.871431,1.610671 -1.050869,2.188515 -0.179438,0.577845 -0.120762,0.957982 0.07694,1.37884 0.197705,0.420859 0.534252,0.882415 0.954962,1.462968 0.420709,0.580552 0.925565,1.280075 1.29747,1.740324 0.371905,0.46025 0.610789,0.681261 0.934377,0.785754 0.323588,0.104494 0.731876,0.09273 1.085576,-0.165799 0.3537,-0.258526 0.653101,-0.763882 1.017687,-1.490484 0.364586,-0.726602 0.794341,-1.674445 1.129471,-2.398331 0.33513,-0.723885 0.575618,-1.223772 0.695893,-1.473778 0.120274,-0.250007 0.120273,-0.249987 0.113359,-0.285518 z"
         id="path461"
         inkscape:path-effect="#path-effect463"
         inkscape:original-d="m 90.733921,77.12874 c -0.01363,-0.0711 -0.02753,-0.14257 -0.04169,-0.21424 0.0813,-0.388467 0.162335,-0.777184 0.243107,-1.166174 -0.150288,-0.822104 -0.300834,-1.644431 -0.451649,-2.467045 -0.266808,-0.838724 -0.533873,-1.677681 -0.801208,-2.516915 -0.299741,-0.652637 -0.599734,-1.305504 -0.899999,-1.958651 -0.03968,-0.101467 -0.07961,-0.203197 -0.119817,-0.305197 -0.04909,0.0688 -0.09844,0.13728 -0.148055,0.20552 -0.869347,1.339811 -1.738924,2.679315 -2.608781,4.018576 -0.48967,0.895614 -0.979583,1.790931 -1.469771,2.685995 -0.417394,0.775624 -0.835033,1.550951 -1.252948,2.326028 0.05894,0.380407 0.117618,0.760544 0.176028,1.140421 0.336825,0.46184 0.673372,0.923397 1.00966,1.384694 0.505137,0.699804 1.009986,1.399331 1.514581,2.098588 0.239159,0.221287 0.478044,0.442297 0.716669,0.663047 0.408569,-0.0115 0.816856,-0.0233 1.224886,-0.0353 0.299677,-0.505107 0.599077,-1.010464 0.898218,-1.516094 0.430038,-0.947614 0.859792,-1.895458 1.289291,-2.843582 0.240762,-0.499637 0.48125,-0.999524 0.721479,-1.499691 z" />
      <path
         style="fill:none;stroke:#ffffff;stroke-width:1.04165;stroke-linecap:butt;stroke-linejoin:miter;stroke-miterlimit:4;stroke-dasharray:2.08331, 1.04165;stroke-dashoffset:0;stroke-opacity:0.964189"
         d="m 88.83482,67.710352 c 0.672403,1.156778 1.181929,2.253872 1.643,3.444565 0.46107,1.190693 0.873712,2.474924 1.228596,3.88338 0.354884,1.408457 0.652035,2.941067 0.671889,4.523334 0.01986,1.582266 -0.237484,3.214177 -0.92456,4.283853 -0.687077,1.069677 -1.803999,1.577354 -3.432815,1.463329 -1.628815,-0.114025 -3.769626,-0.849899 -6.062088,-2.250783 -2.292461,-1.400885 -4.736392,-3.466816 -6.894065,-5.985409 -2.157674,-2.518592 -4.02887,-5.489756 -5.559901,-8.743874 -1.531031,-3.254117 -2.721725,-6.791006 -3.173662,-9.569003 -0.451937,-2.777997 -0.164958,-4.796858 0.412898,-6.140312 0.577856,-1.343454 1.446484,-2.011177 2.612684,-2.115807 1.166201,-0.10463 2.629612,0.35369 4.245469,1.254162 1.615858,0.900473 3.384072,2.2429 5.133272,3.804765 1.749201,1.561866 3.479323,3.343032 4.768846,4.805966 1.289524,1.462934 2.13843,2.607532 2.980565,3.78808 0.842136,1.180547 1.677469,2.396977 2.349872,3.553754 z"
         id="path32405"
         inkscape:path-effect="#path-effect32407"
         inkscape:original-d="m 88.997542,67.769701 c 0.509799,1.097374 1.019326,2.194468 1.528582,3.291292 0.412931,1.284564 0.825572,2.568795 1.237951,3.852769 0.297435,1.532951 0.594585,3.065562 0.891471,4.597923 -0.257077,1.632261 -0.514415,3.264172 -0.772032,4.895833 -1.116694,0.507977 -2.233616,1.015654 -3.350831,1.523061 -2.140628,-0.735617 -4.281439,-1.471491 -6.422567,-2.207668 -2.443759,-2.065738 -4.887692,-4.131666 -7.331946,-6.197924 -1.870997,-2.971002 -3.742192,-5.942167 -5.613694,-8.913659 -1.190471,-3.536752 -2.381165,-7.073641 -3.572156,-10.61088 0.287262,-2.018658 0.574241,-4.037519 0.860954,-6.056697 0.868931,-0.667464 1.737556,-1.335191 2.605924,-2.003198 1.463744,0.458617 2.927156,0.916934 4.39033,1.374991 1.768558,1.342764 3.536777,2.685185 5.304759,4.027369 1.730458,1.781498 3.460575,3.562669 5.190454,5.34359 0.849213,1.144914 1.698116,2.289515 2.546766,3.433859 0.835634,1.216744 1.670961,2.433178 2.506035,3.649339 z" />
      <path
         style="fill:#ffffff;stroke:#ffffff;stroke-width:2.2567"
         d="m 532.40199,473.947 c -1.55511,-3.07188 -2.17883,-5.8021 -3.65132,-15.98285 -2.95662,-20.4421 -3.35431,-30.15279 -1.23487,-30.15279 1.23699,0 10.11977,6.80161 11.85655,9.07865 2.2919,3.00483 4.64675,8.72247 4.99936,12.13857 0.41236,3.99504 -1.19392,11.61907 -3.39947,16.13522 -0.97157,1.98943 -3.10908,5.15139 -4.75001,7.02658 l -2.98352,3.40942 z"
         id="path2790"
         transform="matrix(0.26458333,0,0,0.26458333,1.2136341,-23.309575)" />
    </g>
  </g>
</svg>
