id_apotek,id_produk,id_transaksi_pembelian,jumlah
A1,PO1,TP1,2
A2,PO2,TP2,2
A3,PO3,TP3,2
A4,PO4,TP4,2
A5,PO5,TP5,2
A1,PO6,TP6,2
A2,PO7,TP7,2
A3,PO8,TP8,2
A4,PO9,TP9,2
A5,PO10,TP10,2
A1,PO16,TP11,1
A2,PO17,TP12,1
A3,PO18,TP13,1
A4,PO19,TP14,1
A5,PO20,TP15,1
A1,PO21,TP16,1
A2,PO22,TP17,1
A3,PO23,TP18,1
A4,PO24,TP19,1
A5,PO25,TP20,1