"id_balai","alamat_balai","nama_balai","jenis_balai","telepon_balai"
"BP1","2797 Stoughton Lane","Dynabox Clinic","Klinik","1069819853"
"BP2","19446 Kings Pass","Cogilith Clinic","Klinik","7207718875"
"BP3","245 Menomonie Road","Thoughtworks Hospital","Rumah Sakit","8106089153"
"BP4","97 Hooker Way","Rhybox Hospital","Rumah Sakit","1422057002"
"BP5","498 Johnson Way","Kwimbee Hospital","Rumah Sakit","7681531823"
