id_obat,id_produk,id_merk_obat,netto,dosis,aturan_pakai,kontraindikasi,bentuk_kesediaan
OB1,PO16,MO1,100 ml,Dewasa dan anak > 12 th: 3 kali sehari 3 sendok takar (15ml),Berikan sesudah makan,"untuk meringankan gejala flu, sakit kepala, pilex dan hidung tersumbat disertai batuk.",Botol
OB2,PO17,MO2,580 mg,Dewasa : 1 kaplet 3 kali sehari.,"Hati-hati penggunaan pada penderita dengan gangguan fungsi hati dan ginjal, glaukoma, hipertrofi prostat, hipertiroid dan retensi urin. Tidak dianjurkan penggunaan pada anak usia dibawah 2 tahun, wanita hamil dan menyusui, kecuali atas petunjuk dokter.","Meredakan gejala flu seperti demam, sakit kepala, hidung tersumbat dan bersin-bersin yang disertai batuk berdahak.",Strip
OB3,PO18,MO3,600 mg,"3 kali sehari, Anak-anak 6-12 tahun: 1/2 tab, Dewasa dan anak >12 tahun: 1 tab",sesudah makan,"Gejala flu seperti demam, sakit kepala, hidung tersumbat yang disertai batuk tidak berdahak (batuk kering)",Strip
OB4,PO19,MO4,12 ml,"Dewasa dan anak > 12 th: 1/2-1 mL/hari, 6-11 th: 1/2-1 mL/hari, 2-5 th: 1/4 mL/hari (semua dosis diberikan 1 x sehari)","Pasien epilepsi, pasien dengan penurunan fungsi hati dan ginjal, usia tua, hamil, laktasi. Sebaiknya tidak digunakan saat ingin mengemudi karena mempunyai efek sedasi","Rhinitis alergi musiman dan tahunan, urtikaria kronik idiopatik dan penyakit alergi kulit lainnya",Botol
OB5,PO20,MO5,50 mg,"> 12 tahun: 1 tablet sehari (maksimal 8 tablet), anak 8-12 tahun: 1/2 tablet sehari (maksimal 3 tablet)","30 menit sebelum bepergian, jika perlu dapat diulang tiap 4 jam","mabuk, muntah dalam perjalanan yang di derita jika mempergunakan kendaraan bermotor kapal, kereta api atau pesawat udara",Strip
OB6,PO21,MO6,150 ml,3-4 x sehari 5-10 ml,1 atau 2 jam sebelum/sesudah makan,"Refluks esofagitis, Rasa panas pada ulu hati, rasa tidak enak pada perut, gastritis, esofagitis peptikum, & hernia hiatus, kembung (gas), pemeriksaan endoskopik.",Botol
OB7,PO22,MO7,20 mg,"Dewasa : 1 kaplet 3-4xsehari, anak-anak 6-12 tahun : 1/2 kaplet 3-4xsehari, anak-anak 2-6 tahun : 1/4 kaplet 3-4xsehari",Dapat diberikan sesudah makan,"Meredakan gejala alergi rhinitis, alergi konjungtivitas, urticaria (gatal-gatal, biduran), gatal-gatal karena gigitan serangga, alergi eksema & alergi dermatitis.",Strip
OB8,PO23,MO8,550 mg,Dewasa 1 kaplet 3-4 x perhari.,Sebaiknya diberikan bersama makanan : Berikan segera sesudah makan.,"Meredakan nyeri misalnya pada sakit gigi, sakit kepala, nyeri otot, dismenore primer.",Strip
OB9,PO24,MO9,650 mg,dewasa 3 kali sehari 2 tablet. anak-anak 1/2 dosis dewasa (3 kali sehari 1 tablet).,dapat diminum langsung atau dikunyah terlebih dahulu,"meredakan sariawan, panas dalam, tenggorokan kering, bau mulut, membantu melancarkan BAB",Strip
OB10,PO25,MO10,5 mg,5mg 1 x perhari maksimal 10mg/hari,sesudah makan,untuk hipertensi dan angina,Tablet
OB11,PO26,MO11,1 gr,"Dewasa 3 kali sehari 1 sachet, Anak usia 1-12 tahun 3 kali sehari 1 sachet, Anak usia di bawah 1 tahun 2 kali sehari 1 sachet, atau sesuai anjuran dokter.","Lacto B sach dapat dikonsumsi langsung dengan dilarutkan dalam air putih, atau diberikan bersama makanan anak dan susu formula. Hindari mencampurnya dengan minuman bersoda. Konsumsi segera setelah sachet dibuka dan dicampurkan. Bila Lacto-B lupa diberikan, jangan menggandakan dosis di jadwal konsumsi berikutnya.","Untuk mengatasi diare dan mencegah intoleransi laktosa pada masalah pencernaan lainnya. Selain itu, Lacto B sach juga bisa digunakan untuk mengatasi infeksi vagina dan infeksi saluran kencing.",Pcs
OB12,PO27,MO12,60 ml,">12 th: 1 x sehari 1-2 sendok makan, 6-12 th: 1 x sehari 0.5-1 sendok makan",malam hari menjelang tidur,"pelicin jalannya feses (kotoran), penambahan volume feses (kotoran) secara sistematis sehingga mudah dikeluarkan",Botol
OB13,PO28,MO13,300 mg,3 kali sehari 2 kapsul,sesudah makan,membantu meringankan gejala wasir,Strip
OB14,PO29,MO14,100 mg,1 kapsul sehari.,sekali sehari,Obat fitofarmaka yang dapat digunakan untuk diabetes,Strip
OB15,PO30,MO15,10 ml,digunakan malam hari selama tidur,"callusol dituangkan ke kapas/kasa, dtempelkan di bagian yang luka selama semalam","mata ikan, kapalan, kutil, kulit mengeras",Botol
