// Jest Snapshot v1, https://goo.gl/fbAQLP

exports[`renders correctly 1`] = `
<div
  className="pageHolder"
>
  <div
    className="header"
  >
    <h1>
      <span>
        show-score
      </span>
      <i>
        ℠
      </i>
       assessment
    </h1>
  </div>
  <div
    className="gridHolder"
  >
    <div
      className="grid"
    >
      <table>
        <tbody>
          <tr>
            <td>
              <div
                className=""
                onClick={[Function]}
              />
            </td>
            <td>
              <div
                className=""
                onClick={[Function]}
              />
            </td>
            <td>
              <div
                className=""
                onClick={[Function]}
              />
            </td>
            <td>
              <div
                className=""
                onClick={[Function]}
              />
            </td>
            <td>
              <div
                className=""
                onClick={[Function]}
              />
            </td>
            <td>
              <div
                className=""
                onClick={[Function]}
              />
            </td>
            <td>
              <div
                className=""
                onClick={[Function]}
              />
            </td>
            <td>
              <div
                className=""
                onClick={[Function]}
              />
            </td>
            <td>
              <div
                className=""
                onClick={[Function]}
              />
            </td>
            <td>
              <div
                className=""
                onClick={[Function]}
              />
            </td>
            <td>
              <div
                className=""
                onClick={[Function]}
              />
            </td>
            <td>
              <div
                className=""
                onClick={[Function]}
              />
            </td>
          </tr>
          <tr>
            <td>
              <div
                className=""
                onClick={[Function]}
              />
            </td>
            <td>
              <div
                className=""
                onClick={[Function]}
              />
            </td>
            <td>
              <div
                className=""
                onClick={[Function]}
              />
            </td>
            <td>
              <div
                className=""
                onClick={[Function]}
              />
            </td>
            <td>
              <div
                className=""
                onClick={[Function]}
              />
            </td>
            <td>
              <div
                className=""
                onClick={[Function]}
              />
            </td>
            <td>
              <div
                className=""
                onClick={[Function]}
              />
            </td>
            <td>
              <div
                className=""
                onClick={[Function]}
              />
            </td>
            <td>
              <div
                className=""
                onClick={[Function]}
              />
            </td>
            <td>
              <div
                className=""
                onClick={[Function]}
              />
            </td>
            <td>
              <div
                className=""
                onClick={[Function]}
              />
            </td>
            <td>
              <div
                className=""
                onClick={[Function]}
              />
            </td>
          </tr>
          <tr>
            <td>
              <div
                className=""
                onClick={[Function]}
              />
            </td>
            <td>
              <div
                className=""
                onClick={[Function]}
              />
            </td>
            <td>
              <div
                className=""
                onClick={[Function]}
              />
            </td>
            <td>
              <div
                className=""
                onClick={[Function]}
              />
            </td>
            <td>
              <div
                className=""
                onClick={[Function]}
              />
            </td>
            <td>
              <div
                className=""
                onClick={[Function]}
              />
            </td>
            <td>
              <div
                className=""
                onClick={[Function]}
              />
            </td>
            <td>
              <div
                className=""
                onClick={[Function]}
              />
            </td>
            <td>
              <div
                className=""
                onClick={[Function]}
              />
            </td>
            <td>
              <div
                className=""
                onClick={[Function]}
              />
            </td>
            <td>
              <div
                className=""
                onClick={[Function]}
              />
            </td>
            <td>
              <div
                className=""
                onClick={[Function]}
              />
            </td>
          </tr>
          <tr>
            <td>
              <div
                className=""
                onClick={[Function]}
              />
            </td>
            <td>
              <div
                className=""
                onClick={[Function]}
              />
            </td>
            <td>
              <div
                className=""
                onClick={[Function]}
              />
            </td>
            <td>
              <div
                className=""
                onClick={[Function]}
              />
            </td>
            <td>
              <div
                className=""
                onClick={[Function]}
              />
            </td>
            <td>
              <div
                className=""
                onClick={[Function]}
              />
            </td>
            <td>
              <div
                className=""
                onClick={[Function]}
              />
            </td>
            <td>
              <div
                className=""
                onClick={[Function]}
              />
            </td>
            <td>
              <div
                className=""
                onClick={[Function]}
              />
            </td>
            <td>
              <div
                className=""
                onClick={[Function]}
              />
            </td>
            <td>
              <div
                className=""
                onClick={[Function]}
              />
            </td>
            <td>
              <div
                className=""
                onClick={[Function]}
              />
            </td>
          </tr>
          <tr>
            <td>
              <div
                className=""
                onClick={[Function]}
              />
            </td>
            <td>
              <div
                className=""
                onClick={[Function]}
              />
            </td>
            <td>
              <div
                className=""
                onClick={[Function]}
              />
            </td>
            <td>
              <div
                className=""
                onClick={[Function]}
              />
            </td>
            <td>
              <div
                className=""
                onClick={[Function]}
              />
            </td>
            <td>
              <div
                className=""
                onClick={[Function]}
              />
            </td>
            <td>
              <div
                className=""
                onClick={[Function]}
              />
            </td>
            <td>
              <div
                className=""
                onClick={[Function]}
              />
            </td>
            <td>
              <div
                className=""
                onClick={[Function]}
              />
            </td>
            <td>
              <div
                className=""
                onClick={[Function]}
              />
            </td>
            <td>
              <div
                className=""
                onClick={[Function]}
              />
            </td>
            <td>
              <div
                className=""
                onClick={[Function]}
              />
            </td>
          </tr>
          <tr>
            <td>
              <div
                className=""
                onClick={[Function]}
              />
            </td>
            <td>
              <div
                className=""
                onClick={[Function]}
              />
            </td>
            <td>
              <div
                className=""
                onClick={[Function]}
              />
            </td>
            <td>
              <div
                className=""
                onClick={[Function]}
              />
            </td>
            <td>
              <div
                className=""
                onClick={[Function]}
              />
            </td>
            <td>
              <div
                className=""
                onClick={[Function]}
              />
            </td>
            <td>
              <div
                className=""
                onClick={[Function]}
              />
            </td>
            <td>
              <div
                className=""
                onClick={[Function]}
              />
            </td>
            <td>
              <div
                className=""
                onClick={[Function]}
              />
            </td>
            <td>
              <div
                className=""
                onClick={[Function]}
              />
            </td>
            <td>
              <div
                className=""
                onClick={[Function]}
              />
            </td>
            <td>
              <div
                className=""
                onClick={[Function]}
              />
            </td>
          </tr>
        </tbody>
      </table>
    </div>
    <div
      className="controls"
    >
      <button
        onClick={[Function]}
        type="button"
      >
        reset
      </button>
      <button
        className="active"
        onClick={[Function]}
        type="button"
      >
        run
      </button>
    </div>
  </div>
</div>
`;
