"nbr_malades";"place_name";"duree_moyenne"
22;Place nr 84;"10:27:38.181818"
26;Place nr 38;"13:38:09.230769"
23;Place nr 46;"11:22:28.695652"
21;Rik's Local grocery shop;"11:01:14.285714"
20;Place nr 12;"10:45:09"
22;Place nr 32;"11:10:46.363636"
30;Place nr 18;"11:56:38"
20;Place nr 76;"11:44:33"
34;Place nr 79;"11:52:22.941176"
29;Place nr 5;"12:26:45.517241"
22;Place nr 59;"14:55:49.090909"
25;Place nr 27;"13:27:36"
21;Place nr 95;"12:01:02.857143"
20;Place nr 37;"11:33:24"
19;Place nr 85;"11:29:15.789474"
38;Place nr 89;"14:25:36.315789"
23;Place nr 66;"09:29:44.347826"
25;Place nr 48;"12:22:00"
16;Place nr 67;"10:06:41.25"
22;Place nr 61;"13:49:08.181818"
20;Place nr 6;"12:08:03"
22;Place nr 77;"10:13:08.181818"
24;Place nr 41;"11:43:30"
28;Place nr 52;"10:40:45"
22;Place nr 81;"13:26:24.545455"
23;Place nr 50;"14:10:46.956522"
31;Place nr 51;"11:45:30.967742"
22;Place nr 92;"09:16:57.272727"
23;Place nr 98;"09:24:05.217391"
29;Place nr 47;"13:11:00"
34;Place nr 56;"12:33:08.823529"
19;Place nr 26;"13:09:12.631579"
29;Place nr 21;"10:10:14.482759"
17;Place nr 3;"12:02:38.823529"
30;Place nr 35;"11:47:02"
32;Place nr 17;"12:30:28.125"
24;Place nr 15;"09:25:17.5"
27;Place nr 33;"11:23:57.777778"
30;Place nr 83;"11:26:50"
25;Place nr 88;"10:32:14.4"
29;Place nr 73;"12:10:00"
35;Place nr 54;"12:43:25.714286"
20;Place nr 55;"12:10:30"
25;Place nr 16;"12:26:57.6"
25;Place nr 70;"13:15:40.8"
19;Place nr 69;"11:41:31.578947"
28;Place nr 8;"13:03:45"
18;Place nr 49;"11:40:40"
29;Place nr 63;"11:32:10.344828"
30;Place nr 2;"12:12:04"
33;Place nr 19;"12:20:38.181818"
28;Place nr 24;"11:37:47.142857"
30;Place nr 99;"12:09:38"
23;Place nr 71;"12:37:26.086957"
21;Place nr 10;"09:20:28.571429"
16;Place nr 91;"14:09:37.5"
30;Place nr 36;"12:08:52"
22;Place nr 97;"13:22:57.272727"
31;Place nr 64;"12:40:44.516129"
23;Place nr 87;"12:05:31.304348"
28;Place nr 100;"11:26:40.714286"
27;Place nr 90;"09:51:06.666667"
25;Place nr 20;"08:36:14.4"
21;Place nr 29;"11:29:37.142857"
22;Place nr 42;"13:41:49.090909"
32;Place nr 74;"13:04:35.625"
33;Place nr 58;"12:06:20"
25;Place nr 25;"09:58:57.6"
26;Place nr 40;"12:47:32.307692"
18;Place nr 86;"12:24:10"
24;Place nr 9;"13:22:50"
20;Place nr 44;"14:07:33"
29;Place nr 78;"12:56:39.310345"
35;Place nr 72;"12:27:18.857143"
26;Place nr 80;"13:52:13.846154"
22;Place nr 75;"10:15:16.363636"
24;Place nr 1;"14:33:37.5"
32;Place nr 13;"11:50:00"
23;Place nr 39;"10:32:05.217391"
36;Place nr 68;"10:30:58.333333"
16;Place nr 43;"11:28:45"
22;Place nr 82;"11:14:54.545455"
25;Place nr 11;"11:55:31.2"
24;Place nr 93;"11:30:02.5"
28;Place nr 62;"13:07:40.714286"
37;Place nr 28;"11:13:04.864865"
33;Place nr 30;"12:13:47.272727"
21;Place nr 23;"11:41:40"
18;Place nr 94;"12:00:00"
24;Place nr 34;"11:28:40"
31;Place nr 22;"11:34:03.870968"
24;Place nr 65;"10:41:35"
31;Place nr 60;"11:45:32.903226"
25;Place nr 14;"12:35:36"
26;Place nr 4;"12:01:06.923077"
25;Place nr 96;"11:09:33.6"
19;Place nr 7;"11:56:53.68421"
24;Place nr 45;"11:44:20"
31;Place nr 53;"12:32:54.193548"
32;Place nr 31;"10:30:39.375"
30;Place nr 57;"09:38:56"
