ID_SEJOUR;duree_reveil_tot;duree_rea_tot;sexe;nb_medic
1002;0;0;M;
1004;0;22:28:00;M;18,0
1006;0:46:00;0;F;8,0
1007;3:03:00;0;F;12,0
1008;1:03:00;0;F;4,0
1010;4:24:00;0;F;10,0
1011;1:30:00;0;M;4,0
1014;9:42:00;0;F;40,0
1015;2:45:00;0;F;25,0
1016;7:38:00;0;M;29,0
1018;0;22:54:00;F;28,0
1019;0;0;M;5,0
1020;0;0;F;
1021;0;0;M;
1023;1:30:00;0;F;14,0
1024;1:36:00;0;M;
1025;1:26:00;0;F;9,0
1026;1:09:00;0;F;3,0
1027;1:10:00;0;M;14,0
1028;3:18:00;0;F;23,0
1029;1:41:00;0;F;8,0
1030;1:55:00;0;M;7,0
1033;0;3 days, 3:45:00;M;49,0
1034;1:49:00;0;F;15,0
1035;0;0;F;
1037;0;0;F;4,0
1038;1:51:00;0;F;16,0
1039;1:32:00;0;F;4,0
1040;1:11:00;0;F;7,0
1041;2:00:00;0;M;10,0
1042;1:08:00;0;M;6,0
1043;1:10:00;0;M;6,0
1045;0;0;M;
1047;0;0;F;
1050;0;0;M;
1051;1:18:00;0;F;7,0
1052;3:18:00;0;F;8,0
1053;0;0;F;
1055;3:44:00;0;F;10,0
1057;10:29:00;0;M;6,0
1058;4:37:00;0;F;4,0
1061;2:58:00;0;M;7,0
1063;2:27:00;0;F;8,0
1064;3:26:00;0;M;12,0
1066;0;1 day, 2:58:00;F;36,0
1067;0;5 days, 21:01:00;F;80,0
1068;2:37:00;0;F;17,0
1069;3:22:00;0;F;17,0
1070;0:56:00;0;F;4,0
1072;0;0;F;11,0
1073;3:23:00;0;M;10,0
1074;1:15:00;0;F;6,0
1077;2:20:00;0;F;
1078;0;0;M;17,0
1079;2:15:00;0;F;6,0
1081;1:19:00;0;F;9,0
1082;0:53:00;0;M;3,0
1083;0;0;F;
1087;1:15:00;0;M;2,0
1088;0:52:00;0;F;4,0
1089;1:29:00;0;M;6,0
1090;3:13:00;0;F;17,0
1093;1:07:00;0;M;3,0
1094;1:26:00;0;M;6,0
1096;1:10:00;0;M;9,0
1101;1:59:00;0;M;14,0
1102;5:29:00;0;F;15,0
1104;4:01:00;12 days, 20:37:00;M;160,0
1105;0:47:00;0;F;1,0
1106;2:12:00;0;F;9,0
1107;2:33:00;19:05:00;F;26,0
1108;0;0;F;13,0
1109;5:02:00;0;F;9,0
1110;1:39:00;0;F;11,0
1112;0:43:00;0;M;
1113;1:25:00;0;M;1,0
1115;1:46:00;0;M;10,0
1116;1:16:00;0;M;1,0
1117;1:56:00;0;M;13,0
1118;1:17:00;0;F;6,0
1119;0;0;F;
1120;1:41:00;0;M;9,0
1121;0;10 days, 13:27:00;M;78,0
1122;1:12:00;0;M;5,0
1123;0;0;F;15,0
1124;1:46:00;0;F;8,0
1125;1:12:00;0;M;3,0
1126;1:58:00;0;M;8,0
1128;0;0;F;
1129;1:20:00;0;F;5,0
1130;2:00:00;0;F;20,0
1131;2:34:00;0;F;18,0
1134;0;0;M;
1135;1:57:00;0;F;11,0
1138;1:08:00;0;M;5,0
1139;0:52:00;0;M;4,0
1140;0;0;F;12,0
1141;2:14:00;0;M;
1143;15:25:00;0;M;34,0
1144;1:36:00;0;F;17,0
1146;1:04:00;0;M;3,0
1148;2:49:00;0;M;15,0
1149;0:59:00;0;F;2,0
1150;2:23:00;0;M;3,0
1151;0;12 days, 15:27:00;M;46,0
1152;2:06:00;0;M;17,0
1153;1:05:00;0;F;6,0
1155;1:41:00;0;M;13,0
1156;1:25:00;0;F;8,0
1157;1:28:00;0;M;6,0
1158;1:16:00;0;F;14,0
1159;1:31:00;0;M;4,0
1160;0;13 days, 3:08:00;M;129,0
1162;1:00:00;0;M;5,0
1163;1:08:00;0;F;3,0
1164;4:34:00;0;M;4,0
1165;0;0;M;
1167;2:21:00;0;F;8,0
1168;1:34:00;0;F;10,0
1170;1:31:00;0;F;6,0
1171;5:31:00;0;F;27,0
1172;1:15:00;0;F;8,0
1173;2:12:00;0;F;22,0
1174;1:56:00;0;M;5,0
1176;1:40:00;0;M;10,0
1179;1:15:00;0;F;8,0
1182;2:04:00;0;M;5,0
1183;4:42:00;0;M;19,0
1184;1:22:00;0;M;12,0
1185;1:32:00;0;M;8,0
1186;1:26:00;0;M;13,0
1187;1:03:00;0;M;9,0
1188;5:21:00;0;M;9,0
1189;1:28:00;0;M;3,0
1190;3:25:00;0;M;25,0
1191;3:09:00;0;F;20,0
1192;0;0;F;
1193;2:57:00;0;F;24,0
1194;0;0;F;4,0
1195;0;18 days, 3:12:00;M;121,0
1196;0;0;F;
1197;2:33:00;0;F;9,0
1198;1:19:00;0;M;6,0
1200;0;0;M;
1202;1:03:00;0;F;2,0
1203;0;0;F;
1205;0:56:00;0;M;13,0
1206;1:34:00;0;F;8,0
1207;1:23:00;0;F;2,0
1208;1:31:00;0;M;12,0
1209;1:54:00;0;M;15,0
1210;0;0;F;
1211;0;2 days, 10:25:00;F;50,0
1212;1:25:00;0;M;16,0
1213;1:31:00;0;F;8,0
1214;1:56:00;0;F;15,0
1217;1:57:00;0;M;17,0
1219;1:14:00;0;F;
1222;2:12:00;0;F;14,0
1223;1:38:00;0;F;6,0
1224;1:24:00;0;F;15,0
1225;1:01:00;0;M;1,0
1227;2:35:00;0;M;13,0
1228;2:01:00;0;F;12,0
1229;2:14:00;0;F;1,0
1230;1:23:00;0;F;9,0
1232;1:13:00;0;F;9,0
1233;1:32:00;0;M;3,0
1234;2:49:00;0;M;13,0
1235;1:41:00;0;M;14,0
1237;1:54:00;0;F;3,0
1238;1:24:00;0;M;11,0
1239;2:59:00;0;F;8,0
1240;0;0;M;13,0
1242;2:36:00;0;M;2,0
1243;1:36:00;0;M;8,0
1244;1:29:00;0;F;2,0
1245;2:01:00;0;M;2,0
1246;1:46:00;0;M;12,0
1247;3:16:00;0;M;6,0
1248;2:02:00;0;M;10,0
1249;2:28:00;0;F;6,0
1250;1:16:00;0;M;20,0
1252;1:51:00;0;F;10,0
1253;1:55:00;0;F;10,0
1254;1:57:00;0;F;12,0
1255;0;12 days, 17:52:00;F;102,0
1256;3:26:00;0;F;19,0
1257;1:44:00;0;M;5,0
1258;5:59:00;0;F;14,0
1259;0;0;M;21,0
1260;1:35:00;0;F;5,0
1261;0;0;;
1262;7:24:00;0;F;14,0
1263;3:10:00;0;M;11,0
1265;1:35:00;0;M;4,0
1266;2:06:00;0;M;22,0
1267;4:00:00;0;F;13,0
1268;2:11:00;0;M;11,0
1269;1:47:00;0;M;9,0
1270;0;0;F;4,0
1271;10:51:00;0;M;9,0
1272;0;0;M;
1273;0;1 day, 14:39:00;F;39,0
1274;0;0;F;10,0
1276;1:50:00;0;F;15,0
1277;0;1 day, 23:03:00;M;43,0
1278;3:00:00;0;F;20,0
1280;1:46:00;0;M;5,0
1282;1:47:00;0;M;7,0
1283;1:59:00;0;F;12,0
1284;1:48:00;0;F;21,0
1285;2:24:00;0;M;16,0
1286;1:16:00;0;M;7,0
1287;1:45:00;0;M;7,0
1289;2:52:00;0;F;9,0
1290;1:21:00;0;M;13,0
1291;1:29:00;0;M;6,0
1292;1:38:00;0;F;18,0
1294;1:53:00;0;M;4,0
1295;1:53:00;0;M;3,0
1297;1:27:00;0;M;4,0
1298;0;0;F;
1299;1:13:00;0;M;6,0
1300;0;11 days, 21:51:00;M;42,0
1302;0;6 days, 4:18:00;M;85,0
1303;1:19:00;0;M;13,0
1304;3:07:00;0;M;13,0
1305;1:43:00;0;M;14,0
1306;0;0;M;
1309;1:13:00;0;F;4,0
1311;1:07:00;0;M;5,0
1313;1:41:00;0;M;8,0
1314;1:02:00;0;M;3,0
1315;3:43:00;0;F;14,0
1316;0;0;F;
1318;0;0;F;
1319;0;0;F;
1320;1:56:00;0;F;6,0
1321;1:00:00;0;F;
1322;0:52:00;0;F;4,0
1323;0;0;F;
1324;2:00:00;0;M;11,0
1326;0;1 day, 23:27:00;M;32,0
1328;0;0;F;
1329;0;0;M;14,0
1330;0:49:00;0;M;4,0
1331;1:25:00;0;F;9,0
1332;2:24:00;0;M;11,0
1334;0;0;M;
1335;2:04:00;0;F;15,0
1336;1:47:00;0;M;6,0
1337;2:34:00;0;M;7,0
1338;12:30:00;0;M;18,0
1339;1:13:00;0;M;6,0
1340;1:50:00;0;M;18,0
1341;2:27:00;23:48:00;M;22,0
1342;1:06:00;0;M;6,0
1343;4:27:00;0;F;2,0
1345;1:57:00;0;M;22,0
1346;1:20:00;0;F;7,0
1348;2:12:00;0;M;21,0
1349;1:27:00;0;M;1,0
1350;2:02:00;0;M;15,0
1351;2:01:00;0;M;14,0
1352;1:49:00;0;F;18,0
1353;4:03:00;0;F;14,0
1354;2:45:00;0;M;12,0
1355;2:05:00;0;F;12,0
1356;3:23:00;0;F;16,0
1360;1:27:00;0;M;7,0
1361;1:31:00;0;F;7,0
1362;1:05:00;0;F;3,0
1364;0;47 days, 11:35:00;M;335,0
1365;0;5 days, 6:55:00;F;79,0
1368;0;1 day, 5:38:00;M;22,0
1369;2:16:00;0;F;14,0
1370;1:40:00;0;M;8,0
1372;2:20:00;0;M;9,0
1373;1:44:00;0;F;13,0
1375;1:30:00;0;F;13,0
1377;1:14:00;0;F;10,0
1378;1:23:00;0;M;8,0
1379;3:20:00;0;M;11,0
1380;5:26:00;0;F;18,0
1381;1:24:00;0;M;11,0
1383;1:29:00;0;M;11,0
1384;1:41:00;0;F;5,0
1385;0;0;F;
1386;1:11:00;0;F;11,0
1387;1:24:00;0;M;7,0
1388;2:03:00;0;M;9,0
1389;2:25:00;0;F;17,0
1390;1:31:00;0;M;20,0
1391;3:08:00;0;M;11,0
1392;2:57:00;0;M;3,0
1393;2:20:00;0;M;14,0
1394;0;12 days, 2:32:00;F;112,0
1395;4:24:00;0;M;19,0
1396;2:19:00;0;M;16,0
1397;0;37 days, 7:10:00;F;228,0
1398;1:17:00;0;F;4,0
1399;1:33:00;0;M;6,0
1400;1:12:00;0;M;6,0
1401;1:43:00;0;M;11,0
1402;0;0;M;
1403;1:03:00;0;M;1,0
1404;0;6 days, 0:44:00;F;76,0
1405;1:34:00;0;M;18,0
1408;1:11:00;0;F;6,0
1410;1:51:00;0;M;2,0
1411;0:54:00;0;F;1,0
1412;1:32:00;0;F;2,0
1413;2:05:00;0;F;9,0
1414;2:46:00;0;M;7,0
1415;1:41:00;0;M;8,0
1416;0;5 days, 19:25:00;M;31,0
1418;9:00:00;0;M;11,0
1419;5:52:00;0;F;14,0
1420;0;15:06:00;F;8,0
1421;2:05:00;0;M;18,0
1422;2:29:00;0;M;24,0
1423;0:50:00;0;F;3,0
1424;0;0;M;
1425;10:52:00;0;F;6,0
1426;3:42:00;0;M;12,0
1427;0:45:00;0;F;1,0
1428;17:57:00;0;M;20,0
1430;1:21:00;0;F;10,0
1431;1:45:00;0;F;15,0
1432;1:09:00;0;M;6,0
1433;0;19:17:00;M;42,0
1434;2:04:00;0;F;20,0
1435;1:20:00;0;F;14,0
1439;0;1 day, 17:30:00;M;34,0
1440;1:28:00;0;M;7,0
1441;6:26:00;0;M;24,0
1442;1:43:00;0;F;4,0
1443;1:19:00;0;M;5,0
1444;0;0;M;21,0
1446;1:00:00;0;F;6,0
1447;1:24:00;0;F;5,0
1448;0;0;M;
1449;2:31:00;0;F;24,0
1450;0;0;F;
1451;1:55:00;0;M;14,0
1453;1:45:00;0;F;7,0
1454;1:51:00;0;F;11,0
1456;1:17:00;0;F;10,0
1457;1:22:00;0;F;17,0
1458;3:07:00;0;F;17,0
1459;2:08:00;0;F;17,0
1460;0;0;M;
1461;3:20:00;0;F;13,0
1462;2:36:00;0;F;17,0
1463;1:27:00;0;M;4,0
1464;1:19:00;0;F;1,0
1465;2:26:00;0;F;11,0
1466;0;0;M;9,0
1468;1:27:00;0;M;8,0
1469;0;0;F;
1471;0;0;M;
1473;0;0;F;7,0
1474;1:04:00;0;M;3,0
1475;1:46:00;0;F;5,0
1476;1:23:00;0;M;3,0
1477;1:10:00;0;M;5,0
1478;0;0;F;
1479;0;0;M;
1481;2:53:00;0;M;11,0
1482;1:36:00;0;M;20,0
1484;1:30:00;0;M;5,0
1485;1:56:00;0;M;7,0
1486;1:43:00;0;F;14,0
1487;1:52:00;0;M;10,0
1488;1:25:00;0;M;11,0
1489;1:19:00;0;M;13,0
1492;1:21:00;0;M;10,0
1494;0;0;F;4,0
1495;0;22:22:00;F;10,0
1496;1:30:00;0;F;3,0
1498;1:33:00;0;M;3,0
1499;1:14:00;0;F;2,0
1501;3:24:00;0;M;7,0
1503;1:27:00;0;F;8,0
1505;2:48:00;0;M;4,0
1506;2:33:00;0;M;1,0
1507;0;2 days, 15:07:00;F;47,0
1508;2:26:00;0;F;17,0
1509;0;2 days, 11:14:00;M;37,0
1510;0;3 days, 9:38:00;M;39,0
1511;1:34:00;0;M;
1512;0;0;F;
1514;0;0;F;
1515;1:51:00;0;M;12,0
1516;2:27:00;0;F;16,0
1518;2:36:00;0;M;18,0
1521;3:00:00;0;F;18,0
1522;0:20:00;0;M;5,0
1523;0;0;M;
1524;2:01:00;0;F;8,0
1526;3:06:00;0;M;3,0
1527;1:58:00;0;F;29,0
1528;1:34:00;0;F;6,0
1529;0;0;F;
1531;0;0;F;
1532;1:29:00;0;F;2,0
1533;0;0;F;12,0
1534;2:08:00;0;F;13,0
1536;2:47:00;0;F;17,0
1537;1:51:00;0;F;20,0
1538;1:44:00;0;F;11,0
1539;2:47:00;0;M;5,0
1540;2:41:00;0;M;6,0
1541;0;0:05:00;M;7,0
1542;2:38:00;0;M;9,0
1543;0;0;;9,0
1546;1:29:00;0;M;5,0
1547;3:17:00;0;F;16,0
1548;1:27:00;0;F;6,0
1551;3:15:00;18:32:00;M;35,0
1552;1:32:00;0;M;5,0
1553;1:19:00;0;M;5,0
1554;2:41:00;0;M;15,0
1555;2:03:00;0;M;12,0
1556;0;1 day, 0:48:00;M;36,0
1557;2:15:00;0;F;10,0
1558;1:32:00;0;M;12,0
1559;0:58:00;0;F;7,0
1562;0;0;M;12,0
1563;1:55:00;0;F;8,0
1564;0;0;M;
1565;1:35:00;0;F;4,0
1566;2:51:00;0;M;14,0
1567;2:54:00;0;M;5,0
1569;0;5 days, 12:20:00;F;36,0
1571;1:05:00;0;M;10,0
1572;2:56:00;0;F;9,0
1573;3:28:00;1 day, 1:24:00;M;33,0
1574;1:13:00;0;M;10,0
1575;2:46:00;4 days, 19:40:00;M;39,0
1577;1:55:00;0;M;19,0
1578;0;0;F;
1579;1:57:00;0;M;18,0
1580;1:03:00;0;F;2,0
1581;0;0;M;
1582;1:30:00;0;F;3,0
1583;0:49:00;0;F;2,0
1584;1:13:00;0;F;4,0
1585;1:41:00;0;F;4,0
1586;0:52:00;0;F;2,0
1587;0;8 days, 15:53:00;F;73,0
1588;3:00:00;0;M;7,0
1589;1:28:00;0;M;3,0
1590;2:16:00;0;F;11,0
1591;2:22:00;0;F;17,0
1592;0;1 day, 23:09:00;F;9,0
1593;2:00:00;0;F;3,0
1594;3:28:00;0;F;11,0
1595;0:33:00;0;M;2,0
1596;1:20:00;0;F;7,0
1597;0;3 days, 16:27:00;F;42,0
1599;0;22 days, 0:36:00;M;157,0
1600;0;0;M;
1601;0;0;F;
1603;4:12:00;0;F;8,0
1604;0;15 days, 15:30:00;M;102,0
1605;3:15:00;0;F;13,0
1606;2:11:00;0;M;25,0
1609;0:59:00;0;F;6,0
1610;1:18:00;0;F;4,0
1611;1:25:00;0;M;7,0
1612;1:22:00;0;M;2,0
1613;1:22:00;0;M;
1614;2:24:00;0;M;15,0
1615;0:55:00;0;M;2,0
1616;3:24:00;0;M;14,0
1618;1:20:00;0;M;13,0
1621;1:15:00;0;F;8,0
1622;1:19:00;0;F;24,0
1623;3:45:00;0;M;23,0
1624;9:39:00;0;M;18,0
1626;0;0;M;
1627;0;17:30:00;F;34,0
1629;1:13:00;0;M;13,0
1630;1:31:00;0;F;6,0
1631;0:59:00;0;F;13,0
1632;1:13:00;0;F;8,0
1633;1:06:00;0;F;1,0
1635;1:27:00;0;F;9,0
1637;1:10:00;0;F;8,0
1639;1:35:00;0;F;14,0
1642;0;21 days, 17:33:00;M;139,0
1643;2:34:00;0;F;14,0
1644;2:03:00;0;F;11,0
1645;1:15:00;0;M;14,0
1647;2:04:00;0;F;12,0
1649;0;1 day, 16:18:00;M;24,0
1651;2:22:00;0;F;16,0
1652;0;0;M;
1653;1:03:00;0;M;5,0
1654;0:47:00;0;F;4,0
1655;1:42:00;0;M;4,0
1656;1:54:00;0;M;4,0
1657;0;1 day, 19:40:00;M;61,0
1658;1:17:00;0;F;11,0
1660;1:54:00;0;M;13,0
1662;0;0;M;11,0
1664;0;0;F;
1666;0;0;F;
1667;1:55:00;0;M;9,0
1668;0;7 days, 18:39:00;M;32,0
1669;1:46:00;0;M;16,0
1676;1:12:00;0;M;8,0
1678;7:30:00;0;F;14,0
1679;2:36:00;0;F;26,0
1680;1:42:00;0;F;20,0
1681;22:39:00;0;M;19,0
1682;0;0;M;
1683;0;2 days, 23:29:00;M;64,0
1685;3:10:00;0;F;10,0
1686;1:12:00;0;F;14,0
1687;2:22:00;0;M;8,0
1688;1:44:00;0;M;4,0
1689;0;9 days, 2:52:00;F;35,0
1690;0;0;M;
1691;1:26:00;0;M;15,0
1693;0;6 days, 16:38:00;M;91,0
1694;0;5 days, 0:54:00;F;79,0
1695;1:33:00;0;M;16,0
1696;2:45:00;0;M;9,0
1697;1:26:00;0;F;5,0
1698;0;0;M;
1699;1:48:00;0;M;21,0
1702;1:25:00;0;F;7,0
1703;1:22:00;0;M;4,0
1704;1:49:00;0;M;11,0
1706;0;0;F;
1707;2:17:00;0;F;21,0
1708;1:57:00;0;F;11,0
1709;1:41:00;0;F;6,0
1710;1:27:00;0;M;11,0
1711;4:31:00;0;M;2,0
1712;4:26:00;0;M;9,0
1713;4:26:00;0;M;22,0
1716;0;0;M;
1721;1:37:00;0;F;15,0
1722;0;0;F;
1723;0;0;F;12,0
1724;2:20:00;0;F;13,0
1725;10:51:00;0;F;12,0
1726;0;3 days, 23:35:00;F;77,0
1727;0;1 day, 17:53:00;M;14,0
1728;1:20:00;0;F;8,0
1729;0:49:00;0;F;2,0
1730;2:39:00;0;M;4,0
1732;2:54:00;0;F;1,0
1733;1:15:00;0;F;10,0
1735;2:15:00;0;F;7,0
1737;0;0;F;
1740;1:11:00;0;F;10,0
1741;2:20:00;0;M;6,0
1742;2:04:00;0;M;8,0
1743;1:39:00;0;M;6,0
1744;0;2 days, 20:02:00;F;20,0
1745;1:44:00;0;F;4,0
1746;1:48:00;0;M;4,0
1747;0:52:00;0;M;4,0
1748;0:58:00;0;F;5,0
1749;1:20:00;0;M;3,0
1751;1:13:00;0;M;4,0
1753;1:36:00;0;M;4,0
1754;1:55:00;0;F;6,0
1756;0;0;M;4,0
1757;0;18:52:00;M;21,0
1758;1:34:00;0;F;7,0
1759;5:56:00;0;M;8,0
1760;2:20:00;0;M;5,0
1761;1:44:00;0;F;4,0
1762;1:54:00;0;M;7,0
1763;1:46:00;0;F;5,0
1764;3:12:00;0;M;2,0
1767;0:58:00;0;F;2,0
1768;3:02:00;0;F;2,0
1769;0:57:00;0;M;6,0
1774;1:45:00;0;F;5,0
1775;1:47:00;0;M;17,0
1776;1:09:00;0;M;8,0
1777;0;0;M;3,0
1778;2:31:00;0;F;3,0
1779;0:48:00;0;M;4,0
1781;3:12:00;0;F;1,0
1782;1:23:00;0;F;5,0
1783;2:03:00;0;F;1,0
1784;1:28:00;0;M;8,0
1785;0:51:00;0;F;12,0
1787;1:41:00;0;M;7,0
1788;10:55:00;0;M;7,0
1789;1:48:00;0;M;7,0
1790;1:48:00;0;M;18,0
1791;1:17:00;0;M;5,0
1792;3:08:00;0;M;16,0
1793;2:58:00;0;F;4,0
1794;2:26:00;0;F;20,0
1795;3:44:00;0;F;9,0
1796;1:26:00;0;M;19,0
1797;2:18:00;0;F;11,0
1798;2:00:00;0;F;10,0
1802;1:51:00;0;F;9,0
1804;1:25:00;0;M;8,0
1806;2:10:00;0;M;14,0
1807;2:11:00;0;M;15,0
1808;1:51:00;0;F;6,0
1809;1:42:00;0;F;15,0
1810;1:43:00;0;M;5,0
1812;1:16:00;0;F;4,0
1814;1:42:00;0;M;11,0
1815;1:40:00;0;M;10,0
1819;0;0;M;
1820;1:02:00;0;M;4,0
1821;0:56:00;0;M;5,0
1823;0;0;M;
1824;2:05:00;0;M;14,0
1825;0;0;F;
1826;1:36:00;0;F;9,0
1827;2:46:00;0;F;8,0
1828;1:46:00;0;F;7,0
1829;1:29:00;0;F;4,0
1830;1:45:00;0;M;19,0
1831;4:26:00;0;M;18,0
1832;1:13:00;0;M;6,0
1833;1:24:00;0;M;6,0
1834;2:10:00;0;F;8,0
1835;1:12:00;0;M;7,0
1836;1:10:00;0;F;4,0
1839;0;0;F;
1842;1:19:00;0;F;15,0
1843;1:55:00;0;F;2,0
1845;2:48:00;0;F;21,0
1847;1:49:00;0;M;16,0
1848;3:30:00;0;F;17,0
1850;1:56:00;0;F;4,0
1852;1:27:00;0;F;12,0
1853;2:17:00;0;M;9,0
1855;2:48:00;0;F;21,0
1856;0;0;F;
1859;1:30:00;0;F;13,0
1862;1:48:00;0;M;8,0
1863;1:55:00;0;F;18,0
1864;2:48:00;0;F;12,0
1865;2:05:00;0;F;17,0
1866;0;0;F;
1867;1:40:00;0;M;9,0
1868;2:09:00;0;F;9,0
1869;0;0;F;
1871;1:02:00;0;F;2,0
1876;0;0;M;
1888;3:32:00;0;F;19,0
1889;3:22:00;0;F;17,0
1890;0;0;F;
1892;1:48:00;0;F;9,0
1894;3:52:00;0;F;2,0
1899;2:31:00;0;M;11,0
1901;0;0;M;
1902;0;0;F;
1903;0;19:33:00;F;17,0
1904;1:40:00;0;F;10,0
1905;3:27:00;0;F;3,0
1906;1:55:00;0;M;7,0
1907;1:13:00;0;M;3,0
1909;0;2 days, 8:19:00;F;41,0
1911;1:50:00;0;M;11,0
1912;0;7 days, 8:24:00;M;84,0
1913;1:54:00;0;F;19,0
1914;1:12:00;1 day, 0:23:00;F;35,0
1915;2:29:00;0;F;21,0
1916;1:19:00;0;F;5,0
1917;1:21:00;0;F;4,0
1918;1:58:00;0;F;6,0
1919;2:15:00;0;F;4,0
1921;0;7 days, 23:24:00;F;67,0
1922;2:57:00;0;F;7,0
1923;1:22:00;0;M;16,0
1925;2:49:00;0;F;12,0
1926;2:18:00;0;F;18,0
1927;1:19:00;0;M;2,0
1928;1:33:00;0;M;4,0
1930;0;0;F;
1932;1:23:00;0;F;2,0
1933;2:00:00;0;F;15,0
1934;0;0;M;
1935;0:56:00;0;F;4,0
1936;1:13:00;0;M;6,0
1938;1:07:00;0;M;4,0
1941;0:45:00;0;M;4,0
1942;1:40:00;0;M;9,0
1943;1:46:00;0;F;14,0
1944;1:45:00;0;F;18,0
1945;2:40:00;0;M;3,0
1946;1:37:00;0;M;18,0
1947;3:17:00;0;F;17,0
1948;1:56:00;0;F;7,0
1949;0:45:00;0;F;2,0
1950;2:24:00;0;M;19,0
1952;1:33:00;0;F;8,0
1953;1:04:00;0;M;4,0
1955;1:54:00;0;F;13,0
1960;0;0;M;
1962;3:25:00;0;F;26,0
1963;1:50:00;0;F;16,0
1964;2:20:00;0;M;11,0
1967;2:01:00;0;F;4,0
1968;1:34:00;0;F;16,0
1969;1:36:00;0;F;18,0
1970;1:15:00;0;M;5,0
1971;1:01:00;0;F;5,0
1972;1:09:00;0;F;12,0
1973;0;0;;
1974;1:50:00;0;F;14,0
1976;1:38:00;0;F;15,0
1978;1:29:00;0;M;13,0
1979;1:46:00;0;M;14,0
1980;2:18:00;0;F;21,0
1981;0;0;F;5,0
1982;2:16:00;0;F;14,0
1984;1:30:00;0;M;11,0
1985;1:22:00;0;F;14,0
1986;0;0;M;9,0
1987;0;0;F;
1988;11:17:00;0;M;12,0
1990;1:59:00;0;M;16,0
1991;1:49:00;0;F;
1992;1:25:00;0;F;5,0
1994;0;0;M;
1995;0:49:00;0;F;3,0
1997;0;0;M;
1998;0;0;F;
1999;4:11:00;0;M;1,0
2000;1:53:00;0;M;4,0
2001;0;0;M;
2002;1:54:00;0;F;4,0
2003;0;0;M;
2004;1:41:00;0;F;4,0
2005;0:54:00;0;M;5,0
2008;0;0;F;
2009;0;0;M;
2011;1:34:00;0;M;3,0
2012;1:54:00;0;M;3,0
2014;1:41:00;0;F;6,0
2015;2:12:00;0;M;5,0
2017;1:48:00;0;M;11,0
2018;1:12:00;0;F;8,0
2019;1:26:00;0;M;5,0
2020;2:45:00;0;M;11,0
2023;1:08:00;0;M;2,0
2024;1:39:00;0;M;9,0
2025;0;2 days, 13:00:00;F;14,0
2026;0;7 days, 23:56:00;M;64,0
2027;1:38:00;0;M;3,0
2029;1:28:00;0;M;11,0
2030;2:03:00;0;M;15,0
2031;1:26:00;0;M;9,0
2032;2:08:00;0;M;20,0
2033;1:34:00;0;F;18,0
2035;0;5 days, 10:49:00;F;73,0
2037;1:25:00;0;M;5,0
2038;1:42:00;0;F;1,0
2039;1:45:00;0;M;9,0
2040;1:26:00;0;F;5,0
2042;1:56:00;0;F;2,0
2043;2:15:00;0;F;3,0
2044;1:35:00;0;M;24,0
2047;1:49:00;0;F;2,0
2048;1:16:00;0;F;1,0
2050;0;5 days, 0:43:00;F;40,0
2051;1:40:00;0;M;7,0
2052;0;0;F;
2053;1:56:00;0;M;5,0
2054;1:57:00;0;M;6,0
2055;1:38:00;0;M;3,0
2056;5:38:00;0;M;3,0
2057;1:20:00;0;F;12,0
2058;1:21:00;0;M;10,0
2059;1:31:00;0;F;18,0
2060;2:22:00;0;F;10,0
2061;1:28:00;0;F;9,0
2062;1:38:00;0;M;17,0
2063;2:01:00;0;F;18,0
2064;0;0;F;19,0
2068;1:18:00;0;F;7,0
2069;1:07:00;0;M;4,0
2070;1:40:00;0;F;15,0
2071;0;0;F;
2072;2:17:00;0;F;10,0
2073;0;0;F;
2074;2:35:00;0;F;19,0
2076;1:00:00;0;M;7,0
2077;0;0;F;
2078;1:34:00;0;F;13,0
2079;1:10:00;0;F;13,0
2080;1:18:00;0;M;7,0
2081;2:21:00;0;M;6,0
2082;0;0;F;
2083;2:04:00;0;F;10,0
2084;1:43:00;0;M;4,0
2085;0:19:00;0;M;3,0
2086;0;2 days, 19:49:00;M;27,0
2087;0;3 days, 15:31:00;M;28,0
2088;0;12 days, 2:46:00;M;66,0
2089;1:32:00;0;M;11,0
2090;1:04:00;0;M;5,0
2093;1:17:00;0;F;
2094;2:03:00;0;M;13,0
2096;1:12:00;0;M;6,0
2098;0;0;F;
2099;1:20:00;0;F;5,0
2101;2:14:00;0;M;14,0
2103;0;0;M;
2104;1:37:00;0;M;10,0
2105;1:27:00;0;F;7,0
2106;1:50:00;0;M;4,0
2107;1:54:00;0;M;8,0
2109;0;0;M;
2110;5:11:00;0;M;27,0
2111;2:06:00;0;M;5,0
2112;3:20:00;0;M;20,0
2113;1:21:00;0;F;8,0
2114;1:08:00;0;F;
2115;1:10:00;0;M;7,0
2116;2:51:00;0;F;1,0
2118;1:54:00;0;M;5,0
2119;3:14:00;0;F;4,0
2120;1:32:00;0;M;6,0
2121;2:17:00;0;F;14,0
2123;1:53:00;0;F;18,0
2124;1:40:00;0;F;21,0
2126;14:48:00;0;M;24,0
2129;0;0;M;
2132;1:40:00;0;M;8,0
2133;2:54:00;0;M;16,0
2134;2:43:00;19:59:00;M;28,0
2135;1:18:00;0;M;14,0
2136;3:01:00;0;M;9,0
2137;0;0;M;
2138;0;0;M;
2139;0;21:05:00;F;35,0
2140;1:23:00;0;M;8,0
2141;1:17:00;0;M;13,0
2142;2:17:00;0;F;20,0
2143;1:34:00;0;M;12,0
2146;1:55:00;0;F;10,0
2147;0;4 days, 3:17:00;M;61,0
2151;1:04:00;0;M;8,0
2152;4:21:00;0;F;14,0
2153;0;0;F;
2154;0;0;M;
2155;1:55:00;0;F;11,0
2156;0;2 days, 1:24:00;M;23,0
2157;0;8:46:00;F;14,0
2158;1:30:00;0;F;5,0
2159;0:46:00;0;F;7,0
2160;2:01:00;0;M;5,0
2161;0;0;M;
2162;1:38:00;0;F;9,0
2163;2:56:00;0;M;4,0
2167;0;0;M;
2168;2:16:00;0;F;1,0
2169;1:41:00;0;F;1,0
2170;0;0;F;
2171;0;0;F;
2172;1:44:00;0;F;9,0
2174;0;0;M;
2175;3:21:00;0;M;13,0
2178;0;0;F;
2181;1:15:00;0;M;6,0
2182;1:02:00;0;F;3,0
2183;0;2 days, 9:46:00;M;19,0
2186;2:10:00;0;F;7,0
2188;0;0;M;
2193;1:46:00;0;F;11,0
2196;1:22:00;0;M;5,0
2197;0;0;M;5,0
2198;0;1 day, 23:43:00;F;68,0
2199;1:07:00;0;F;1,0
2200;2:52:00;0;F;15,0
2202;2:25:00;0;F;16,0
2203;1:03:00;0;F;4,0
2204;0;0;M;
2205;0;0;M;
2206;0;0;M;
2208;0;0;M;
2209;0;7 days, 7:22:00;M;89,0
2210;3:11:00;0;M;16,0
2211;3:36:00;0;M;2,0
2212;1:59:00;0;F;12,0
2213;2:58:00;0;F;16,0
2214;1:36:00;0;M;8,0
2215;0;0;M;
2216;0;2 days, 17:24:00;F;56,0
2217;1:17:00;0;F;12,0
2218;1:19:00;0;M;7,0
2219;3:33:00;0;M;19,0
2220;0;19 days, 23:39:00;M;108,0
2221;2:14:00;0;M;15,0
2222;1:15:00;0;F;16,0
2223;1:19:00;0;F;8,0
2224;0;10 days, 0:57:00;M;47,0
2226;1:06:00;0;F;5,0
2227;2:12:00;0;F;17,0
2228;2:35:00;0;M;23,0
2229;6:27:00;0;M;20,0
2233;1:03:00;0;M;3,0
2235;1:01:00;0;M;3,0
2236;1:23:00;0;M;14,0
2237;3:39:00;0;M;5,0
2239;5:35:00;0;F;18,0
2240;2:26:00;0;F;23,0
2241;1:47:00;0;M;12,0
2242;2:46:00;0;M;6,0
2243;1:15:00;0;M;7,0
2244;0;10 days, 4:39:00;M;59,0
2245;1:44:00;0;M;9,0
2246;1:25:00;0;F;13,0
2247;1:10:00;0;M;15,0
2248;0;0;M;
2249;0;0;F;
2250;0:52:00;0;F;3,0
2251;0;2 days, 2:31:00;F;37,0
2252;0;0;F;
2254;1:38:00;0;F;6,0
2255;0:54:00;0;F;9,0
2257;2:09:00;0;M;16,0
2258;19:33:00;0;M;17,0
2259;1:30:00;0;F;6,0
2260;1:12:00;0;F;3,0
2262;0;0;M;
2264;1:13:00;0;F;6,0
2265;0:27:00;0;F;2,0
2266;1:38:00;0;M;10,0
2267;4:07:00;0;F;15,0
2268;1:39:00;0;F;6,0
2269;0:56:00;0;F;4,0
2270;1:15:00;0;M;11,0
2273;0:57:00;0;M;4,0
2274;0;17:26:00;F;39,0
2275;0;0;M;
2276;2:20:00;0;F;5,0
2277;1:39:00;0;F;7,0
2279;1:45:00;0;M;8,0
2281;3:12:00;0;F;17,0
2282;1:56:00;0;F;20,0
2283;1:51:00;0;M;22,0
2284;3:01:00;0;F;23,0
2285;22:03:00;0;F;29,0
2286;2:30:00;0;F;21,0
2287;0;23:48:00;M;7,0
2288;4:21:00;0;F;9,0
2289;1:33:00;0;F;7,0
2290;3:45:00;0;F;17,0
2291;1:08:00;0;F;15,0
2292;2:16:00;0;F;20,0
2293;0;5 days, 0:36:00;M;71,0
2295;0:54:00;0;M;3,0
2296;1:28:00;0;M;14,0
2297;1:17:00;0;M;9,0
2298;1:02:00;0;F;3,0
2299;2:39:00;0;M;13,0
2300;2:01:00;0;M;9,0
2301;1:48:00;0;M;4,0
2303;2:27:00;0;M;5,0
2305;2:06:00;0;F;14,0
2306;2:27:00;0;M;19,0
2307;1:34:00;0;M;3,0
2308;2:47:00;0;M;15,0
2309;3:06:00;0;F;4,0
2311;1:17:00;0;F;11,0
2312;0;0;M;
2314;3:18:00;0;F;10,0
2316;0;1 day, 1:20:00;F;13,0
2317;0;1 day, 21:36:00;M;52,0
2318;0:52:00;0;M;5,0
2319;0;0;F;15,0
2320;2:08:00;0;F;16,0
2321;0;0;F;19,0
2322;2:35:00;0;F;8,0
2324;1:22:00;0;M;2,0
2325;1:50:00;0;F;16,0
2326;1:47:00;0;M;17,0
2327;2:38:00;0;M;10,0
2328;3:38:00;0;M;5,0
2329;0;0;M;
2330;0;0;F;
2331;0;0;F;
2332;1:06:00;0;M;5,0
2333;2:44:00;0;F;18,0
2334;3:45:00;0;F;16,0
2335;0:53:00;0;F;2,0
2336;2:35:00;0;M;18,0
2337;1:50:00;0;M;6,0
2338;5:38:00;0;F;15,0
2339;7:39:00;0;M;20,0
2340;0;0;M;9,0
2341;1:37:00;0;F;15,0
2342;1:25:00;0;F;7,0
2343;1:14:00;0;M;3,0
2344;3:02:00;0;F;12,0
2345;0;5 days, 18:14:00;F;31,0
2346;0;21:01:00;F;33,0
2347;2:24:00;0;F;24,0
2348;1:47:00;0;F;15,0
2349;2:07:00;0;F;17,0
2350;1:08:00;0;M;3,0
2351;1:50:00;0;F;9,0
2352;2:09:00;0;M;14,0
2354;2:08:00;0;M;17,0
2355;1:33:00;0;F;4,0
2356;1:20:00;0;F;3,0
2357;1:32:00;0;M;18,0
2358;0;0;M;
2359;1:21:00;0;M;13,0
2360;1:43:00;0;M;6,0
2362;0:53:00;0;M;6,0
2363;0;0;M;
2364;0:13:00;0;M;
2365;0;0;M;
2366;2:22:00;0;F;9,0
2367;1:33:00;0;F;7,0
2368;1:16:00;0;F;10,0
2369;6:44:00;0;M;4,0
2370;1:02:00;0;M;4,0
2371;2:25:00;20:08:00;M;28,0
2372;2:46:00;0;F;19,0
2373;2:34:00;0;F;11,0
2374;2:00:00;0;F;11,0
2375;5:21:00;0;F;13,0
2379;0:59:00;0;M;5,0
2381;0;0;M;
2382;1:53:00;0;F;4,0
2383;1:35:00;0;M;4,0
2384;1:30:00;0;F;5,0
2385;1:04:00;0;F;6,0
2386;2:02:00;0;F;7,0
2387;1:34:00;0;M;4,0
2388;1:51:00;0;F;4,0
2389;0;8 days, 14:29:00;F;68,0
2390;2:02:00;0;F;11,0
2391;2:52:00;0;F;13,0
2392;1:26:00;0;F;3,0
2393;1:56:00;0;M;7,0
2394;2:51:00;0;M;16,0
2395;2:48:00;0;M;3,0
2396;1:36:00;0;M;6,0
2397;1:29:00;0;M;9,0
2398;0;0;M;
2399;2:07:00;0;F;11,0
2401;1:58:00;0;F;15,0
2402;2:28:00;0;M;11,0
2403;1:30:00;0;M;7,0
2404;1:03:00;0;F;13,0
2405;1:18:00;0;M;9,0
2406;1:43:00;0;M;16,0
2408;2:24:00;0;M;13,0
2409;3:04:00;0;M;19,0
2410;2:08:00;0;M;8,0
2411;1:17:00;0;M;
2412;2:24:00;0;F;12,0
2414;1:18:00;0;F;11,0
2415;1:52:00;0;M;4,0
2416;3:07:00;0;F;1,0
2417;2:49:00;0;F;13,0
2418;1:26:00;0;F;6,0
2420;1:54:00;0;M;7,0
2421;2:21:00;0;M;11,0
2422;0;0;F;
2423;1:12:00;0;M;7,0
2424;2:25:00;0;F;15,0
2425;0;0;F;12,0
2426;1:35:00;0;F;9,0
2427;2:03:00;0;M;20,0
2428;3:42:00;0;F;19,0
2429;2:14:00;0;F;10,0
2430;1:49:00;0;M;15,0
2431;0;0;F;
2432;0;5 days, 15:16:00;M;20,0
2433;1:31:00;0;M;9,0
2435;0;0;F;10,0
2436;2:05:00;0;F;17,0
2437;0;0;M;6,0
2438;1:50:00;0;F;6,0
2439;0;0;M;
2440;2:07:00;0;F;12,0
2441;2:15:00;0;F;20,0
2442;2:35:00;0;M;3,0
2443;1:11:00;0;F;12,0
2444;0;0;M;
2445;0;0;F;
2447;1:42:00;0;M;3,0
2448;0;0;F;
2449;3:58:00;0;M;7,0
2450;3:13:00;0;M;3,0
2452;1:14:00;0;M;6,0
2453;1:38:00;0;M;3,0
2454;1:50:00;0;M;4,0
2457;4:20:00;0;F;18,0
2458;1:49:00;0;F;17,0
2459;0;0;M;4,0
2460;2:25:00;0;F;17,0
2461;1:23:00;0;M;18,0
2462;3:12:00;0;F;15,0
2463;1:37:00;0;F;16,0
2464;1:44:00;0;M;18,0
2466;0;16:35:00;M;26,0
2469;1:27:00;0;M;11,0
2470;1:24:00;0;M;10,0
2472;1:17:00;0;F;4,0
2473;0;3 days, 5:03:00;M;29,0
2474;0;43 days, 19:26:00;F;365,0
2475;0;0;F;
2476;2:34:00;0;F;8,0
2477;1:49:00;0;M;3,0
2478;3:11:00;0;M;14,0
2479;0;0;F;
2481;4:32:00;0;F;16,0
2482;1:56:00;0;M;5,0
2483;0:53:00;0;M;3,0
2484;6:10:00;0;F;16,0
2485;2:11:00;0;F;6,0
2487;1:51:00;0;M;10,0
2488;1:06:00;0;F;2,0
2489;0;0;F;1,0
2490;0;0;F;
2491;0;0;F;
2492;2:00:00;0;F;6,0
2493;2:18:00;0;F;12,0
2497;0;0;F;9,0
2498;2:20:00;0;F;17,0
2499;0;2 days, 23:22:00;M;65,0
2500;1:56:00;0;M;20,0
2501;1:10:00;0;M;10,0
2502;0;0;F;
2503;2:02:00;0;M;10,0
2506;0;0:22:00;M;
2507;4:24:00;0;M;21,0
2509;2:19:00;0;F;14,0
2510;2:14:00;0;F;8,0
2511;1:20:00;0;F;6,0
2513;3:35:00;0;M;10,0
2515;1:51:00;0;M;7,0
2516;2:05:00;0;M;14,0
2517;0;0;M;13,0
2518;2:44:00;0;F;8,0
2519;1:25:00;0;F;1,0
2520;0;2 days, 14:36:00;M;21,0
2521;0;17:14:00;M;37,0
2522;0;0;F;
2525;1:11:00;0;F;17,0
2527;0;5 days, 0:55:00;M;93,0
2528;2:16:00;0;M;16,0
2530;1:52:00;0;F;23,0
2531;1:41:00;0;F;5,0
2532;2:58:00;0;F;10,0
2533;0;17:34:00;M;33,0
2534;1:04:00;0;M;12,0
2535;2:42:00;0;M;12,0
2537;0:13:00;0;M;
2538;1:11:00;0;F;5,0
2539;1:35:00;0;F;8,0
2543;3:38:00;0;F;3,0
2544;1:24:00;0;F;5,0
2545;1:21:00;0;F;8,0
2548;1:31:00;0;F;6,0
2549;1:58:00;0;F;1,0
2550;0;0;M;
2551;1:16:00;0;F;8,0
2552;0:50:00;0;M;5,0
2555;0;4 days, 5:00:00;M;69,0
2556;0;0:02:00;M;
2557;3:14:00;0;M;19,0
2558;0;10 days, 22:56:00;M;45,0
2559;1:28:00;0;F;9,0
2562;1:09:00;0;M;4,0
2563;0;1 day, 5:26:00;F;37,0
2565;3:23:00;0;M;10,0
2566;3:33:00;0;M;15,0
2569;0;20:54:00;F;34,0
2570;1:30:00;0;M;9,0
2571;1:09:00;0;M;14,0
2573;1:07:00;0;F;8,0
2574;1:57:00;0;M;9,0
2576;1:09:00;0;F;10,0
2577;0;0;F;
2578;1:24:00;0;F;6,0
2579;1:22:00;0;M;9,0
2580;1:46:00;0;F;5,0
2582;1:14:00;0;F;10,0
2584;2:08:00;0;F;19,0
2585;2:47:00;0;M;8,0
2586;1:09:00;0;M;8,0
2587;1:37:00;0;M;9,0
2588;2:34:00;0;F;3,0
2589;1:52:00;0;F;5,0
2590;0:58:00;0;M;5,0
2591;0;0;M;4,0
2592;0:49:00;0;M;
2593;2:07:00;0;F;6,0
2594;2:54:00;0;F;7,0
2595;1:38:00;0;F;18,0
2596;4:08:00;0;M;6,0
2597;11:12:00;0;M;22,0
2598;2:56:00;0;F;8,0
2601;0;7 days, 23:43:00;M;166,0
2602;0;2 days, 0:06:00;M;49,0
2603;1:18:00;0;F;15,0
2604;1:15:00;0;F;13,0
2607;1:32:00;0;F;11,0
2608;2:15:00;0;F;17,0
2611;1:40:00;0;F;13,0
2613;1:58:00;0;M;8,0
2614;2:40:00;0;M;1,0
2615;2:31:00;0;M;11,0
2616;1:26:00;0;F;1,0
2619;2:39:00;0;F;15,0
2621;1:29:00;0;F;6,0
2622;0;7 days, 15:17:00;F;34,0
2623;1:37:00;0;M;13,0
2624;1:20:00;0;M;9,0
2625;0;0;F;
2626;0;0;F;
2627;1:39:00;0;M;5,0
2628;0;0;M;9,0
2629;2:34:00;0;F;21,0
2633;0;0;M;13,0
2634;0;0;F;11,0
2635;1:47:00;0;F;6,0
2636;0;0;M;4,0
2637;0;2 days, 7:41:00;M;68,0
2639;1:47:00;0;M;7,0
2641;1:00:00;0;M;7,0
2643;2:07:00;0;F;7,0
2644;0;0;M;8,0
2645;1:37:00;0;M;8,0
2646;1:44:00;0;M;3,0
2647;0;2 days, 22:50:00;M;20,0
2648;1:34:00;0;F;5,0
2649;1:36:00;0;F;21,0
2651;1:36:00;0;F;17,0
2652;1:06:00;0;M;17,0
2654;2:31:00;0;M;10,0
2656;1:26:00;0;F;11,0
2657;1:55:00;0;M;12,0
2658;0;6 days, 22:27:00;M;31,0
2659;1:38:00;0;M;12,0
2660;2:34:00;0;M;15,0
2662;4:10:00;0;M;14,0
2663;1:56:00;0;F;7,0
2664;0;7 days, 21:25:00;F;48,0
2666;0;3 days, 10:37:00;F;30,0
2667;0;1 day, 1:13:00;F;36,0
2668;1:53:00;0;M;5,0
2669;1:51:00;0;M;4,0
2670;0;4 days, 9:14:00;F;29,0
2672;2:13:00;0;M;14,0
2674;1:02:00;0;F;11,0
2675;1:49:00;0;F;10,0
2676;1:28:00;0;F;6,0
2677;1:28:00;0;F;6,0
2679;0;0;F;7,0
2680;1:48:00;0;F;21,0
2682;1:41:00;0;F;16,0
2684;0;4 days, 1:10:00;F;27,0
2685;1:50:00;0;M;14,0
2686;3:22:00;0;F;12,0
2687;0;0;M;13,0
2688;0;0;F;11,0
2689;3:06:00;0;F;9,0
2690;4:52:00;21:49:00;F;35,0
2692;1:40:00;0;F;13,0
2693;0;38 days, 21:11:00;F;240,0
2694;2:25:00;0;F;15,0
2695;0;0;F;
2696;1:34:00;0;M;15,0
2697;2:23:00;0;F;6,0
2698;2:32:00;0;F;13,0
2699;0;0:10:00;M;12,0
2700;1:45:00;0;F;12,0
2701;3:02:00;0;M;22,0
2702;0;0;;2,0
2705;0;0;M;23,0
2706;1:08:00;0;M;5,0
2707;1:20:00;0;M;3,0
2708;1:23:00;0;F;16,0
2710;0:46:00;0;M;5,0
2711;1:36:00;0;M;3,0
2712;1:31:00;0;F;20,0
2713;0;0;F;9,0
2714;21:30:00;0;M;23,0
2715;1:42:00;0;M;9,0
2716;1:06:00;0;F;3,0
2717;0;3 days, 22:10:00;F;26,0
2719;3:00:00;0;F;9,0
2720;0;0;F;
2721;1:55:00;0;M;17,0
2722;0;0;F;
2723;3:04:00;0;F;6,0
2724;2:35:00;0;F;11,0
2725;1:45:00;0;F;9,0
2726;2:01:00;0;F;9,0
2727;1:35:00;0;F;2,0
2729;1:06:00;0;M;4,0
2731;1:28:00;0;F;3,0
2733;0;2 days, 16:51:00;F;22,0
2734;1:25:00;0;M;14,0
2735;0:49:00;0;M;3,0
2736;1:57:00;0;F;19,0
2737;0;1 day, 1:36:00;M;32,0
2738;1:49:00;0;M;7,0
2739;1:28:00;0;F;6,0
2740;3:00:00;0;M;22,0
2741;2:20:00;0;M;4,0
2743;2:20:00;0;M;17,0
2746;1:53:00;0;M;3,0
2747;5:04:00;0;M;7,0
2748;2:12:00;0;F;6,0
2751;2:00:00;0;F;6,0
2753;1:37:00;0;M;
2754;1:23:00;0;F;7,0
2756;0:56:00;0;M;8,0
2757;1:04:00;0;M;3,0
2759;1:46:00;0;F;8,0
2761;1:33:00;0;F;4,0
2763;2:03:00;0;F;22,0
2764;1:33:00;0;F;8,0
2765;1:50:00;0;F;24,0
2766;1:09:00;0;F;7,0
2768;1:39:00;0;M;14,0
2769;1:34:00;0;M;6,0
2770;0:49:00;0;M;5,0
2772;2:43:00;0;M;5,0
2773;1:26:00;0;F;10,0
2774;0;0;M;
2776;1:39:00;0;F;19,0
2777;7:44:00;1 day, 2:08:00;F;23,0
2778;5:01:00;21:21:00;F;27,0
2779;5:56:00;21:08:00;M;30,0
2781;2:44:00;0;M;15,0
2782;1:03:00;0;M;5,0
2783;1:19:00;0;M;5,0
2784;1:37:00;0;F;13,0
2785;1:32:00;0;F;4,0
2787;1:45:00;0;F;7,0
2788;1:36:00;0;M;3,0
2790;1:35:00;0;F;14,0
2791;2:23:00;0;M;11,0
2792;0;1 day, 3:50:00;F;33,0
2793;1:39:00;0;M;10,0
2794;1:56:00;0;F;6,0
2795;0;0;M;17,0
2796;1:29:00;0;M;9,0
2797;1:17:00;0;M;6,0
2798;0;0;M;
2799;1:04:00;0;M;11,0
2800;0;0;F;
2801;0;4 days, 23:00:00;F;95,0
2802;1:45:00;0;F;5,0
2804;1:59:00;0;F;6,0
2805;2:23:00;0;F;5,0
2808;1:13:00;0;M;6,0
2809;0;0;F;7,0
2811;1:39:00;0;M;5,0
2813;0;0;F;
2814;1:09:00;0;F;
2815;1:47:00;0;F;5,0
2817;1:16:00;0;M;5,0
2818;1:27:00;0;M;6,0
2820;1:36:00;0;F;3,0
2821;2:10:00;0;F;5,0
2822;1:28:00;0;F;15,0
2823;2:06:00;0;M;15,0
2824;3:51:00;0;M;3,0
2826;1:30:00;0;M;15,0
2828;1:47:00;0;M;10,0
2829;0;13:53:00;M;23,0
2831;5:41:00;0;F;12,0
2832;2:10:00;0;M;15,0
2833;2:11:00;0;M;18,0
2834;2:28:00;0;F;10,0
2835;1:24:00;0;M;2,0
2838;1:12:00;0;M;5,0
2839;1:08:00;0;M;11,0
2840;0;0;M;20,0
2841;2:16:00;0;F;17,0
2843;3:53:00;0;F;9,0
2844;2:29:00;0;F;7,0
2848;0;0;M;
2849;0;1 day, 0:59:00;F;32,0
2851;0:54:00;0;F;4,0
2853;2:20:00;0;M;8,0
2854;1:53:00;0;F;5,0
2855;1:42:00;0;M;4,0
2858;1:59:00;0;M;6,0
2860;1:23:00;0;M;8,0
2861;1:34:00;0;M;7,0
2862;1:31:00;0;F;15,0
2863;1:13:00;0;M;3,0
2864;1:44:00;0;F;11,0
2865;1:53:00;0;F;13,0
2866;1:08:00;0;M;4,0
2867;1:28:00;0;F;9,0
2868;0:50:00;0;F;11,0
2869;2:03:00;0;M;11,0
2870;0;0;F;
2872;2:26:00;0;M;13,0
2873;0:54:00;0;F;8,0
2874;0;0;F;
2875;2:06:00;0;M;16,0
2876;0;0;F;9,0
2877;1:22:00;0;F;11,0
2878;1:27:00;0;F;12,0
2879;0;0;F;14,0
2880;0:51:00;0;F;1,0
2882;2:02:00;0;M;13,0
2883;0;0;F;4,0
2886;4:31:00;0;M;9,0
2887;1:10:00;0;F;1,0
2888;2:16:00;0;F;16,0
2889;5:37:00;0;M;13,0
2890;3:00:00;0;F;7,0
2891;1:25:00;0;F;9,0
2893;0;0;F;8,0
2894;3:32:00;0;F;5,0
2895;0;0;F;
2896;0;0;M;
2897;0;0;M;
2898;2:32:00;0;F;12,0
2901;1:20:00;0;F;6,0
2903;0;1 day, 5:20:00;F;19,0
2904;5:24:00;0;F;19,0
2906;0;0;F;10,0
2907;1:44:00;0;M;7,0
2908;0;0;M;
2909;0;1 day, 6:37:00;M;15,0
2910;2:20:00;0;M;7,0
2911;17:07:00;0;M;5,0
2912;1:24:00;0;F;10,0
2916;2:02:00;0;M;6,0
2917;0;0;F;
2918;0;0;M;
2919;0;12 days, 4:27:00;M;64,0
2920;0;0;F;2,0
2921;0;0;M;12,0
2922;1:02:00;0;F;1,0
2923;1:25:00;0;M;8,0
2924;0;3 days, 22:50:00;F;30,0
2925;0;5 days, 21:17:00;M;42,0
2926;0;0;M;7,0
2927;1:26:00;0;M;7,0
2929;5:00:00;0;F;40,0
2931;1:49:00;0;M;7,0
2933;15:42:00;2 days, 20:16:00;M;51,0
2934;0;0;F;
2935;0;1 day, 1:45:00;F;13,0
2937;1:28:00;0;M;13,0
2940;7:19:00;18:17:00;F;30,0
2941;1:10:00;0;F;4,0
2942;1:01:00;0;F;4,0
2944;2:34:00;0;M;11,0
2945;0:40:00;0;M;2,0
2946;1:30:00;0;F;3,0
2947;2:28:00;0;M;17,0
2949;0:47:00;0;F;2,0
2950;1:19:00;0;M;13,0
2951;1:28:00;0;M;20,0
2952;0;22:42:00;F;13,0
2953;0;0;M;
2954;1:59:00;0;M;11,0
2955;2:25:00;0;F;7,0
2956;0:37:00;0;F;
2957;2:25:00;0;M;12,0
2958;0;0:54:00;M;1,0
2960;1:23:00;0;F;16,0
2961;1:27:00;0;F;13,0
2962;1:51:00;0;F;10,0
2965;1:14:00;0;F;14,0
2966;0;0;F;4,0
2967;2:16:00;0;M;11,0
2968;2:21:00;0;F;6,0
2969;1:24:00;0;F;10,0
2970;2:41:00;0;F;9,0
2972;1:55:00;0;F;17,0
2974;1:34:00;0;M;3,0
2975;3:07:00;0;F;9,0
2976;0;3 days, 1:46:00;M;55,0
2977;4:25:00;0;M;6,0
2980;0;7 days, 18:15:00;F;53,0
2981;1:32:00;0;F;8,0
2982;0;0;F;
2983;0;10 days, 0:41:00;F;40,0
2984;0;0;F;4,0
2985;1:21:00;0;F;3,0
2986;0:11:00;0;F;
2987;1:57:00;0;F;7,0
2988;0;1 day, 5:12:00;M;15,0
2989;1:39:00;0;M;6,0
2990;0;0;F;
2991;0:53:00;0;F;8,0
2992;1:57:00;0;M;8,0
2993;2:24:00;0;F;7,0
2995;1:21:00;0;F;16,0
2996;6:53:00;0;F;13,0
2997;0;0;F;3,0
2998;1:15:00;0;M;6,0
2999;2:10:00;0;F;7,0
3000;1:50:00;0;M;7,0
3001;4:13:00;0;F;14,0
3002;2:06:00;0;F;18,0
3003;1:59:00;0;F;4,0
3004;1:43:00;0;M;7,0
3006;3:30:00;0;M;16,0
3007;4:20:00;0;M;20,0
3008;2:12:00;0;M;12,0
3009;2:03:00;0;F;13,0
3011;0;0;F;
3013;2:31:00;0;F;10,0
3014;0;3 days, 19:27:00;M;42,0
3015;2:02:00;0;M;15,0
3018;1:51:00;0;M;8,0
3020;5:51:00;0;F;2,0
3021;3:47:00;0;M;12,0
3022;2:56:00;0;F;12,0
3023;0;0;F;
3024;1:27:00;0;M;10,0
3025;1:20:00;0;F;8,0
3026;1:27:00;0;F;11,0
3027;2:57:00;0;F;9,0
3028;2:30:00;0;F;14,0
3029;2:47:00;0;F;13,0
3030;1:33:00;0;F;3,0
3031;1:28:00;0;F;
3032;1:42:00;0;M;11,0
3033;1:21:00;0;F;8,0
3034;0;2 days, 4:46:00;M;35,0
3035;1:35:00;0;F;3,0
3037;3:37:00;2 days, 22:03:00;F;69,0
3038;0;0;F;5,0
3039;0;0;F;1,0
3040;2:03:00;0;M;22,0
3041;2:12:00;0;F;16,0
3042;0;0;M;13,0
3043;2:04:00;0;M;5,0
3044;1:21:00;0;F;10,0
3046;1:31:00;0;F;19,0
3049;1:13:00;0;M;9,0
3051;0;2 days, 1:42:00;M;48,0
3054;2:24:00;0;F;16,0
3055;2:13:00;0;M;14,0
3056;0;45 days, 14:55:00;F;243,0
3057;3:01:00;0;M;23,0
3058;0:58:00;0;F;3,0
3060;0;0;F;1,0
3061;0:58:00;0;M;6,0
3062;0;0;M;
3063;1:44:00;0;F;8,0
3064;2:07:00;0;F;10,0
3065;7:00:00;0;M;12,0
3066;1:30:00;0;F;14,0
3067;0;0;M;4,0
3068;1:41:00;0;F;15,0
3070;0;30 days, 7:58:00;M;197,0
3071;0;0;F;5,0
3074;2:52:00;0;M;10,0
3076;2:45:00;0;F;8,0
3077;0:47:00;0;M;3,0
3078;5:31:00;0;F;12,0
3083;0;1 day, 13:29:00;F;16,0
3084;1:39:00;0;F;7,0
3085;0;0;F;9,0
3086;1:16:00;0;M;19,0
3087;3:16:00;0;F;23,0
3088;0;29 days, 11:53:00;M;173,0
3089;6:51:00;0;F;19,0
3090;0:56:00;0;M;3,0
3091;3:01:00;0;M;16,0
3092;2:37:00;0;F;16,0
3094;0;27 days, 17:59:00;F;129,0
3095;0;0;M;17,0
3099;2:26:00;0;M;20,0
3100;2:00:00;0;M;16,0
3102;1:27:00;0;F;6,0
3103;2:12:00;0;M;6,0
3105;2:17:00;0;M;16,0
3106;1:00:00;0;F;5,0
3107;0:56:00;0;M;4,0
3108;1:19:00;0;M;5,0
3109;1:27:00;0;F;4,0
3110;0:59:00;0;F;5,0
3111;1:09:00;0;F;5,0
3112;0;1 day, 22:23:00;M;15,0
3113;0;0;M;
3114;2:53:00;0;M;12,0
3116;1:10:00;0;F;6,0
3117;1:55:00;0;M;6,0
3118;1:10:00;0;M;7,0
3119;0:16:00;0;F;16,0
3120;0;0;M;10,0
3121;2:01:00;0;M;10,0
3122;5:25:00;0;F;11,0
3123;1:11:00;0;F;7,0
3124;2:31:00;0;F;11,0
3125;9:07:00;0;F;17,0
3126;0;4 days, 1:26:00;M;19,0
3127;0;0;M;
3128;0;0;F;
3130;0;2 days, 20:34:00;F;65,0
3132;0:25:00;0;F;2,0
3133;3:17:00;0;F;11,0
3134;2:03:00;0;F;12,0
3135;1:34:00;0;F;13,0
3136;0;0;F;
3137;2:43:00;0;M;18,0
3138;1:19:00;0;F;8,0
3140;0;0;M;1,0
3143;4:14:00;0;F;8,0
3144;1:11:00;0;F;5,0
3145;0;1 day, 5:07:00;F;15,0
3147;1:29:00;0;F;2,0
3148;0;0;F;
3149;0;0;F;1,0
3151;0;3 days, 20:33:00;F;42,0
3152;1:08:00;0;M;10,0
3153;3:45:00;0;M;18,0
3154;2:08:00;0;M;8,0
3155;0;0:04:00;M;
3156;0;3 days, 0:36:00;M;71,0
3157;1:06:00;0;M;6,0
3158;1:31:00;0;F;7,0
3159;1:17:00;0;F;9,0
3160;0;0;F;
3161;1:20:00;0;F;2,0
3164;0;14 days, 8:22:00;M;92,0
3165;2:12:00;0;F;8,0
3166;1:15:00;0;F;10,0
3169;1:14:00;0;F;3,0
3171;1:12:00;0;M;3,0
3172;1:50:00;0;F;5,0
3173;10:21:00;0;M;16,0
3174;3:07:00;0;M;10,0
3175;1:40:00;0;F;10,0
3177;0;0;F;
3178;0;0;F;
3180;1:30:00;0;F;7,0
3181;1:23:00;0;F;
3182;2:21:00;0;F;13,0
3183;1:51:00;0;M;10,0
3184;1:21:00;0;F;6,0
3185;2:59:00;0;M;10,0
3186;1:33:00;0;F;12,0
3187;1:51:00;0;M;10,0
3189;1:55:00;0;M;8,0
3192;0;18 days, 15:22:00;F;150,0
3193;0;3 days, 21:01:00;F;21,0
3194;0;1 day, 11:07:00;M;20,0
3196;1:13:00;0;M;7,0
3197;0;0;F;
3198;1:34:00;0;F;14,0
3200;0;1 day, 8:04:00;F;16,0
3201;0;20 days, 12:00:00;F;138,0
3202;1:01:00;0;M;5,0
3203;0;1 day, 16:07:00;M;61,0
3204;1:45:00;0;M;17,0
3205;0;0;M;5,0
3206;1:13:00;0;F;11,0
3207;1:23:00;0;M;8,0
3208;1:47:00;0;F;10,0
3211;1:43:00;0;F;8,0
3213;2:50:00;0;F;18,0
3215;2:29:00;0;M;16,0
3216;0:59:00;0;M;2,0
3217;1:27:00;0;M;9,0
3218;0;7 days, 22:43:00;M;57,0
3219;0;0;M;
3220;0;0;F;
3221;2:54:00;0;M;10,0
3222;2:03:00;0;F;10,0
3224;0;0;M;
3225;1:11:00;0;M;10,0
3226;0:37:00;0;F;3,0
3227;1:48:00;0;F;3,0
3228;0;0;F;1,0
3229;0;0;M;
3230;2:17:00;0;M;16,0
3231;1:55:00;0;M;13,0
3232;1:38:00;0;F;15,0
3233;2:46:00;0;F;6,0
3234;1:49:00;0;M;7,0
3235;1:35:00;0;M;11,0
3236;1:54:00;0;F;9,0
3237;0;0;M;
3238;0;0;F;
3239;1:44:00;0;F;8,0
3240;1:34:00;0;F;15,0
3241;0;4 days, 4:52:00;F;19,0
3242;1:12:00;0;M;9,0
3245;1:03:00;0;M;
3247;1:26:00;0;M;5,0
3248;1:30:00;0;M;6,0
3250;2:01:00;0;F;5,0
3251;1:48:00;0;F;7,0
3253;1:52:00;0;F;4,0
3254;1:04:00;0;M;6,0
3255;1:32:00;0;M;6,0
3256;1:42:00;0;F;4,0
3257;4:31:00;0;M;10,0
3259;2:22:00;0;F;6,0
3260;2:19:00;0;M;17,0
3262;1:04:00;0;M;2,0
3263;2:33:00;0;F;9,0
3264;1:41:00;0;F;21,0
3266;0;0;M;
3268;0:59:00;0;F;2,0
3269;1:38:00;0;F;12,0
3270;0;6 days, 1:56:00;F;66,0
3272;1:49:00;0;M;18,0
3273;1:42:00;0;M;14,0
3275;1:20:00;0;M;19,0
3276;0;24 days, 23:18:00;F;149,0
3277;2:28:00;0;F;9,0
3278;4:21:00;0;F;16,0
3279;1:20:00;0;F;9,0
3280;2:12:00;0;F;3,0
3281;0;2 days, 3:21:00;F;34,0
3282;0;2 days, 13:18:00;F;16,0
3283;1:36:00;0;M;11,0
3284;0;1 day, 5:51:00;F;46,0
3285;0;0;F;7,0
3286;0;0;F;
3288;1:11:00;0;F;8,0
3290;0;11 days, 0:04:00;F;44,0
3291;2:17:00;0;M;4,0
3292;1:55:00;0;F;6,0
3293;2:03:00;0;M;8,0
3294;1:02:00;0;F;7,0
3295;1:05:00;0;F;4,0
3296;4:02:00;0;M;19,0
3297;2:56:00;0;M;12,0
3298;0;0;F;
3299;1:19:00;0;M;12,0
3300;1:40:00;0;F;4,0
3301;0;0;F;1,0
3302;2:39:00;0;F;14,0
3303;0;0;F;1,0
3304;1:33:00;0;F;19,0
3306;0;0;F;2,0
3309;2:52:00;0;F;10,0
3311;0;0;F;
3313;1:23:00;0;F;5,0
3317;1:25:00;0;M;8,0
3318;0;0;M;
3321;0;0;M;12,0
3323;6:14:00;0;M;15,0
3324;1:23:00;0;M;5,0
3326;2:02:00;0;F;4,0
3328;0;3 days, 11:17:00;M;19,0
3330;2:11:00;0;F;12,0
3331;0;0;F;1,0
3332;0;0;F;2,0
3333;5:21:00;0;F;20,0
3334;1:19:00;0;M;9,0
3335;1:58:00;0;M;20,0
3336;2:16:00;0;M;20,0
3337;0;20:02:00;F;18,0
3338;3:13:00;0;M;11,0
3339;3:18:00;0;F;9,0
3340;1:41:00;0;F;5,0
3341;5:09:00;0;M;21,0
3343;2:14:00;0;F;8,0
3344;0;13 days, 6:09:00;F;78,0
3345;0;20:39:00;M;14,0
3347;1:00:00;0;M;8,0
3350;2:57:00;0;F;10,0
3353;2:01:00;0;M;10,0
3355;2:24:00;0;M;9,0
3356;0;1 day, 21:19:00;F;33,0
3357;0;0;M;2,0
3359;1:51:00;0;F;2,0
3360;1:58:00;0;M;3,0
3361;2:00:00;0;F;21,0
3364;0;0;F;
3365;1:47:00;0;F;17,0
3366;1:29:00;0;F;14,0
3367;0;0;F;1,0
3369;1:49:00;0;M;13,0
3370;1:59:00;0;M;11,0
3371;0;17 days, 4:38:00;M;196,0
3372;1:05:00;0;M;7,0
3376;1:17:00;0;F;7,0
3377;1:26:00;0;F;3,0
3379;0;11:13:00;F;6,0
3380;0;0;F;8,0
3382;1:43:00;0;M;10,0
3383;0:36:00;0;M;3,0
3384;0:38:00;0;M;2,0
3387;2:28:00;0;F;8,0
3388;1:29:00;0;F;7,0
3389;1:35:00;0;M;5,0
3390;0;0;F;
3391;1:58:00;0;F;6,0
3394;1:58:00;0;M;5,0
3403;0;7 days, 23:48:00;M;79,0
3404;2:00:00;0;F;2,0
3405;0;17:26:00;F;17,0
3407;3:55:00;0;F;10,0
3411;1:10:00;0;M;6,0
3412;1:07:00;0;F;15,0
3414;1:12:00;0;M;8,0
3415;2:05:00;0;M;10,0
3417;2:12:00;0;M;5,0
3418;1:28:00;0;M;7,0
3420;2:31:00;0;M;25,0
3422;1:37:00;0;M;13,0
3423;1:47:00;0;M;5,0
3424;1:49:00;0;M;6,0
3425;1:32:00;0;M;5,0
3426;2:25:00;0;M;18,0
3427;0;1 day, 21:25:00;M;27,0
3428;2:08:00;0;F;12,0
3429;0;10 days, 17:03:00;F;51,0
3430;1:42:00;0;F;3,0
3431;0:52:00;0;F;2,0
3434;2:08:00;0;M;11,0
3435;0;9 days, 20:12:00;M;72,0
3437;0;0;M;
3438;0;10 days, 3:04:00;F;46,0
3439;0;3 days, 6:28:00;M;30,0
3440;1:30:00;0;M;4,0
3441;1:20:00;0;F;10,0
3442;1:13:00;0;F;4,0
3443;1:37:00;0;M;3,0
3444;1:24:00;0;M;8,0
3445;1:56:00;0;F;8,0
3447;2:12:00;0;M;9,0
3449;22:58:00;0;F;22,0
3450;2:07:00;0;M;7,0
3451;2:22:00;0;F;16,0
3452;1:54:00;22:58:00;M;37,0
3453;1:10:00;0;F;10,0
3454;0;2 days, 23:19:00;F;61,0
3455;2:08:00;0;F;21,0
3457;0;11 days, 16:32:00;M;90,0
3458;1:10:00;0;M;3,0
3459;17:26:00;0;M;31,0
3460;0;0;M;
3461;0;3 days, 2:44:00;F;26,0
3462;0;0;F;1,0
3463;0;0;F;
3464;2:27:00;0;F;11,0
3465;1:10:00;0;M;9,0
3466;0;1 day, 21:33:00;M;17,0
3467;2:11:00;0;F;13,0
3469;2:22:00;0;F;18,0
3470;0;16 days, 10:21:00;M;94,0
3471;0;16 days, 23:41:00;M;97,0
3472;0;0;F;1,0
3473;0;5 days, 11:21:00;M;54,0
3474;0;0;F;2,0
3475;0;13 days, 8:19:00;M;77,0
3476;0;0;F;2,0
3477;1:45:00;0;M;2,0
3480;0:56:00;0;M;2,0
3482;1:19:00;0;F;6,0
3483;1:23:00;0;F;8,0
3485;2:03:00;0;M;12,0
3486;0;1 day, 8:20:00;M;43,0
3487;0;0;M;
3488;1:37:00;0;F;9,0
3489;0;7 days, 1:30:00;F;87,0
3490;0;0;F;
3492;6:12:00;0;F;16,0
3494;1:52:00;0;M;3,0
3497;0;0;M;
3498;1:28:00;0;M;10,0
3501;1:57:00;0;M;13,0
3503;0;2 days, 21:22:00;M;63,0
3504;1:46:00;0;M;15,0
3506;1:48:00;0;F;7,0
3508;1:07:00;0;M;12,0
3509;0;0;M;14,0
3510;0;2 days, 14:39:00;F;35,0
3512;1:39:00;0;F;6,0
3513;1:59:00;0;F;13,0
3516;1:06:00;0;M;7,0
3517;0:48:00;0;M;2,0
3519;6:17:00;0;M;7,0
3520;3:06:00;0;F;21,0
3521;1:40:00;0;F;11,0
3522;0;2 days, 0:35:00;M;50,0
3523;2:40:00;0;M;19,0
3526;1:44:00;0;F;11,0
3527;2:51:00;0;F;13,0
3528;1:57:00;0;F;13,0
3530;0;0;F;4,0
3531;2:27:00;0;F;12,0
3532;0;5 days, 5:38:00;F;22,0
3533;0;0;F;15,0
3534;3:53:00;0;M;12,0
3535;0:40:00;0;M;4,0
3537;2:26:00;0;M;13,0
3538;1:32:00;0;F;12,0
3539;3:27:00;0;F;16,0
3540;1:27:00;0;M;4,0
3541;0:51:00;0;M;4,0
3542;1:49:00;0;F;3,0
3543;1:27:00;0;M;2,0
3544;2:19:00;0;F;6,0
3545;0;2 days, 1:31:00;F;60,0
3547;0;0;M;5,0
3548;0;0;F;
3549;3:56:00;0;M;12,0
3550;0;10 days, 20:37:00;F;129,0
3551;2:50:00;0;F;23,0
3552;1:08:00;0;M;10,0
3555;0;0;F;
3557;3:32:00;0;F;20,0
3558;4:52:00;0;F;3,0
3561;1:22:00;0;F;17,0
3562;0:51:00;0;M;2,0
3565;1 day, 0:39:00;0;M;37,0
3566;0;14:44:00;M;5,0
3567;0;11 days, 11:26:00;M;93,0
3569;1:48:00;0;M;16,0
3571;3:30:00;0;F;13,0
3572;1:30:00;0;F;6,0
3573;3:05:00;0;F;12,0
3574;3:03:00;0;F;8,0
3575;1:20:00;0;F;8,0
3576;1:26:00;0;F;8,0
3578;3:34:00;0;M;6,0
3580;1:24:00;0;M;7,0
3581;0;30 days, 1:44:00;M;141,0
3582;0;2 days, 4:34:00;F;15,0
3583;0;0;F;
3584;0;0;F;
3585;1:14:00;0;M;12,0
3586;1:15:00;0;M;19,0
3587;1:30:00;0;F;12,0
3588;2:28:00;0;F;7,0
3590;0;0;M;
3591;0;0;F;
3592;0;22 days, 20:40:00;M;102,0
3593;0;12:07:00;F;14,0
3594;0;41 days, 7:35:00;M;209,0
3595;2:35:00;0;F;7,0
3596;0;20:44:00;F;44,0
3597;0:32:00;0;F;2,0
3599;0:52:00;0;M;1,0
3600;1:11:00;0;M;17,0
3601;1:37:00;0;F;8,0
3602;5:25:00;0;F;6,0
3603;1:53:00;0;F;11,0
3604;1:26:00;0;M;8,0
3607;3:43:00;0;F;8,0
3608;0;0;F;2,0
3609;0;0;M;
3611;3:12:00;0;M;12,0
3612;0;0;F;
3613;10:45:00;0;M;18,0
3614;0;18:46:00;F;11,0
3615;4:21:00;0;F;8,0
3616;0;0;;
3617;0;4 days, 23:53:00;F;43,0
3618;0;0;F;
3619;3:54:00;0;F;10,0
3621;1:49:00;0;F;8,0
3622;0;6 days, 21:55:00;F;40,0
3623;2:11:00;0;M;
3624;1:48:00;0;M;8,0
3627;1:10:00;0;F;5,0
3630;1:08:00;0;F;5,0
3631;1:14:00;0;F;9,0
3632;0;14:42:00;F;5,0
3633;0;17:43:00;F;7,0
3634;0;17 days, 5:54:00;M;33,0
3635;0;20:23:00;M;29,0
3636;0;2 days, 19:35:00;F;47,0
3637;0;1 day, 13:06:00;M;21,0
3638;1:40:00;0;F;5,0
3639;0;0;F;
3640;1:58:00;0;M;7,0
3641;3:41:00;0;F;13,0
3643;1:47:00;17 days, 7:59:00;M;122,0
3645;2:01:00;0;M;8,0
3646;1:05:00;0;F;1,0
3647;0;3 days, 4:12:00;F;29,0
3649;1:19:00;0;F;10,0
3650;0;0;F;8,0
3651;0;7 days, 17:22:00;M;50,0
3652;0;6 days, 2:38:00;F;31,0
3653;2:17:00;0;M;8,0
3654;2:09:00;0;M;15,0
3655;3:29:00;0;F;16,0
3658;3:56:00;0;M;14,0
3659;1:14:00;0;F;8,0
3660;2:47:00;0;F;8,0
3661;1:43:00;0;F;9,0
3663;0;0;M;
3664;0;0;M;20,0
3665;3:20:00;0;F;17,0
3666;1:44:00;0;M;10,0
3667;2:51:00;0;M;19,0
3668;1:20:00;0;M;2,0
3669;0;8 days, 14:44:00;F;96,0
3670;1:27:00;0;M;19,0
3672;0;0;M;8,0
3673;1:20:00;0;M;6,0
3675;3:33:00;0;F;20,0
3676;2:09:00;0;M;8,0
3677;0;1 day, 1:36:00;F;2,0
3678;7:17:00;0;F;15,0
3679;11:25:00;4 days, 19:31:00;M;70,0
3680;1:58:00;0;M;8,0
3681;0;0;F;5,0
3682;1:29:00;0;F;7,0
3683;0;3 days, 3:56:00;F;54,0
3684;1:50:00;0;F;13,0
3686;0;0;F;
3687;0;7 days, 22:13:00;M;47,0
3688;0:55:00;0;M;5,0
3690;0;5 days, 15:06:00;M;71,0
3691;0;0;F;10,0
3692;2:23:00;0;M;18,0
3693;3:16:00;0;M;14,0
3694;8:54:00;0;F;10,0
3695;4:48:00;0;F;12,0
3696;0;0;M;3,0
3697;0;0;F;
3698;3:17:00;0;F;11,0
3699;1:12:00;0;F;10,0
3700;2:12:00;0;F;5,0
3701;0:54:00;0;F;4,0
3703;2:34:00;0;M;10,0
3705;1:57:00;0;M;9,0
3706;1:05:00;0;M;6,0
3707;1:54:00;0;F;9,0
3708;0:59:00;0;M;5,0
3709;1:39:00;0;F;17,0
3710;0;0;M;19,0
3711;6:11:00;0;F;25,0
3712;1:43:00;0;F;22,0
3713;1:52:00;0;M;14,0
3714;1:35:00;0;M;18,0
3715;0;0;F;
3716;2:06:00;0;M;22,0
3719;1:46:00;0;M;3,0
3721;4:01:00;0;M;4,0
3722;0;0;F;2,0
3723;0;0;F;1,0
3724;0;3 days, 12:05:00;F;22,0
3725;0:47:00;0;F;4,0
3726;2:07:00;0;F;19,0
3727;1:19:00;0;M;2,0
3728;1:03:00;0;M;2,0
3729;2:10:00;0;F;12,0
3731;0;10 days, 4:57:00;M;100,0
3734;1:17:00;0;F;18,0
3735;2:18:00;0;M;5,0
3736;2:02:00;0;F;20,0
3737;1:39:00;0;M;10,0
3738;0;13 days, 0:43:00;M;66,0
3740;1:47:00;0;F;9,0
3742;1:56:00;0;F;9,0
3743;0;1 day, 2:25:00;M;44,0
3745;1:09:00;0;M;12,0
3747;0;0;M;14,0
3748;1:37:00;0;M;6,0
3749;1:01:00;0;M;5,0
3750;2:14:00;0;M;5,0
3751;1:26:00;0;M;7,0
3752;2:45:00;0;M;7,0
3753;12:44:00;0;M;15,0
3754;0;0;M;
3756;2:11:00;0;M;6,0
3757;2:01:00;0;M;17,0
3758;0;0;M;
3759;0;0;M;4,0
3760;1:20:00;0;;6,0
3762;1:06:00;0;F;7,0
3763;2:37:00;0;F;20,0
3764;1:17:00;0;M;14,0
3765;1:15:00;0;F;11,0
3766;2:34:00;0;M;18,0
