%YAML 1.1
%TAG !u! tag:unity3d.com,2011:
--- !u!21 &2100000
Material:
  serializedVersion: 6
  m_ObjectHideFlags: 0
  m_CorrespondingSourceObject: {fileID: 0}
  m_PrefabInstance: {fileID: 0}
  m_PrefabAsset: {fileID: 0}
  m_Name: IstanbulSkybox
  m_Shader: {fileID: 4800000, guid: 4f643b5dfceed044d9e018ed3a11d2e2, type: 3}
  m_ShaderKeywords: _SCREENSPACE_ON
  m_LightmapFlags: 4
  m_EnableInstancingVariants: 0
  m_DoubleSidedGI: 0
  m_CustomRenderQueue: -1
  stringTagMap: {}
  disabledShaderPasses: []
  m_SavedProperties:
    serializedVersion: 3
    m_TexEnvs: []
    m_Ints: []
    m_Floats:
    - _Multiplier: 1
    - _Power: 1
    - _Screenspace: 1
    m_Colors:
    - _BotColor: {r: 0.740566, g: 0.9153078, b: 1, a: 0}
    - _TopColor: {r: 0.41960788, g: 0.5963952, b: 1, a: 0}
  m_BuildTextureStacks: []
