<?xml version="1.0" encoding="UTF-8" standalone="no"?>
<svg
   xmlns:dc="http://purl.org/dc/elements/1.1/"
   xmlns:cc="http://creativecommons.org/ns#"
   xmlns:rdf="http://www.w3.org/1999/02/22-rdf-syntax-ns#"
   xmlns:svg="http://www.w3.org/2000/svg"
   xmlns="http://www.w3.org/2000/svg"
   xmlns:sodipodi="http://sodipodi.sourceforge.net/DTD/sodipodi-0.dtd"
   xmlns:inkscape="http://www.inkscape.org/namespaces/inkscape"
   version="1.1"
   inkscape:output_extension="org.inkscape.output.svg.inkscape"
   sodipodi:docname="interpolate-f12.svg"
   inkscape:version="1.0beta1 (08a003b, 2019-11-10)"
   sodipodi:version="0.32"
   viewBox="0 0 300 31"
   id="svg15699"
   height="31"
   width="300">
  <defs
     id="defs15701" />
  <sodipodi:namedview
     inkscape:lockguides="true"
     id="base"
     pagecolor="#ffffff"
     bordercolor="#666666"
     borderopacity="1.0"
     inkscape:pageopacity="0.0"
     inkscape:pageshadow="2"
     inkscape:zoom="1.4"
     inkscape:cx="324.77314"
     inkscape:cy="-2.7978518"
     inkscape:document-units="px"
     inkscape:current-layer="layer1"
     inkscape:document-rotation="0"
     showgrid="false"
     units="px"
     showguides="true"
     inkscape:guide-bbox="true"
     inkscape:window-width="1866"
     inkscape:window-height="1016"
     inkscape:window-x="54"
     inkscape:window-y="27"
     inkscape:window-maximized="1" />
  <metadata
     id="metadata15704">
    <rdf:RDF>
      <cc:Work
         rdf:about="">
        <dc:format>image/svg+xml</dc:format>
        <dc:type
           rdf:resource="http://purl.org/dc/dcmitype/StillImage" />
        <dc:title></dc:title>
      </cc:Work>
    </rdf:RDF>
  </metadata>
  <g
     id="layer1"
     inkscape:groupmode="layer"
     inkscape:label="Layer 1">
    <g
       transform="translate(-14.035344,-18.39093)"
       id="g2771">
      <path
         inkscape:connector-curvature="0"
         style="fill:#00ff00;fill-opacity:1;stroke:#17a500;stroke-width:0.868842;stroke-linejoin:round;stroke-miterlimit:4;stroke-opacity:1"
         id="path6640"
         d="m 271.63329,45.832003 h -10.65338 l -5.3267,-9.226 5.3267,-9.2261 h 10.65338 l 5.32669,9.2261 z" />
      <path
         inkscape:connector-curvature="0"
         style="fill:#00ff00;fill-opacity:1;stroke:#17a500;stroke-width:0.796746;stroke-linejoin:round;stroke-miterlimit:4;stroke-opacity:1"
         d="m 47.03267,47.010103 c 0,0 -3.49016,-3.2745 -3.620999,-3.2745 -0.06542,0 -0.78972,4.8295 -0.871493,4.8295 -0.08178,0 -2.393507,-4.1658 -2.480734,-4.1658 -0.08723,0 -2.283111,4.3929 -2.364887,4.3929 -0.08178,0 -0.986426,-4.6493 -1.051846,-4.6493 -0.130839,0 -3.580998,3.5262 -3.580998,3.5262 0,0 0.605319,-4.7532 0.539898,-4.8665 -0.03271,-0.0567 -4.358885,2.1917 -4.399772,2.1209 -0.04089,-0.0708 1.978166,-4.3947 1.934554,-4.4702 -0.04361,-0.0755 -4.880586,0.7251 -4.921473,0.6542 -0.04089,-0.0708 3.195449,-3.5398 3.162738,-3.5965 -0.06542,-0.1133 -4.938528,-0.8368 -4.938528,-0.8368 0,0 4.20941,-2.3001 4.274831,-2.4133 0.03271,-0.0567 -4.322017,-2.2315 -4.28113,-2.3023 0.02044,-0.0354 4.690886,-0.9003 4.712352,-0.9375 0.02147,-0.0372 -3.483,-3.4379 -3.461193,-3.4756 0.02181,-0.0378 4.721344,0.5733 4.742809,0.5362 0.02147,-0.0372 -2.271889,-4.3618 -2.251445,-4.3972 0.04089,-0.0708 4.327303,1.9258 4.360015,1.8691 0.06542,-0.1133 -0.767102,-4.9822 -0.767102,-4.9822 0,0 3.490159,3.2745 3.620998,3.2745 0.06542,0 0.78972,-4.8295 0.871494,-4.8295 0.08177,0 2.393507,4.1657 2.480734,4.1657 0.08723,0 2.283111,-4.3928 2.364885,-4.3928 0.08178,0 0.986427,4.6493 1.051848,4.6493 0.130839,0 3.580995,-3.5263 3.580995,-3.5263 0,0 -0.605316,4.7533 -0.539898,4.8666 0.03271,0.0567 4.358887,-2.1917 4.399774,-2.1209 0.04089,0.0708 -1.978168,4.3946 -1.934553,4.4702 0.02181,0.0377 4.836971,-0.8006 4.858436,-0.7635 0.02147,0.0372 -3.231905,3.4767 -3.211462,3.5122 0.04089,0.0708 4.908544,0.7849 4.941254,0.8415 0.06542,0.1133 -4.056764,2.4134 -4.056764,2.4134 0,0 4.349275,2.1842 4.283855,2.2975 -0.03271,0.0566 -4.72019,0.951 -4.761077,1.0218 -0.02044,0.0355 3.484705,3.435 3.463238,3.4722 -0.02147,0.0372 -4.721003,-0.574 -4.742809,-0.5363 -0.04361,0.0756 2.227255,4.4392 2.186368,4.51 -0.04089,0.0708 -4.327303,-1.9258 -4.360015,-1.8691 -0.06542,0.1133 0.767102,4.9822 0.767102,4.9822 0,0 0,0 0,0"
         id="path6642" />
      <g
         id="g6743"
         transform="matrix(0.5218716,0,0,0.5218716,14.289464,-599.88532)">
        <path
           inkscape:connector-curvature="0"
           style="fill:#00ff00;fill-opacity:1;stroke:#17a500;stroke-width:1.66486;stroke-linejoin:round;stroke-miterlimit:4;stroke-opacity:1"
           id="path6745"
           d="m 484.33399,1237.357 c 0,0 -1.3296,-0.1281 -3.13809,-0.1281 -0.88389,0 -1.93931,0.1889 -3.04732,0.1889 -0.95218,0 -2.04891,-0.1629 -3.07288,-0.1629 -1.02425,0 -2.1452,0.1718 -3.15455,0.1718 -1.0231,0 -2.04867,-0.1819 -2.96675,-0.1819 -1.19137,0 -2.38718,0.1379 -3.22492,0.1379 -1.19749,0 -1.93036,-0.068 -1.92408,-0.1228 0.004,-0.036 -0.18849,-0.4046 -0.5261,-0.9894 -0.36178,-0.6266 -1.0531,-1.4431 -1.67125,-2.5137 -0.45722,-0.7919 -0.88544,-1.8395 -1.41873,-2.7631 -0.49575,-0.8587 -1.20003,-1.7196 -1.71605,-2.6134 -0.49895,-0.8642 -0.86908,-1.8602 -1.3467,-2.6874 -0.55223,-0.9565 -1.26537,-1.8899 -1.73058,-2.6957 -0.63409,-1.0982 -0.99699,-2.1019 -1.33875,-2.7027 -0.27652,-0.4805 -0.45641,-0.7663 -0.4841,-0.7807 -0.0498,-0.026 0.28736,-0.7668 0.9383,-1.8943 0.40957,-0.7094 1.09704,-1.6176 1.65789,-2.589 0.47162,-0.8169 0.84436,-1.8328 1.3697,-2.7427 0.48264,-0.836 1.16062,-1.6681 1.64924,-2.5144 0.52074,-0.9019 0.94368,-1.9589 1.42701,-2.7961 0.53375,-0.9245 1.19694,-1.7047 1.62662,-2.449 0.92067,-1.5946 1.50206,-2.8174 1.49838,-2.839 -2.6e-4,0 0.012,0 0.0362,0 0.2146,0 1.49357,0.1281 3.13745,0.1281 0.88526,0 1.94027,-0.1889 3.04671,-0.1889 0.95278,0 2.04947,0.1629 3.07287,0.1629 1.0249,0 2.14601,-0.1717 3.15499,-0.1717 1.02416,0 2.05015,0.1818 2.96779,0.1818 1.19351,0 2.38942,-0.1379 3.22407,-0.1379 1.17635,0 1.89464,0.066 1.88838,0.1204 -0.004,0.037 0.19544,0.4195 0.54448,1.0241 0.36467,0.6316 1.05543,1.4471 1.67101,2.5133 0.45782,0.793 0.88611,1.8407 1.41905,2.7637 0.4905,0.8496 1.18884,1.7002 1.69896,2.5838 0.49458,0.8566 0.86039,1.8451 1.33426,2.6659 0.55117,0.9546 1.26415,1.8878 1.73088,2.6962 0.60208,1.0428 0.94557,2.0069 1.29086,2.605 0.31561,0.5466 0.52356,0.8754 0.55467,0.8914 0.0492,0.025 -0.26893,0.719 -0.88434,1.7849 -0.41064,0.7113 -1.10668,1.6343 -1.68019,2.6276 -0.47037,0.8148 -0.84277,1.8301 -1.36852,2.7407 -0.4823,0.8354 -1.16052,1.6679 -1.64992,2.5156 -0.5291,0.9164 -0.96083,1.9886 -1.45235,2.84 -0.53335,0.9237 -1.19666,1.7042 -1.62723,2.45 -0.93107,1.6126 -1.51636,2.8732 -1.51636,2.8732 0,0 0,0 0,0" />
        <path
           inkscape:connector-curvature="0"
           style="fill:#00ff00;fill-opacity:1;stroke:#17a500;stroke-width:1.66486;stroke-linejoin:round;stroke-miterlimit:4;stroke-opacity:1"
           id="path6747"
           d="m 457.98448,1237.4952 c 0,0 -1.66448,-0.5122 -3.37561,-0.5122 -0.83648,0 -1.91268,0.7554 -2.96123,0.7554 -0.90247,0 -2.20751,-0.6516 -3.17792,-0.6516 -0.97069,0 -2.28456,0.6871 -3.24061,0.6871 -0.96896,0 -2.03877,-0.7272 -2.9073,-0.7272 -1.13259,0 -2.66685,0.5516 -3.45224,0.5516 -1.12264,0 -1.78316,-0.2723 -1.75805,-0.4912 0.0164,-0.1429 -0.15473,-0.5808 -0.47433,-1.1344 -0.34308,-0.5942 -1.50931,-1.0904 -2.09371,-2.1026 -0.43355,-0.7509 -0.5932,-2.2508 -1.09838,-3.1258 -0.46999,-0.814 -1.70953,-1.5253 -2.1982,-2.3716 -0.47266,-0.8187 -0.43207,-2.1679 -0.88376,-2.9502 -0.52555,-0.9103 -1.77773,-1.872 -2.21386,-2.6274 -0.59446,-1.0296 -0.43056,-2.246 -0.74312,-2.8228 -0.25784,-0.4529 -0.49221,-0.7557 -0.603,-0.8134 -0.19917,-0.1036 -0.0973,-0.9077 0.5161,-1.9701 0.38642,-0.6694 1.59026,-1.6244 2.11862,-2.5395 0.44472,-0.7703 0.37447,-2.13 0.86959,-2.9876 0.45508,-0.7882 1.65351,-1.4951 2.11416,-2.293 0.49077,-0.85 0.61261,-2.3589 1.06819,-3.148 0.50528,-0.8751 1.64037,-1.3675 2.04711,-2.072 0.87046,-1.5077 1.32882,-3.1647 1.31407,-3.2513 -10e-4,-0.01 0.01,-0.01 0.0327,-0.01 0.2012,0 1.81821,0.5122 3.37502,0.5122 0.83777,0 1.91358,-0.7554 2.96066,-0.7554 0.90302,0 2.20803,0.6516 3.17791,0.6516 0.9713,0 2.28531,-0.6872 3.24102,-0.6872 0.96995,0 2.04016,0.7273 2.90828,0.7273 1.13458,0 2.66895,-0.5516 3.45143,-0.5516 1.10283,0 1.75042,0.2646 1.72541,0.4819 -0.0169,0.1469 0.16036,0.6017 0.49074,1.1739 0.34579,0.599 1.51149,1.0942 2.09349,2.1023 0.43411,0.7519 0.59382,2.2519 1.09868,3.1263 0.46245,0.801 1.69381,1.4981 2.17462,2.3308 0.46625,0.8076 0.41957,2.1462 0.86626,2.9199 0.52163,0.9035 1.773,1.8638 2.21448,2.6285 0.57228,0.9912 0.40062,2.1705 0.72434,2.7312 0.29588,0.5125 0.56893,0.86 0.69334,0.9238 0.19691,0.101 0.0924,0.8528 -0.48937,1.8604 -0.3889,0.6736 -1.60281,1.6461 -2.14537,2.5858 -0.44343,0.7681 -0.37277,2.1271 -0.86823,2.9852 -0.45472,0.7876 -1.65338,1.4949 -2.11481,2.2941 -0.50125,0.8682 -0.63403,2.396 -1.09973,3.2026 -0.50491,0.8746 -1.64012,1.3671 -2.04769,2.0731 -0.88071,1.5254 -1.32972,3.2903 -1.32972,3.2903 0,0 0,0 0,0" />
        <path
           inkscape:connector-curvature="0"
           style="fill:#00ff00;fill-opacity:1;stroke:#17a500;stroke-width:1.66486;stroke-linejoin:round;stroke-miterlimit:4;stroke-opacity:1"
           id="path6749"
           d="m 414.06864,1237.7255 c 0,0 -2.22263,-1.1525 -3.77149,-1.1525 -0.75747,0 -1.8683,1.6998 -2.81775,1.6998 -0.81961,0 -2.47183,-1.4662 -3.35299,-1.4662 -0.8814,0 -2.51681,1.5461 -3.38405,1.5461 -0.87871,0 -2.02226,-1.6363 -2.80822,-1.6363 -1.03459,0 -3.13296,1.2411 -3.83107,1.2411 -0.99791,0 -1.53785,-0.6126 -1.48134,-1.1052 0.0369,-0.3215 -0.0985,-0.8743 -0.38805,-1.3759 -0.31193,-0.5403 -2.26966,-0.5026 -2.79783,-1.4174 -0.39408,-0.6826 -0.10612,-2.9364 -0.56445,-3.7302 -0.42706,-0.7397 -2.55871,-1.2015 -3.00178,-1.9689 -0.42886,-0.7428 0.29627,-2.6806 -0.11219,-3.3881 -0.48109,-0.8333 -2.63166,-1.8422 -3.01934,-2.5136 -0.52841,-0.9153 0.5135,-2.4862 0.2496,-3.023 -0.2267,-0.4069 -0.55187,-0.738 -0.80115,-0.8677 -0.44815,-0.2333 -0.73843,-1.1426 -0.18759,-2.0967 0.34784,-0.6025 2.4123,-1.6356 2.88653,-2.4569 0.39988,-0.6927 -0.40871,-2.6253 0.036,-3.3957 0.40916,-0.7087 2.475,-1.2069 2.88904,-1.924 0.44081,-0.7635 0.0608,-3.0255 0.47015,-3.7344 0.45785,-0.793 2.37943,-0.8056 2.74794,-1.4439 0.78677,-1.3627 1.04007,-3.7434 1.00688,-3.9382 -0.002,-0.014 0.007,-0.021 0.0269,-0.021 0.17884,0 2.35927,1.1525 3.77096,1.1525 0.75861,0 1.8691,-1.6998 2.81724,-1.6998 0.8201,0 2.47229,1.4662 3.35299,1.4662 0.88194,0 2.51748,-1.5461 3.38441,-1.5461 0.87959,0 2.02349,1.6364 2.80908,1.6364 1.03638,0 3.13483,-1.2411 3.83036,-1.2411 0.9803,0 1.51007,0.5953 1.45378,1.0842 -0.0381,0.3306 0.10189,0.9054 0.40119,1.4238 0.31433,0.5444 2.27159,0.5059 2.79763,1.4171 0.39458,0.6834 0.10667,2.9373 0.56472,3.7307 0.41571,0.72 2.53544,1.1611 2.9674,1.9093 0.41901,0.7257 -0.31515,2.6479 0.0863,3.3432 0.47237,0.8182 2.62107,1.8238 3.02046,2.5156 0.52263,0.9052 -0.50761,2.4432 -0.21986,2.9416 0.263,0.4555 0.64455,0.8341 0.92448,0.9777 0.44303,0.2272 0.69454,1.0758 0.16889,1.9863 -0.35264,0.6108 -2.42968,1.6656 -2.92066,2.516 -0.39851,0.6903 0.41057,2.6221 -0.0344,3.3928 -0.40877,0.708 -2.47481,1.2066 -2.88961,1.925 -0.45485,0.7878 -0.0894,3.0749 -0.51205,3.807 -0.45751,0.7924 -2.3792,0.8052 -2.74845,1.4447 -0.79679,1.3801 -1.01865,3.9855 -1.01865,3.9855 0,0 0,0 0,0" />
        <path
           inkscape:connector-curvature="0"
           style="fill:#00ff00;fill-opacity:1;stroke:#17a500;stroke-width:1.66486;stroke-linejoin:round;stroke-miterlimit:4;stroke-opacity:1"
           id="path6751"
           d="m 352.58646,1238.048 c 0,0 -3.00403,-2.0488 -4.32571,-2.0488 -0.64686,0 -1.80617,3.0217 -2.61689,3.0217 -0.7036,0 -2.84188,-2.6065 -3.59809,-2.6065 -0.7564,0 -2.84196,2.7486 -3.58486,2.7486 -0.75235,0 -1.99914,-2.909 -2.66949,-2.909 -0.89742,0 -3.78551,2.2064 -4.36146,2.2064 -0.82327,0 -1.1944,-1.089 -1.09395,-1.9648 0.0656,-0.5715 -0.0197,-1.2852 -0.26726,-1.714 -0.2683,-0.4648 -3.33413,0.3203 -3.78359,-0.4582 -0.33882,-0.5869 0.5758,-3.8962 0.18305,-4.5764 -0.36695,-0.6356 -3.74755,-0.7481 -4.1268,-1.4049 -0.36751,-0.6366 1.31596,-3.3986 0.96801,-4.0013 -0.41883,-0.7254 -3.82716,-1.8003 -4.14699,-2.3543 -0.43594,-0.7551 1.83519,-2.8224 1.6394,-3.3033 -0.1831,-0.3425 -0.6354,-0.7131 -1.07856,-0.9437 -0.7967,-0.4147 -1.636,-1.4715 -1.17274,-2.2739 0.29382,-0.5089 3.56315,-1.6512 3.96158,-2.3413 0.3371,-0.5839 -1.50514,-3.3187 -1.13091,-3.9669 0.34487,-0.5974 3.62509,-0.8035 3.97387,-1.4075 0.37087,-0.6424 -0.71164,-3.9587 -0.36711,-4.5554 0.39144,-0.678 3.41411,-0.019 3.72911,-0.5645 0.66959,-1.1598 0.6358,-4.5537 0.57681,-4.8999 -0.004,-0.024 0.002,-0.037 0.0189,-0.037 0.14754,0 3.11676,2.0488 4.32528,2.0488 0.64779,0 1.80682,-3.0218 2.61646,-3.0218 0.704,0 2.84226,2.6065 3.59808,2.6065 0.75685,0 2.84252,-2.7486 3.58516,-2.7486 0.75308,0 2.00016,2.9091 2.67022,2.9091 0.89888,0 3.78705,-2.2064 4.36086,-2.2064 0.80874,0 1.17357,1.0584 1.0735,1.9275 -0.0677,0.5878 0.02,1.3305 0.2758,1.7735 0.2703,0.4682 3.33574,-0.3175 3.78343,0.4579 0.33924,0.5876 -0.57534,3.897 -0.18282,4.5768 0.35027,0.6067 3.71373,0.6895 4.0773,1.3192 0.35287,0.6112 -1.34377,3.3504 -1.00574,3.9359 0.40341,0.6987 3.80836,1.7679 4.14883,2.3575 0.45311,0.7848 -1.77914,2.825 -1.54175,3.2361 0.21698,0.3759 0.75042,0.798 1.24809,1.0533 0.7876,0.4039 1.53756,1.3881 1.09046,2.1625 -0.3019,0.5229 -3.58732,1.693 -4.00609,2.4184 -0.33563,0.5813 1.50725,3.315 1.13295,3.9633 -0.34443,0.5966 -3.62482,0.803 -3.97435,1.4084 -0.38987,0.6753 0.67313,4.0253 0.31072,4.653 -0.39116,0.6775 -3.41392,0.019 -3.72952,0.5652 -0.67929,1.1766 -0.58315,4.9587 -0.58315,4.9587 0,0 0,0 0,0" />
        <path
           inkscape:connector-curvature="0"
           style="fill:#00ff00;fill-opacity:1;stroke:#17a500;stroke-width:1.66486;stroke-linejoin:round;stroke-miterlimit:4;stroke-opacity:1"
           id="path6753"
           d="m 273.53794,1238.4626 c 0,0 -4.00869,-3.2013 -5.03829,-3.2013 -0.50462,0 -1.72628,4.7215 -2.35863,4.7215 -0.55444,0 -3.31765,-4.0726 -3.9132,-4.0726 -0.5957,0 -3.26003,4.2946 -3.84305,4.2946 -0.58991,0 -1.96943,-4.5453 -2.49114,-4.5453 -0.72104,0 -4.62451,3.4474 -5.04338,3.4474 -0.59875,0 -0.75283,-1.7015 -0.59587,-3.0698 0.10244,-0.8931 0.0816,-1.8136 -0.11195,-2.1489 -0.21223,-0.3676 -4.70276,1.3783 -5.051,0.7751 -0.26779,-0.4638 1.45254,-5.1301 1.14411,-5.6643 -0.28966,-0.5018 -5.27606,-0.1652 -5.57324,-0.6799 -0.28865,-0.5 2.62699,-4.3216 2.35684,-4.7895 -0.3388,-0.5868 -5.36424,-1.7467 -5.59685,-2.1495 -0.31704,-0.5492 3.5345,-3.2547 3.4263,-3.6636 -0.12706,-0.2597 -0.74281,-0.6812 -1.43524,-1.0417 -1.24485,-0.6479 -2.79001,-1.8942 -2.43937,-2.5016 0.22437,-0.3886 5.04281,-1.6714 5.3438,-2.1927 0.25638,-0.4441 -2.91484,-4.2102 -2.63128,-4.7014 0.26221,-0.4541 5.10378,-0.2846 5.36866,-0.7434 0.28094,-0.4866 -1.70484,-5.1585 -1.44359,-5.6109 0.30605,-0.5301 4.74442,0.9926 4.9906,0.5662 0.51895,-0.8988 0.11605,-5.5954 0.0239,-6.1364 -0.006,-0.038 -0.004,-0.058 0.008,-0.058 0.10731,0 4.09067,3.2013 5.03797,3.2013 0.50531,0 1.72676,-4.7215 2.35833,-4.7215 0.55473,0 3.31793,4.0726 3.9132,4.0726 0.59602,0 3.26043,-4.2946 3.84326,-4.2946 0.59044,0 1.97017,4.5453 2.49167,4.5453 0.72211,0 4.62563,-3.4474 5.04295,-3.4474 0.58817,0 0.74092,1.6538 0.58457,3.0117 -0.10574,0.9184 -0.0852,1.8771 0.11459,2.2232 0.21367,0.3701 4.70392,-1.3763 5.05088,-0.7754 0.26809,0.4644 -1.45221,5.1308 -1.14395,5.6647 0.26614,0.461 5.22867,0.083 5.5043,0.5604 0.26786,0.464 -2.66626,4.2536 -2.40974,4.6979 0.31476,0.5452 5.3349,1.6959 5.59961,2.1544 0.36372,0.63 -3.41396,3.3157 -3.24132,3.6147 0.15781,0.2734 0.88654,0.7515 1.66414,1.1503 1.23064,0.6312 2.62146,1.7896 2.27534,2.3891 -0.23665,0.4099 -5.0757,1.7284 -5.40163,2.2929 -0.25477,0.4413 2.91727,4.206 2.63383,4.6969 -0.26171,0.4534 -5.1034,0.284 -5.369,0.744 -0.30633,0.5306 1.6535,5.2475 1.36857,5.741 -0.30585,0.5297 -4.74428,-0.9929 -4.9909,-0.5658 -0.52822,0.9149 -0.0232,6.21 -0.0232,6.21 0,0 0,0 0,0" />
        <path
           inkscape:connector-curvature="0"
           style="fill:#00ff00;fill-opacity:1;stroke:#17a500;stroke-width:1.66486;stroke-linejoin:round;stroke-miterlimit:4;stroke-opacity:1"
           id="path6755"
           d="m 176.92308,1238.9693 c 0,0 -5.2366,-4.6098 -5.90921,-4.6098 -0.33079,0 -1.62864,6.799 -2.04298,6.799 -0.37214,0 -3.89916,-5.8646 -4.29836,-5.8646 -0.39927,0 -3.77098,6.1843 -4.15861,6.1843 -0.39135,0 -1.9331,-6.5454 -2.27315,-6.5454 -0.50547,0 -5.64995,4.9644 -5.87684,4.9644 -0.32432,0 -0.21313,-2.4502 0.0129,-4.4206 0.14751,-1.286 0.2054,-2.4594 0.0779,-2.6803 -0.14369,-0.2489 -6.37552,2.6715 -6.60006,2.2826 -0.18096,-0.3135 2.52412,-6.6385 2.31875,-6.9942 -0.19521,-0.3381 -7.14424,0.5474 -7.34112,0.2064 -0.19226,-0.3331 4.22935,-5.4498 4.05429,-5.753 -0.24097,-0.4174 -7.24289,-1.681 -7.36888,-1.8992 -0.17173,-0.2975 5.61143,-3.783 5.61028,-4.1041 -0.0586,-0.1584 -0.87408,-0.6422 -1.87117,-1.1611 -1.79259,-0.9331 -4.20049,-2.4111 -3.98748,-2.78 0.13949,-0.2417 6.85129,-1.6961 7.03318,-2.0111 0.15773,-0.2732 -4.63782,-5.2999 -4.46507,-5.5991 0.16119,-0.2792 6.91107,0.3494 7.07339,0.068 0.17103,-0.2963 -2.91873,-6.625 -2.75927,-6.9011 0.20169,-0.3494 6.37035,2.229 6.53242,1.9482 0.33482,-0.5799 -0.5192,-6.8687 -0.65194,-7.6477 -0.009,-0.054 -0.0108,-0.083 -0.004,-0.083 0.0581,0 5.28101,4.6098 5.90904,4.6098 0.33116,0 1.6289,-6.799 2.04281,-6.799 0.3723,0 3.89931,5.8646 4.29836,5.8646 0.39945,0 3.7712,-6.1843 4.15872,-6.1843 0.39164,0 1.93351,6.5453 2.27344,6.5453 0.50605,0 5.65056,-4.9643 5.8766,-4.9643 0.3186,0 0.21215,2.3815 -0.013,4.3369 -0.15226,1.3224 -0.21385,2.5452 -0.0824,2.7728 0.14447,0.2502 6.37615,-2.6704 6.59999,-2.2827 0.18113,0.3138 -2.52393,6.6387 -2.31865,6.9943 0.16331,0.2828 7.08026,-0.6581 7.24841,-0.3669 0.16394,0.284 -4.28264,5.3574 -4.12574,5.6292 0.2064,0.3575 7.20066,1.6079 7.37277,1.906 0.25447,0.4407 -5.41208,3.9156 -5.31856,4.0776 0.0855,0.148 1.0529,0.6946 2.17265,1.2689 1.77211,0.9088 3.94621,2.2803 3.72353,2.666 -0.15692,0.2718 -6.89485,1.7714 -7.1073,2.1394 -0.15596,0.2702 4.64063,5.295 4.46825,5.5936 -0.16062,0.2782 -6.91056,-0.3502 -7.07358,-0.068 -0.20423,0.3538 2.85173,6.7411 2.66148,7.0706 -0.20157,0.3491 -6.37027,-2.2291 -6.53258,-1.948 -0.34357,0.5951 0.66112,7.7393 0.66112,7.7393 0,0 0,0 0,0" />
      </g>
    </g>
  </g>
</svg>
