<?xml version="1.0" encoding="UTF-8" standalone="no"?>
<svg
   xmlns:dc="http://purl.org/dc/elements/1.1/"
   xmlns:cc="http://creativecommons.org/ns#"
   xmlns:rdf="http://www.w3.org/1999/02/22-rdf-syntax-ns#"
   xmlns:svg="http://www.w3.org/2000/svg"
   xmlns="http://www.w3.org/2000/svg"
   xmlns:xlink="http://www.w3.org/1999/xlink"
   xmlns:sodipodi="http://sodipodi.sourceforge.net/DTD/sodipodi-0.dtd"
   xmlns:inkscape="http://www.inkscape.org/namespaces/inkscape"
   version="1.1"
   inkscape:output_extension="org.inkscape.output.svg.inkscape"
   width="300"
   height="100"
   viewBox="0 0 300 100"
   id="svg2586"
   sodipodi:version="0.32"
   inkscape:version="1.0beta1 (c8cd966, 2019-11-15)"
   sodipodi:docname="shapes-f17.svg">
  <defs
     id="defs3" />
  <sodipodi:namedview
     inkscape:lockguides="true"
     id="base"
     pagecolor="#ffffff"
     bordercolor="#666666"
     borderopacity="1.0"
     inkscape:pageopacity="0.0"
     inkscape:pageshadow="2"
     inkscape:zoom="1.4"
     inkscape:cx="150"
     inkscape:cy="50"
     inkscape:document-units="px"
     inkscape:current-layer="layer1"
     inkscape:document-rotation="0"
     showgrid="false"
     units="px"
     showguides="true"
     inkscape:guide-bbox="true"
     inkscape:window-width="1866"
     inkscape:window-height="1016"
     inkscape:window-x="54"
     inkscape:window-y="27"
     inkscape:window-maximized="1" />
  <metadata
     id="metadata4">
    <rdf:RDF>
      <cc:Work
         rdf:about="">
        <dc:format>image/svg+xml</dc:format>
        <dc:type
           rdf:resource="http://purl.org/dc/dcmitype/StillImage" />
        <dc:title />
      </cc:Work>
    </rdf:RDF>
  </metadata>
  <g
     inkscape:label="Layer 1"
     inkscape:groupmode="layer"
     id="layer1">
    <path
       sodipodi:type="inkscape:offset"
       inkscape:radius="-4.4234619"
       inkscape:original="M 60.472656 16.279297 C 54.974844 17.168166 53.047201 37.122537 47 38.806641 C 40.264438 40.682448 26.489307 22.788056 21.388672 27.570312 C 16.504021 32.150066 35.181185 44.968771 33.511719 51.453125 C 31.768434 58.224197 9.3833714 61.20917 10.974609 68.017578 C 12.498467 74.537687 32.937868 64.772961 37.71875 69.460938 C 42.711028 74.356202 34.103049 95.231661 40.794922 97.257812 C 47.203431 99.198167 48.967621 76.614736 55.417969 74.818359 C 62.153531 72.942552 75.928662 90.836944 81.029297 86.054688 C 85.913948 81.474934 67.238737 68.654276 68.908203 62.169922 C 70.651488 55.39885 93.034597 52.41583 91.443359 45.607422 C 89.919502 39.087313 69.480101 48.852039 64.699219 44.164062 C 59.706941 39.268798 68.31492 18.393339 61.623047 16.367188 C 61.222515 16.245915 60.839177 16.220039 60.472656 16.279297 z "
       xlink:href="#path2693"
       style="fill:#ffb800;fill-opacity:0.75;fill-rule:evenodd;stroke:#000000;stroke-width:0.473298;stroke-linecap:butt;stroke-linejoin:miter;stroke-miterlimit:4;stroke-dashoffset:0;stroke-opacity:1;marker:none"
       id="path2694"
       inkscape:href="#path2693"
       d="m 59.611328,24.998047 c -0.502061,1.254518 -0.975225,2.279377 -1.509766,3.753906 -0.965248,2.662638 -1.968934,5.472883 -3.304687,8.009766 -1.335753,2.536883 -2.981215,5.296223 -6.609375,6.30664 C 44.377189,44.129504 41.360418,42.558588 38.662109,41 c -2.698308,-1.558588 -5.282304,-3.549456 -7.710937,-5.345703 -1.18153,-0.873874 -1.97887,-1.283037 -3.021484,-1.978516 0.639738,0.821111 0.945293,1.374312 1.703124,2.277344 1.900513,2.26465 4.009611,4.683975 5.695313,7.242187 1.685702,2.558213 3.468445,5.470837 2.466797,9.361329 -0.986173,3.830382 -3.853824,5.657098 -6.552734,7.214843 -2.698911,1.557746 -5.714405,2.800412 -8.484376,4.00586 -1.349296,0.587192 -2.10387,1.072952 -3.228515,1.628906 1.03191,-0.143511 1.665843,-0.130956 2.828125,-0.335938 2.911432,-0.513464 6.060863,-1.129882 9.11914,-1.310546 3.058278,-0.180665 6.471478,-0.269658 9.339844,2.542968 2.823985,2.769107 2.971167,6.167237 2.970703,9.283204 -4.63e-4,3.115966 -0.430385,6.348404 -0.771484,9.349609 -0.165964,1.460254 -0.12221,2.354778 -0.203125,3.605469 0.391405,-0.964773 0.71777,-1.507128 1.121094,-2.615235 1.011163,-2.778107 2.053007,-5.81388 3.425781,-8.552734 1.372774,-2.738855 3.00113,-5.738648 6.871094,-6.816406 3.810311,-1.061145 6.827082,0.509771 9.52539,2.068359 2.698309,1.558588 5.282305,3.549456 7.710938,5.345703 1.182949,0.874924 1.981791,1.284467 3.025391,1.980469 -0.640377,-0.822258 -0.948133,-1.376736 -1.707032,-2.28125 C 70.884893,75.40504 68.775297,72.986109 67.089844,70.427734 65.404391,67.869359 63.62339,64.956748 64.625,61.066406 c 0.986136,-3.830239 3.853955,-5.657264 6.552734,-7.214844 2.69878,-1.557579 5.71465,-2.800654 8.484375,-4.005859 1.348024,-0.586572 2.100763,-1.071534 3.22461,-1.626953 -1.031342,0.143467 -1.664682,0.131095 -2.826172,0.335938 -2.911433,0.513464 -6.060864,1.129882 -9.119141,1.310546 -3.058277,0.180665 -6.471477,0.269658 -9.339844,-2.542968 -2.823984,-2.769107 -2.971166,-6.167237 -2.970703,-9.283204 4.64e-4,-3.115966 0.430386,-6.348404 0.771485,-9.349609 0.169922,-1.495083 0.128941,-2.418831 0.208984,-3.691406 z"
       transform="matrix(1.32052,0,0,1.32052,81.598722,-18)" />
    <path
       sodipodi:type="inkscape:offset"
       inkscape:radius="9.9201479"
       inkscape:original="M 60.472656 16.279297 C 54.974844 17.168166 53.047201 37.122537 47 38.806641 C 40.264438 40.682448 26.489307 22.788056 21.388672 27.570312 C 16.504021 32.150066 35.181185 44.968771 33.511719 51.453125 C 31.768434 58.224197 9.3833714 61.20917 10.974609 68.017578 C 12.498467 74.537687 32.937868 64.772961 37.71875 69.460938 C 42.711028 74.356202 34.103049 95.231661 40.794922 97.257812 C 47.203431 99.198167 48.967621 76.614736 55.417969 74.818359 C 62.153531 72.942552 75.928662 90.836944 81.029297 86.054688 C 85.913948 81.474934 67.238737 68.654276 68.908203 62.169922 C 70.651488 55.39885 93.034597 52.41583 91.443359 45.607422 C 89.919502 39.087313 69.480101 48.852039 64.699219 44.164062 C 59.706941 39.268798 68.31492 18.393339 61.623047 16.367188 C 61.222515 16.245915 60.839177 16.220039 60.472656 16.279297 z "
       xlink:href="#path2693"
       style="color:#000000;fill:#ffb800;fill-opacity:0.75;fill-rule:evenodd;stroke:#000000;stroke-width:0.755409;stroke-linecap:butt;stroke-linejoin:miter;stroke-miterlimit:4;stroke-dashoffset:0;stroke-opacity:1;marker:none"
       id="path2696"
       inkscape:href="#path2693"
       d="m 61.763672,6.3710938 c -0.952398,-0.070252 -1.929231,-0.037675 -2.875,0.1152343 -7.05734,1.1410086 -9.252211,5.9054079 -10.796875,8.8847659 -1.544664,2.979358 -2.520166,5.853968 -3.476563,8.492187 -0.463012,1.277221 -0.796168,1.957483 -1.214843,3.009766 -1.260049,-0.874367 -2.355764,-1.593129 -3.919922,-2.75 -2.535707,-1.875441 -5.169511,-3.915772 -8.728516,-5.558594 -1.779502,-0.821411 -3.86551,-1.630487 -6.759765,-1.722656 -2.894256,-0.09217 -6.812485,1.076805 -9.388672,3.492187 -2.603394,2.440892 -4.089231,6.722778 -3.935547,9.804688 0.153684,3.08191 1.122097,5.136867 2.035156,6.849609 1.826119,3.425485 3.9634,5.826228 5.943359,8.185547 1.148611,1.368684 1.833319,2.303685 2.728516,3.431641 -1.387127,0.654098 -2.556327,1.243372 -4.339844,2.019531 -2.892103,1.258598 -5.975657,2.52023 -9.1777341,4.78125 -1.6010388,1.13051 -3.3442917,2.531851 -4.8710938,4.992188 -1.526802,2.460336 -2.4755929,6.438095 -1.671875,9.876953 0.8121582,3.474969 3.7776812,6.902623 6.5234375,8.310547 2.7457564,1.407923 5.0113774,1.596402 6.9511714,1.662109 3.87959,0.131414 7.025438,-0.517802 10.058594,-1.052735 1.759523,-0.310312 2.911567,-0.4372 4.335938,-0.648437 -0.127129,1.527928 -0.200333,2.835492 -0.419922,4.767578 -0.356141,3.133556 -0.806237,6.434384 -0.449219,10.337891 0.178509,1.951753 0.519307,4.162431 1.886719,6.714846 1.367412,2.55241 4.339067,5.36147 7.71875,6.38476 3.415528,1.03415 7.868796,0.17971 10.460937,-1.49414 2.592142,-1.67384 3.887204,-3.54048 4.914063,-5.1875 2.053719,-3.294041 3.063744,-6.344012 4.117187,-9.238279 0.610953,-1.678554 1.076254,-2.739135 1.605469,-4.078125 1.259864,0.87427 2.35613,1.591447 3.919922,2.748047 2.535707,1.875441 5.16951,3.915772 8.728516,5.558594 1.779502,0.821411 3.86551,1.630487 6.759765,1.722656 2.894256,0.09217 6.812485,-1.076805 9.388672,-3.492187 2.603402,-2.4409 4.089005,-6.722993 3.935547,-9.804688 -0.153458,-3.081695 -1.122294,-5.136773 -2.035156,-6.849609 -1.825725,-3.425673 -3.961681,-5.825957 -5.941406,-8.185547 -1.148243,-1.368565 -1.833504,-2.303696 -2.728516,-3.431641 1.387,-0.653984 2.556358,-1.245427 4.339844,-2.021484 2.891862,-1.258351 5.973718,-2.518378 9.175781,-4.779297 1.601031,-1.130459 3.34431,-2.531773 4.871094,-4.992188 1.526779,-2.460414 2.475529,-6.438365 1.671879,-9.876953 -0.81216,-3.474969 -3.777685,-6.902622 -6.523442,-8.310547 -2.745756,-1.407924 -5.011377,-1.596402 -6.951172,-1.662109 -3.879589,-0.131414 -7.025437,0.517802 -10.058594,1.052735 -1.759522,0.310312 -2.911566,0.4372 -4.335937,0.648437 0.127128,-1.527928 0.200333,-2.835492 0.419922,-4.767578 0.356141,-3.133556 0.806236,-6.434384 0.449219,-10.337891 C 73.925007,18.020903 73.584209,15.810225 72.216797,13.257812 70.849385,10.7054 67.877729,7.8963399 64.498047,6.8730469 63.644977,6.6147547 62.716069,6.4413453 61.763672,6.3710938 Z"
       transform="matrix(0.827366,0,0,0.827366,205.20959,10.537)" />
    <path
       sodipodi:type="star"
       style="color:#000000;fill:#ffb800;fill-opacity:0.75;fill-rule:evenodd;stroke:#000000;stroke-width:0.625;stroke-linecap:butt;stroke-linejoin:miter;stroke-miterlimit:4;stroke-dashoffset:0;stroke-opacity:1;marker:none;marker-start:none;marker-mid:none;marker-end:none"
       id="path2693"
       sodipodi:sides="6"
       sodipodi:cx="51.209373"
       sodipodi:cy="56.812424"
       sodipodi:r1="41.765072"
       sodipodi:r2="18.491833"
       sodipodi:arg1="0.77559456"
       sodipodi:arg2="1.3411834"
       inkscape:flatsided="false"
       inkscape:rounded="0.25"
       inkscape:randomized="0"
       d="M 81.029839,86.053851 C 75.929204,90.836107 62.153689,72.943123 55.418126,74.81893 48.967778,76.615307 47.204296,99.198773 40.795787,97.258418 34.103914,95.232267 42.711936,74.355828 37.719658,69.460564 32.938775,64.772587 12.49918,74.537099 10.975322,68.016991 9.3840839,61.208583 31.767621,58.225129 33.510905,51.454057 35.180371,44.969703 16.504257,32.15075 21.388908,27.570996 c 5.100635,-4.782256 18.87615,13.110728 25.611713,11.234921 6.450348,-1.796377 8.21383,-24.379842 14.622339,-22.439488 6.691873,2.026152 -1.916149,22.90259 3.076129,27.797855 4.780883,4.687977 25.220478,-5.076536 26.744336,1.443573 1.591238,6.808408 -20.792299,9.791861 -22.535583,16.562933 -1.669466,6.484354 17.006648,19.303307 12.121997,23.883061 z" />
    <text
       id="text985"
       y="6"
       x="51.01371"
       style="font-size:6px;font-family:'Liberation Sans',Arial,sans-serif;line-height:1.25;text-align:center;text-anchor:middle"
       xml:space="preserve"><tspan
         y="6"
         x="51.01371"
         id="tspan983"
         sodipodi:role="line">Original star</tspan></text>
    <text
       id="text989"
       y="6"
       x="144.32384"
       style="font-size:6px;font-family:'Liberation Sans',Arial,sans-serif;line-height:1.25;text-align:center;text-anchor:middle"
       xml:space="preserve"><tspan
         y="6"
         x="144.32384"
         id="tspan987"
         sodipodi:role="line">Linked offset, inset</tspan></text>
    <text
       id="text993"
       y="6"
       x="246.51053"
       style="font-size:6px;font-family:'Liberation Sans',Arial,sans-serif;line-height:1.25;text-align:center;text-anchor:middle"
       xml:space="preserve"><tspan
         y="6"
         x="246.51053"
         id="tspan991"
         sodipodi:role="line">Linked offset, outset</tspan></text>
  </g>
</svg>
