<?xml version="1.0" standalone="no"?>
<!DOCTYPE svg PUBLIC "-//W3C//DTD SVG 20010904//EN"
 "http://www.w3.org/TR/2001/REC-SVG-20010904/DTD/svg10.dtd">
<svg version="1.0" xmlns="http://www.w3.org/2000/svg"
 width="2160.000000pt" height="2160.000000pt" viewBox="0 0 2160.000000 2160.000000"
 preserveAspectRatio="xMidYMid meet">

<g transform="translate(0.000000,2160.000000) scale(0.100000,-0.100000)"
fill="#000000" stroke="none">
<path d="M11485 21589 c-402 -11 -527 -38 -569 -125 -21 -45 -20 -89 4 -194
27 -117 26 -197 -3 -231 -34 -41 -95 -66 -203 -84 -79 -12 -244 -17 -819 -25
-910 -12 -1060 -23 -1176 -88 -67 -37 -95 -88 -109 -197 -20 -159 0 -273 72
-419 88 -176 226 -321 513 -539 217 -164 370 -308 409 -386 l18 -33 -34 -35
c-77 -82 -321 -222 -743 -428 -342 -166 -492 -258 -829 -505 -865 -634 -1949
-1699 -2577 -2530 -235 -312 -315 -439 -455 -724 -162 -332 -212 -407 -341
-513 -140 -115 -324 -185 -788 -303 -862 -219 -1333 -363 -1820 -558 -789
-315 -1404 -694 -1647 -1016 -79 -104 -112 -178 -147 -329 -60 -255 -43 -485
52 -708 120 -285 387 -542 733 -707 72 -34 274 -118 448 -186 175 -69 320
-127 323 -130 3 -3 28 -619 54 -1368 86 -2409 225 -5109 330 -6387 33 -409 57
-747 52 -751 -4 -4 -237 -60 -518 -125 -636 -146 -1153 -274 -1270 -316 -104
-36 -216 -97 -263 -142 -45 -44 -91 -126 -108 -195 -25 -103 -43 -270 -44
-404 -2 -222 35 -347 125 -425 55 -48 107 -69 233 -93 90 -17 133 -19 243 -14
297 12 668 72 1274 204 473 103 730 182 946 290 471 237 676 557 740 1160 21
196 16 697 -10 1030 -150 1907 -183 2379 -251 3605 -128 2313 -157 2860 -155
2863 7 8 525 -590 635 -733 286 -369 620 -919 1000 -1645 133 -256 301 -562
373 -680 1156 -1914 3186 -3526 5085 -4036 114 -30 389 -96 612 -145 1009
-224 1008 -224 1100 -280 51 -32 91 -78 115 -135 36 -81 45 -157 51 -439 8
-328 -5 -456 -59 -585 -92 -222 -312 -306 -1087 -415 -409 -57 -720 -121 -935
-192 -114 -37 -218 -90 -212 -108 13 -37 326 -84 752 -111 213 -14 500 -17
1578 -21 l1317 -5 0 449 c1 714 23 1042 89 1290 32 120 48 158 77 185 72 64
534 214 1011 327 114 27 334 83 488 125 2210 601 4166 2120 5345 4151 394 679
731 1501 880 2145 272 1185 272 3231 0 4425 -50 218 -79 316 -179 605 -389
1127 -978 2161 -1731 3045 -438 514 -856 897 -1568 1439 -194 148 -352 272
-350 277 2 5 103 113 224 241 363 382 494 550 565 728 30 76 31 206 1 271 -35
80 -123 160 -248 227 -220 118 -481 183 -1392 343 -227 40 -416 75 -421 79
-11 7 39 618 78 957 17 144 31 269 31 278 0 13 -58 15 -522 15 -791 0 -1230
-32 -1574 -115 -216 -51 -238 -61 -437 -187 -126 -81 -169 -98 -246 -98 -77 0
-131 20 -275 102 -195 112 -267 141 -446 186 -218 54 -491 89 -802 102 -136 5
-269 9 -295 8 -26 -1 -169 -5 -318 -9z m920 -766 c575 -401 1003 -672 1141
-724 52 -20 56 -20 107 -3 149 49 383 183 1116 639 314 195 573 355 575 355 2
0 6 -228 9 -507 6 -539 14 -648 58 -783 28 -85 44 -115 91 -175 120 -151 336
-206 873 -220 189 -5 232 -9 302 -29 96 -27 127 -45 153 -88 22 -36 18 -67
-16 -143 -57 -129 -187 -177 -394 -145 -144 23 -305 68 -730 206 -783 255
-1058 313 -1797 379 -435 39 -1019 65 -2003 90 -864 22 -1226 46 -1305 87
l-29 15 23 12 c30 16 236 56 391 76 322 41 704 97 785 117 244 57 298 135 296
430 0 140 -21 510 -36 641 l-6 49 33 -25 c18 -13 182 -128 363 -254z m-8309
-8064 c50 -47 56 -193 24 -539 -36 -388 -118 -978 -139 -1003 -11 -12 -633
241 -1608 655 -288 122 -519 225 -515 229 15 12 748 282 1045 384 361 124 882
274 1032 298 58 10 138 -3 161 -24z"/>
</g>
</svg>
