<?xml version="1.0" encoding="UTF-8" standalone="no"?>
<svg
   xmlns:dc="http://purl.org/dc/elements/1.1/"
   xmlns:cc="http://creativecommons.org/ns#"
   xmlns:rdf="http://www.w3.org/1999/02/22-rdf-syntax-ns#"
   xmlns:svg="http://www.w3.org/2000/svg"
   xmlns="http://www.w3.org/2000/svg"
   xmlns:xlink="http://www.w3.org/1999/xlink"
   xmlns:sodipodi="http://sodipodi.sourceforge.net/DTD/sodipodi-0.dtd"
   xmlns:inkscape="http://www.inkscape.org/namespaces/inkscape"
   data-v-fde0c5aa=""
   viewBox="0 0 300 300"
   class="iconAbove"
   version="1.1"
   id="svg18"
   sodipodi:docname="default.svg"
   inkscape:version="0.92.5 (2060ec1f9f, 2020-04-08)"
   inkscape:export-filename="/home/sergio/Desktop/hive-open-stats/vector/default.png"
   inkscape:export-xdpi="327"
   inkscape:export-ydpi="327">
  <metadata
     id="metadata22">
    <rdf:RDF>
      <cc:Work
         rdf:about="">
        <dc:format>image/svg+xml</dc:format>
        <dc:type
           rdf:resource="http://purl.org/dc/dcmitype/StillImage" />
      </cc:Work>
    </rdf:RDF>
  </metadata>
  <sodipodi:namedview
     pagecolor="#ffffff"
     bordercolor="#666666"
     borderopacity="1"
     objecttolerance="10"
     gridtolerance="10"
     guidetolerance="10"
     inkscape:pageopacity="0"
     inkscape:pageshadow="2"
     inkscape:window-width="2728"
     inkscape:window-height="1828"
     id="namedview20"
     showgrid="false"
     inkscape:zoom="3.1466667"
     inkscape:cx="74.552093"
     inkscape:cy="124.7958"
     inkscape:window-x="0"
     inkscape:window-y="0"
     inkscape:window-maximized="0"
     inkscape:current-layer="svg18" />
  <!---->
  <defs
     data-v-fde0c5aa=""
     id="defs2">
    <linearGradient
       inkscape:collect="always"
       id="linearGradient855">
      <stop
         style="stop-color:#2b0000;stop-opacity:1"
         offset="0"
         id="stop851" />
      <stop
         style="stop-color:#550000;stop-opacity:1"
         offset="1"
         id="stop853" />
    </linearGradient>
    <!---->
    <linearGradient
       inkscape:collect="always"
       xlink:href="#linearGradient855"
       id="linearGradient857"
       x1="84.942703"
       y1="-7.4116774"
       x2="206.73885"
       y2="304.49432"
       gradientUnits="userSpaceOnUse" />
  </defs>
  <rect
     data-v-fde0c5aa=""
     fill="#AD0023"
     x="0"
     y="0"
     width="300px"
     height="300px"
     class="logo-background-square"
     id="rect4"
     style="fill-opacity:1;fill:url(#linearGradient857)" />
  <g
     data-v-fde0c5aa=""
     id="c74fe5d2-be6c-44af-9dbe-52d90f8fb014"
     transform="matrix(2.7277914,0,0,2.7277914,84.535613,65.775905)"
     style="fill:#e31337;fill-opacity:1;stroke:none">
    <path
       d="m 42.6,9.6 c 0,0 -0.1,0.1 0,0 l -5.8,5.5 c 1.1,1.5 1.9,3.2 2.5,5 1,3.4 0.8,7 -0.5,10.3 L 45.3,34 C 49.1,25.8 47.8,16.4 42.6,9.6 Z M 21.8,0.7 23.4,8.6 h 0.5 c 2.7,0 5.3,0.7 7.7,2 0.9,0.5 1.7,1 2.4,1.7 L 39.7,6.9 39.8,6.8 C 38.4,5.5 36.9,4.4 35.2,3.5 31.9,1.5 28,0.5 24,0.5 c -0.7,0 -1.5,0 -2.2,0.1 z m 15,33.1 c -3,4.1 -7.7,6.5 -12.8,6.5 -2.7,0 -5.3,-0.7 -7.7,-2 C 9.2,34.4 6.3,25.8 9.3,18.5 L 2.4,14.7 c -4.7,11 -0.4,24 10.2,29.9 3.5,1.9 7.4,2.9 11.4,2.9 7.8,0 15,-3.8 19.3,-10.1 z"
       id="path13"
       inkscape:connector-curvature="0"
       style="fill:#e31337;fill-opacity:1" />
    <path
       d="M 29.8,14 C 28,13 26,12.5 24,12.5 c -4.4,0 -8.4,2.4 -10.5,6.2 -3.2,5.8 -1.1,13.1 4.7,16.3 1.8,1 3.8,1.5 5.8,1.5 4.4,0 8.4,-2.4 10.5,-6.2 1.5,-2.8 1.9,-6 1,-9.1 -0.9,-3.1 -2.9,-5.7 -5.7,-7.2 z m -18.6,1.1 c 2.1,-2.9 5.1,-4.9 8.4,-5.9 L 18,1.5 V 1.3 c -5.6,1.5 -10.5,5 -13.7,10 z"
       id="path15"
       inkscape:connector-curvature="0"
       style="fill:#e31337;fill-opacity:1" />
  </g>
  <g
     data-v-fde0c5aa=""
     id="1aa5e798-c38b-41ce-982f-650de65b296f"
     transform="matrix(2.3129616,0,0,2.3129616,16.59994,195.22831)"
     style="fill:#e31337;fill-opacity:1">
    <path
       d="m 8.5,3.75 h 1.4 v 9.8 H 8.5 V 9.18 H 2.87 v 4.37 h -1.4 v -9.8 h 1.4 V 7.97 H 8.5 Z m 4.14,9.8 V 6.13 h 1.35 v 7.42 z M 13.31,4.7 v 0 q -0.39,0 -0.65,-0.25 v 0 0 Q 12.4,4.2 12.4,3.84 v 0 0 q 0,-0.37 0.26,-0.63 v 0 0 q 0.26,-0.26 0.65,-0.26 v 0 0 q 0.4,0 0.65,0.25 v 0 0 q 0.26,0.24 0.26,0.61 v 0 0 q 0,0.38 -0.26,0.64 v 0 0 Q 13.71,4.7 13.31,4.7 Z m 8.49,1.43 h 1.31 l -3.24,7.42 H 18.49 L 15.25,6.13 h 1.4 l 2.54,5.95 z m 9.28,3.75 v 0 q 0,0.16 -0.03,0.41 v 0 h -6.02 v 0 q 0.13,0.98 0.86,1.58 v 0 0 q 0.74,0.59 1.83,0.59 v 0 0 q 1.33,0 2.14,-0.9 v 0 l 0.74,0.87 v 0 q -0.5,0.59 -1.25,0.9 v 0 0 q -0.75,0.31 -1.67,0.31 v 0 0 q -1.18,0 -2.09,-0.49 v 0 0 q -0.91,-0.48 -1.4,-1.35 v 0 0 q -0.5,-0.87 -0.5,-1.96 v 0 0 q 0,-1.08 0.48,-1.94 v 0 0 Q 24.65,7.03 25.5,6.54 v 0 0 q 0.85,-0.48 1.91,-0.48 v 0 0 q 1.07,0 1.9,0.48 v 0 0 q 0.83,0.49 1.3,1.36 v 0 0 q 0.47,0.86 0.47,1.98 z M 27.41,7.2 v 0 q -0.96,0 -1.61,0.58 v 0 0 q -0.66,0.59 -0.77,1.54 v 0 h 4.76 v 0 Q 29.68,8.39 29.03,7.79 v 0 0 Q 28.38,7.2 27.41,7.2 Z m 13.92,6.46 v 0 q -1.49,0 -2.68,-0.65 v 0 0 q -1.19,-0.65 -1.87,-1.8 v 0 0 Q 36.11,10.07 36.11,8.65 v 0 0 q 0,-1.41 0.67,-2.56 v 0 0 q 0.68,-1.15 1.87,-1.8 v 0 0 q 1.19,-0.65 2.68,-0.65 v 0 0 q 1.47,0 2.66,0.65 v 0 0 q 1.19,0.65 1.86,1.79 v 0 0 q 0.67,1.14 0.67,2.57 v 0 0 q 0,1.43 -0.67,2.57 v 0 0 q -0.67,1.14 -1.86,1.79 v 0 0 q -1.19,0.65 -2.66,0.65 z m 0,-1.24 v 0 q 1.08,0 1.94,-0.49 v 0 0 q 0.86,-0.49 1.36,-1.35 v 0 0 q 0.49,-0.86 0.49,-1.93 v 0 0 q 0,-1.06 -0.49,-1.92 v 0 0 Q 44.13,5.87 43.27,5.38 v 0 0 Q 42.41,4.89 41.33,4.89 v 0 0 q -1.08,0 -1.95,0.49 v 0 0 Q 38.5,5.87 38,6.73 v 0 0 q -0.49,0.86 -0.49,1.92 v 0 0 q 0,1.07 0.49,1.93 v 0 0 q 0.5,0.86 1.38,1.35 v 0 0 q 0.87,0.49 1.95,0.49 z M 52.4,6.06 v 0 q 1.08,0 1.93,0.48 v 0 0 q 0.86,0.47 1.34,1.33 v 0 0 q 0.48,0.85 0.48,1.97 v 0 0 q 0,1.12 -0.48,1.98 v 0 0 q -0.48,0.86 -1.34,1.34 v 0 0 q -0.85,0.48 -1.93,0.48 v 0 0 q -0.8,0 -1.46,-0.31 v 0 0 q -0.67,-0.31 -1.13,-0.9 v 0 3.84 H 48.47 V 6.13 h 1.29 v 1.18 0 Q 50.2,6.69 50.89,6.38 v 0 0 Q 51.58,6.06 52.4,6.06 Z m -0.11,6.4 v 0 q 0.71,0 1.28,-0.33 v 0 0 q 0.57,-0.33 0.9,-0.92 v 0 0 q 0.33,-0.6 0.33,-1.37 v 0 0 q 0,-0.77 -0.33,-1.36 v 0 0 q -0.33,-0.6 -0.9,-0.92 v 0 0 Q 53,7.24 52.29,7.24 v 0 0 q -0.7,0 -1.27,0.33 v 0 0 Q 50.46,7.9 50.13,8.48 v 0 0 Q 49.8,9.07 49.8,9.84 v 0 0 q 0,0.77 0.32,1.37 v 0 0 q 0.32,0.59 0.9,0.92 v 0 0 q 0.57,0.33 1.27,0.33 z M 64.72,9.88 v 0 q 0,0.16 -0.03,0.41 v 0 h -6.02 v 0 q 0.13,0.98 0.86,1.58 v 0 0 q 0.74,0.59 1.83,0.59 v 0 0 q 1.33,0 2.14,-0.9 v 0 l 0.75,0.87 v 0 q -0.51,0.59 -1.26,0.9 v 0 0 q -0.75,0.31 -1.67,0.31 v 0 0 q -1.18,0 -2.09,-0.49 v 0 0 q -0.91,-0.48 -1.4,-1.35 v 0 0 q -0.5,-0.87 -0.5,-1.96 v 0 0 q 0,-1.08 0.48,-1.94 v 0 0 Q 58.3,7.03 59.14,6.54 v 0 0 q 0.85,-0.48 1.91,-0.48 v 0 0 q 1.07,0 1.9,0.48 v 0 0 q 0.83,0.49 1.3,1.36 v 0 0 q 0.47,0.86 0.47,1.98 z M 61.05,7.2 v 0 q -0.96,0 -1.61,0.58 v 0 0 q -0.65,0.59 -0.77,1.54 v 0 h 4.76 v 0 Q 63.32,8.39 62.67,7.79 v 0 0 Q 62.02,7.2 61.05,7.2 Z m 9.5,-1.14 v 0 q 1.41,0 2.24,0.82 v 0 0 q 0.84,0.82 0.84,2.4 v 0 4.27 h -1.35 v -4.11 0 q 0,-1.08 -0.52,-1.63 v 0 0 Q 71.25,7.27 70.28,7.27 v 0 0 q -1.09,0 -1.72,0.63 v 0 0 q -0.63,0.64 -0.63,1.83 v 0 3.82 H 66.58 V 6.13 h 1.29 v 1.12 0 q 0.41,-0.57 1.1,-0.88 v 0 0 q 0.69,-0.31 1.58,-0.31 z m 12.39,7.6 v 0 q -1.11,0 -2.14,-0.34 v 0 0 q -1.03,-0.34 -1.62,-0.89 v 0 l 0.52,-1.09 v 0 q 0.56,0.5 1.44,0.82 v 0 0 q 0.87,0.31 1.8,0.31 v 0 0 q 1.21,0 1.82,-0.41 v 0 0 q 0.6,-0.41 0.6,-1.1 v 0 0 q 0,-0.5 -0.33,-0.82 v 0 0 Q 84.7,9.83 84.22,9.66 v 0 0 Q 83.73,9.49 82.85,9.28 v 0 0 Q 81.75,9.02 81.07,8.75 v 0 0 Q 80.39,8.48 79.91,7.93 v 0 0 Q 79.42,7.38 79.42,6.44 v 0 0 q 0,-0.78 0.42,-1.41 v 0 0 Q 80.25,4.4 81.09,4.02 v 0 0 q 0.84,-0.38 2.08,-0.38 v 0 0 q 0.87,0 1.71,0.22 v 0 0 q 0.84,0.23 1.44,0.65 v 0 l -0.46,1.12 v 0 Q 85.25,5.24 84.55,5.03 v 0 0 q -0.7,-0.2 -1.38,-0.2 v 0 0 q -1.19,0 -1.78,0.43 v 0 0 q -0.6,0.44 -0.6,1.12 v 0 0 q 0,0.51 0.34,0.82 v 0 0 q 0.34,0.32 0.83,0.49 v 0 0 q 0.5,0.18 1.35,0.37 v 0 0 q 1.11,0.27 1.78,0.54 v 0 0 q 0.67,0.26 1.16,0.81 v 0 0 q 0.48,0.54 0.48,1.47 v 0 0 q 0,0.77 -0.42,1.41 v 0 0 q -0.42,0.63 -1.27,1 v 0 0 q -0.86,0.37 -2.1,0.37 z m 9.39,-1.51 0.42,0.97 v 0 q -0.29,0.25 -0.73,0.38 v 0 0 q -0.43,0.14 -0.89,0.14 v 0 0 q -1.12,0 -1.74,-0.61 v 0 0 q -0.62,-0.6 -0.62,-1.72 v 0 -4.07 H 87.51 V 6.13 h 1.26 V 4.51 h 1.35 v 1.62 h 2.13 v 1.11 h -2.13 v 4.02 0 q 0,0.6 0.3,0.92 v 0 0 q 0.3,0.32 0.86,0.32 v 0 0 q 0.62,0 1.05,-0.35 z m 4.75,-6.09 v 0 q 1.54,0 2.36,0.76 v 0 0 q 0.81,0.75 0.81,2.25 v 0 4.48 h -1.27 v -0.98 0 q -0.34,0.52 -0.96,0.79 v 0 0 q -0.62,0.28 -1.48,0.28 v 0 0 q -1.24,0 -1.99,-0.61 v 0 0 Q 93.8,12.43 93.8,11.45 v 0 0 q 0,-0.98 0.71,-1.57 v 0 0 q 0.72,-0.6 2.27,-0.6 v 0 h 2.13 v -0.26 0 q 0,-0.87 -0.5,-1.33 v 0 0 Q 97.9,7.22 96.92,7.22 v 0 0 q -0.66,0 -1.29,0.22 v 0 0 Q 95,7.66 94.57,8.02 v 0 L 94.01,7.01 v 0 q 0.57,-0.46 1.37,-0.7 v 0 0 q 0.8,-0.25 1.7,-0.25 z m -0.31,6.54 v 0 q 0.77,0 1.33,-0.34 v 0 0 q 0.56,-0.35 0.81,-0.98 v 0 -1.03 h -2.07 v 0 q -1.71,0 -1.71,1.15 v 0 0 q 0,0.56 0.43,0.88 v 0 0 Q 96,12.6 96.77,12.6 Z m 9.73,-0.45 0.42,0.97 v 0 q -0.3,0.25 -0.73,0.38 v 0 0 q -0.43,0.14 -0.9,0.14 v 0 0 q -1.12,0 -1.73,-0.61 v 0 0 q -0.62,-0.6 -0.62,-1.72 v 0 -4.07 h -1.26 V 6.13 h 1.26 V 4.51 h 1.35 v 1.62 h 2.12 v 1.11 h -2.12 v 4.02 0 q 0,0.6 0.3,0.92 v 0 0 q 0.3,0.32 0.86,0.32 v 0 0 q 0.61,0 1.05,-0.35 z m 4.17,1.49 v 0 q -0.91,0 -1.75,-0.25 v 0 0 q -0.84,-0.24 -1.32,-0.62 v 0 l 0.56,-1.07 v 0 q 0.49,0.35 1.19,0.56 v 0 0 q 0.7,0.21 1.42,0.21 v 0 0 q 1.76,0 1.76,-1 v 0 0 q 0,-0.34 -0.24,-0.54 v 0 0 q -0.23,-0.19 -0.59,-0.28 v 0 0 q -0.36,-0.09 -1.02,-0.21 v 0 0 q -0.89,-0.14 -1.46,-0.32 v 0 0 q -0.57,-0.18 -0.97,-0.61 v 0 0 q -0.41,-0.44 -0.41,-1.22 v 0 0 q 0,-1.01 0.84,-1.62 v 0 0 q 0.84,-0.61 2.26,-0.61 v 0 0 q 0.74,0 1.48,0.18 v 0 0 q 0.74,0.19 1.22,0.49 v 0 l -0.58,1.07 v 0 q -0.91,-0.59 -2.14,-0.59 v 0 0 q -0.85,0 -1.3,0.28 v 0 0 q -0.45,0.28 -0.45,0.74 v 0 0 q 0,0.37 0.25,0.58 v 0 0 q 0.26,0.21 0.63,0.3 v 0 0 q 0.37,0.1 1.04,0.23 v 0 0 q 0.9,0.15 1.45,0.33 v 0 0 q 0.55,0.17 0.94,0.59 v 0 0 q 0.4,0.42 0.4,1.18 v 0 0 q 0,1.01 -0.86,1.6 v 0 0 q -0.87,0.6 -2.35,0.6 z"
       id="path8"
       inkscape:connector-curvature="0"
       style="fill:#e31337;fill-opacity:1" />
  </g>
  <g
     id="g4677"
     style="fill:#ffffff"
     transform="matrix(0.20390683,0,0,0.20390683,127.57025,113.19759)">
    <path
       id="path4673"
       d="m 157.27262,107.26394 c 0.72637,0 1.18,0.78752 0.81612,1.41681 l -46.75035,80.84819 C 111.16981,189.82048 110.8588,190 110.52228,190 H 81.944381 c -0.726367,0 -1.179995,-0.78752 -0.816111,-1.41681 L 127.87862,107.735 c 0.16858,-0.29154 0.47959,-0.47106 0.81611,-0.47106 z m -27.7949,-23.173803 c -0.33651,0 -0.64753,-0.179515 -0.81611,-0.471055 L 81.12827,1.4168088 C 80.764386,0.78752151 81.218014,0 81.944381,0 h 28.577899 c 0.33652,0 0.64753,0.17951487 0.81611,0.4710549 l 47.53334,82.2022731 c 0.36388,0.629287 -0.0897,1.416809 -0.81611,1.416809 z"
       inkscape:connector-curvature="0"
       style="fill:#ffffff" />
    <path
       id="path4675"
       d="M 135.12841,1.416352 C 134.76385,0.78706423 135.21893,0 135.94734,0 h 28.61861 c 0.33776,0 0.64989,0.17971418 0.81894,0.47151174 L 219.87301,94.52758 c 0.16932,0.292284 0.16932,0.652556 0,0.94484 l -54.48812,94.05607 C 165.21584,189.82029 164.90371,190 164.56595,190 h -28.61861 c -0.72841,0 -1.18349,-0.78706 -0.81893,-1.41635 L 189.34284,95 Z m -23.25819,93.10773 c 0.17223,0.29267 0.17309,0.654477 0.002,0.947956 L 57.125226,189.52811 c -0.36523,0.62746 -1.277385,0.62961 -1.645617,0.004 L 0.12978361,95.475918 c -0.17222938,-0.29267 -0.17309611,-0.654477 -0.002271,-0.947956 L 54.874774,0.47189426 c 0.36523,-0.62746669 1.277385,-0.62961739 1.645617,-0.00388 z"
       inkscape:connector-curvature="0"
       style="fill:#ffffff" />
  </g>
  <defs
     data-v-fde0c5aa=""
     id="defs6">
    <!---->
  </defs>
  <defs
     data-v-fde0c5aa=""
     id="defs11">
    <!---->
  </defs>
  <!---->
</svg>
