{
  "daily_fine_percent": 0.1,
  "max_fine": 0.4,
  "timestamp_format": "%d.%m.%Y %H:%M:%S",
  "task_to_deadline_str": {
    "sum_of_two": "15.12.2023 23:59:59",
    "ring_buffer": "29.10.2023 23:59:59",
    "string": "05.11.2023 23:59:59",
    "matrix": "26.11.2023 23:59:59",
    "calculator": "15.12.2023 23:59:59"
  }
}
