<svg width="149" height="147" viewBox="0 0 149 147" fill="none" xmlns="http://www.w3.org/2000/svg">
<path d="M86.2379 110.045C87.8016 114.006 85.8615 118.548 81.7073 119.485C72.1359 121.643 62.0789 120.949 52.8115 117.396C41.1288 112.918 31.5498 104.222 25.9656 93.0251C20.3815 81.8286 19.198 68.9454 22.6489 56.919C26.0998 44.8925 33.9342 34.5969 44.6054 28.0647C55.2766 21.5326 68.0091 19.2386 80.2891 21.6357C92.569 24.0329 103.504 30.9469 110.935 41.0128C118.366 51.0787 121.754 63.5649 120.428 76.0062C119.377 85.8755 115.42 95.1475 109.145 102.69C106.421 105.963 101.493 105.625 98.6766 102.43C95.8603 99.2361 96.2549 94.4 98.7472 90.947C102.243 86.1036 104.451 80.3991 105.093 74.3725C106.01 65.7685 103.667 57.1335 98.5283 50.1722C93.3891 43.211 85.8268 38.4295 77.3344 36.7717C68.842 35.1139 60.0366 36.7003 52.6568 41.2178C45.2769 45.7352 39.8589 52.8553 37.4724 61.1724C35.0858 69.4895 35.9043 78.3991 39.7661 86.1423C43.6279 93.8854 50.2525 99.8992 58.3318 102.997C63.9909 105.166 70.0756 105.794 75.979 104.884C80.1878 104.235 84.6741 106.083 86.2379 110.045Z" fill="#FF7A00"/>
<rect x="106.968" y="84.0775" width="65.2937" height="19.2132" rx="9.60661" transform="rotate(50.4894 106.968 84.0775)" fill="#FF7A00"/>
</svg>
