<svg width="12" height="12" viewBox="0 0 12 12" fill="none" xmlns="http://www.w3.org/2000/svg">
<path d="M1 5C0.447715 5 0 5.44772 0 6C0 6.55228 0.447715 7 1 7L1 5ZM12 6L2 0.226497L2 11.7735L12 6ZM1 7H3L3 5H1L1 7Z" fill="white"/>
</svg>
