{
  "build": {
    "beforeDevCommand": "",
    "beforeBuildCommand": "",
    "devPath": "../src",
    "distDir": "../src",
    "withGlobalTauri": true
  },
  "package": {
    "productName": "ani-cli",
    "version": "0.0.1"
  },
  "tauri": {
    "allowlist": {
      "all": false,
      "shell": {
        "all": false,
        "open": true
      }
    },
    "bundle": {
      "active": true,
      "targets": "all",
      "identifier": "anime-viewer",
      "icon": [
        "icons/icon.png",
        "icons/32x32.png",
        "icons/128x128.png",
        "icons/128x128@2x.png",
        "icons/icon.icns",
        "icons/icon.ico"
      ]
    },
    "security": {
      "csp": null
    },
    "windows": [
      {
        "fullscreen": false,
        "resizable": true,
        "title": "ani-cli",
        "width": 800,
        "height": 600
      }
    ]
  }
}