{
  "name": "my-bonsai-example",
  "version": "0.1.0",
  "private": true,
  "dependencies": {
    "@cloudacademy/bonsai": "^8.6.0",
    "@testing-library/jest-dom": "^4.2.4",
    "@testing-library/react": "^9.5.0",
    "@testing-library/user-event": "^7.2.1",
    "@types/jest": "^24.9.1",
    "@types/node": "^12.12.52",
    "@types/react": "^16.9.43",
    "@types/react-dom": "^16.9.8",
    "react": "^16.13.1",
    "react-dom": "^16.13.1",
    "react-scripts": "3.4.1",
    "typescript": "^3.7.5"
  },
  "scripts": {
    "start": "react-scripts start",
    "build": "react-scripts build",
    "serve:build": "npm run build && serve -s build",
    "test": "react-scripts test",
    "eject": "react-scripts eject",
    "lint": "eslint . --fix",
    "perf": "node ./src/ligthouse.js"
  },
  "eslintConfig": {
    "extends": "react-app"
  },
  "browserslist": {
    "production": [
      ">0.2%",
      "not dead",
      "not op_mini all"
    ],
    "development": [
      "last 1 chrome version",
      "last 1 firefox version",
      "last 1 safari version"
    ]
  },
  "devDependencies": {
    "chrome-launcher": "^0.13.4",
    "lighthouse": "^6.1.1",
    "moment": "^2.27.0",
    "msw": "^0.19.5",
    "serve": "^11.3.2",
    "styled-components": "^5.1.1"
  }
}
