[
  {
    "title": "DMC Channel - Interview",
    "year": "2022",
    "lang": "AR",
    "thumbnail": "images/DMC.png",
    "description": "Interview with DMC channel about cybersecurity and banking challenges.",
    "cards": [
      {
        "label": "Youtube",
        "link": "https://www.youtube.com/watch?v=SR9JC4o3HHI"
      }
    ]
  },
  {
    "title": "Security Podcasts - Nakerah",
    "year": "2021",
    "lang": "AR",
    "thumbnail": "images/nakerah.png",
    "description": "Podcat interview with Nakerah about DevSecOps and the new security integration in DevOps journey.",
    "cards": [
      {
        "label": "Podcast link",
        "link": "https://podcasts.apple.com/bh/podcast/24-ahmed-sherif-sr-information-security-expert-at-abn/id1528881825?i=1000529129151"
      }
    ]
  },
  {
    "title": "InfoSec Podcast - A daylife of a red teamer",
    "year": "2023",
    "lang": "AR",
    "thumbnail": "images/x-podcast.jpeg",
    "description": "Podcast interview with Ebrahim Hegazy about the daylife of red team operator and how to manage red team operations.",
    "cards": [
      {
        "label": "Youtube",
        "link": "https://www.youtube.com/watch?v=I9nTTSv0te8"
      }
    ]
  }
]