cost at epoch at 0 : 2.74493764383
0.2057 | 0.1078 | 0.1689 | 0.0712 0.3512 | ppdb_rnn | se_rnn | jhurnn | twitter_rnn_sp twitter_rnn_maxf1 |
0.2147 | 0.3183 | 0.2600 | 0.0366 0.3521 | ppdb_rnn | se_rnn | jhurnn | twitter_rnn_sp twitter_rnn_maxf1 |
0.2430 | 0.3297 | 0.2751 | 0.0753 0.3559 | ppdb_rnn | se_rnn | jhurnn | twitter_rnn_sp twitter_rnn_maxf1 |
0.2480 | 0.3366 | 0.2817 | 0.0662 0.3547 | ppdb_rnn | se_rnn | jhurnn | twitter_rnn_sp twitter_rnn_maxf1 |
cost at epoch at 1 : 2.97366589838
0.2381 | 0.3439 | 0.2812 | 0.0634 0.3582 | ppdb_rnn | se_rnn | jhurnn | twitter_rnn_sp twitter_rnn_maxf1 |
0.2386 | 0.3376 | 0.2819 | 0.0585 0.3574 | ppdb_rnn | se_rnn | jhurnn | twitter_rnn_sp twitter_rnn_maxf1 |
0.2452 | 0.3412 | 0.2771 | 0.0616 0.3596 | ppdb_rnn | se_rnn | jhurnn | twitter_rnn_sp twitter_rnn_maxf1 |
0.2426 | 0.3428 | 0.2734 | 0.0632 0.3647 | ppdb_rnn | se_rnn | jhurnn | twitter_rnn_sp twitter_rnn_maxf1 |
cost at epoch at 2 : 2.19939383142
0.2437 | 0.3434 | 0.2731 | 0.0643 0.3700 | ppdb_rnn | se_rnn | jhurnn | twitter_rnn_sp twitter_rnn_maxf1 |
0.2437 | 0.3424 | 0.2703 | 0.0665 0.3653 | ppdb_rnn | se_rnn | jhurnn | twitter_rnn_sp twitter_rnn_maxf1 |
0.2469 | 0.3439 | 0.2718 | 0.0643 0.3567 | ppdb_rnn | se_rnn | jhurnn | twitter_rnn_sp twitter_rnn_maxf1 |
0.2381 | 0.3406 | 0.2683 | 0.0652 0.3648 | ppdb_rnn | se_rnn | jhurnn | twitter_rnn_sp twitter_rnn_maxf1 |
cost at epoch at 3 : 2.01132219941
0.2352 | 0.3412 | 0.2677 | 0.0601 0.3550 | ppdb_rnn | se_rnn | jhurnn | twitter_rnn_sp twitter_rnn_maxf1 |
0.2399 | 0.3393 | 0.2671 | 0.0638 0.3553 | ppdb_rnn | se_rnn | jhurnn | twitter_rnn_sp twitter_rnn_maxf1 |
0.2345 | 0.3361 | 0.2670 | 0.0638 0.3531 | ppdb_rnn | se_rnn | jhurnn | twitter_rnn_sp twitter_rnn_maxf1 |
0.2365 | 0.3376 | 0.2686 | 0.0622 0.3531 | ppdb_rnn | se_rnn | jhurnn | twitter_rnn_sp twitter_rnn_maxf1 |
