{
  "discounts": [
    {
      "id": 1,
      "title": "Заезд на электрокарте в картинг-центре Egokarting",
      "promo_image": "karting1.jpg",
      "description": "Egokarting — не просто современный, а ультрасовременный картинг-центр. Убедитесь сами! Этот масштабный проект от известного картинг-центра ZelenoKART объединил 9 лет опыта и знаний. Egokarting соответствует всем мировым стандартам качества.",
      "address": "Нижегородская, г. Москва, 5-я Кабельная ул., д. 2, стр. 1, эт. 5 (ТРК «СпортЕХ»)",
      "price": "от 3500руб.",
      "type": "karting",
      "count": "-30%"
    },
    {
      "id": 2,
      "title": "2 или 4 заезда на карте в закрытом картинг-центре «Серебряный дождь»",
      "promo_image": "krating2.jpeg",
      "description": "Картинг — гонки на малолитражных гоночных автомобилях, которые позволяют участникам испытать всю гамму чувств, переживаемую пилотами гоночных болидов. А дух соревнования делает такой досуг захватывающим и запоминающимся.",
      "address": "Соколиная гора, г. Москва, 1-я ул. Измайловского Зверинца, д. 8, эт. 5",
      "price": "от 3500руб.",
      "type": "karting",
      "count": "-60%"
    },
    {
      "id": 3,
      "title": "До 10 сеансов массажа от мастера Адама",
      "promo_image": "massaj1.jpg",
      "description": "Даже один сеанс массажа может помочь устранить мышечные боли, снять спазмы, улучшить кровообращение. Мануальное воздействие может положительно влиять на самочувствие в целом, а также помогает справиться с локальными проблемами, улучшить кровообращение, укрепить иммунитет, а при необходимости поможет скорректировать отдельные недостатки фигуры.",
      "address": "Красные ворота, г. Москва, Хоромный туп., д. 2/6",
      "price": "от 3500руб.",
      "type": "massaj",
      "count": "-51%"
    },
    {
      "id": 4,
      "title": "Проживание в башне «Нева Тауэрс» с панорамными окнами в «Апартаментах Москва Сити»",
      "promo_image": "hotel1.jpg",
      "description": "«Апартаменты Москва Сити» в башне «Нева Тауэрс» — это современная дизайнерская студия, расположенная недалеко от главных объектов культурной, развлекательной и деловой жизни города. Удобная транспортная развязка позволяет быстро добираться до офисов, магазинов, ресторанов, театров и галерей в исторической части города, а также до международных аэропортов и пригородов столицы.",
      "address": "Международная, г. Москва, 1-й Красногвардейский пр., д. 22, стр. 2 (башня «Нева Тауэрс»)",
      "price": "от 3500руб.",
      "type": "hotel",
      "count": "-30%"
    },
    {
      "id": 5,
      "title": "Отдых в номере, коттедже, доме или таунхаусе с завтраками, посещением открытого подогреваемого бассейна на базе семейного отдыха «Золотая рыбка»",
      "promo_image": "hotel2.jpg",
      "description": "База семейного отдыха «Золотая рыбка» — живописное место для отдыха среди могучих вековых деревьев, расположенное в деревне Салтыково города Бронницы Московской области. Тут можно расслабиться и отвлечься от городской суеты, подышать чистым воздухом, попариться в бане, весело и активно провести время, что актуально для отдыха в одиночестве, в кругу друзей, семьи и детей, а также для проведения корпоративных и праздничных мероприятий. Расстояние до аэропорта «Домодедово» составляет 14 км, до города Подольска — 37 км, до города Балашихи — 49 км.",
      "address": "Московская обл., г. Бронницы, дер. Салтыково",
      "price": "от 3500руб.",
      "type": "hotel",
      "count": "-30%"
    },
    {
      "id": 6,
      "title": "Отдых в домике с возможностью заезда на новогодние и рождественские праздники, пользованием мангальной зоной, посещением бани или без от отеля «Глэмпинг на берегу реки»",
      "promo_image": "hotel3.jpg",
      "description": "Глэмкемпинг — вид экотуризма, позволяющий ощутить полное единение с природой, прочувствовать все прелести отдыха без походного дискомфорта.",
      "address": "Московская обл., Шаховской р-н, СНТ «Прованс», «Глэмпинг прованс»",
      "price": "от 3500руб.",
      "type": "hotel",
      "count": "-30%"
    }
  ],
  "promotions": [
    {
      "id": 1,
      "title": "Участие в семейном квесте «Гриффиндор» от студии «Семейные квесты»",
      "promo_image": "cupon1.png",
      "price": "от 2 497 руб.",
      "count": 50
    },
    {
      "id": 2,
      "title": "Экскурсия «Знакомство с небоскребами „Москва-Сити“» с угощением сладостями от компании Moscow-City-Weekend",
      "promo_image": "cupon2.jpg",
      "price": "от 2 497 руб.",
      "count": 67
    }
  ],
  "orders": [
    {
      "id": "1",
      "name": "Андрей",
      "phone": "+72348433"
    },
    {
      "name": "asdasds",
      "phone": "+72342343244",
      "id": "piM1uOS"
    },
    {
      "name": "asdasdas",
      "phone": "+74234234324",
      "id": "eogZkXC"
    },
    {
      "name": "Руслан",
      "phone": "+72423422343",
      "id": "Q_zeuea"
    },
    {
      "name": "Дмитрий",
      "phone": "+72342342342",
      "id": "fj-vo3A"
    }
  ],
  "reviews": [
    {
      "product_id": "4",
      "name": "Андрей",
      "email": "andrey@mail.ru",
      "text": "Мне все понравилось!",
      "id": 1
    },
    {
      "product_id": "4",
      "name": "Сергей",
      "email": "sergey@mail.ru",
      "text": "Очень круто!",
      "id": 2
    }
  ]
}