{
    "rules": [
      {
        "fieldName": "From",
        "predicate": "contains",
        "value": "mudit"
      },
      {
        "fieldName": "To",
        "predicate": "contains",
        "value": "muditjha401"
      }
    ],
    "collectionPredicate": "Any",
    "actions": ["Mark as read", "Move message"]
  }