<?xml version="1.0" encoding="UTF-8" standalone="no"?>
<svg xmlns="http://www.w3.org/2000/svg" width="65mm" height="93mm" viewBox="0 0 65 93" version="1.1">
    <title>zebr0 Logo</title>
    <desc>
        The logo for the zebr0 project (https://zebr0.io).
        Created by Thomas JOUANNOT (https://mazerty.fr) with Inkscape (https://inkscape.org).
        Optimized with SVGO (https://svgo.dev).
        Licensed under the Creative Commons Attribution-NonCommercial-ShareAlike 4.0 International License (https://creativecommons.org/licenses/by-nc-sa/4.0).
    </desc>
    <path fill="current"
          stroke="current"
          stroke-linejoin="round"
          d="m0 0 10 10V0Zm40 10v60h10V20zm20 20v40h10V40zm20 20v20h10V60zM20 0v30l10 10V0zm30 80v10h60l-10-10z"
          transform="matrix(1 0 -.7 1 15 1.5)"/>
</svg>
