%YAML 1.1
%TAG !u! tag:unity3d.com,2011:
--- !u!61 &4010707742453384334
BoxCollider2D:
  m_ObjectHideFlags: 0
  m_CorrespondingSourceObject: {fileID: 0}
  m_PrefabInstance: {fileID: 0}
  m_PrefabAsset: {fileID: 0}
  m_GameObject: {fileID: 7489629414441791240}
  m_Enabled: 1
  m_Density: 1
  m_Material: {fileID: 0}
  m_IsTrigger: 1
  m_UsedByEffector: 0
  m_UsedByComposite: 0
  m_Offset: {x: 0, y: 0}
  m_SpriteTilingProperty:
    border: {x: 0, y: 0, z: 0, w: 0}
    pivot: {x: 0.5, y: 0.5}
    oldSize: {x: 1.28, y: 1.28}
    newSize: {x: 1.28, y: 1.28}
    adaptiveTilingThreshold: 0.5
    drawMode: 0
    adaptiveTiling: 0
  m_AutoTiling: 0
  serializedVersion: 2
  m_Size: {x: 1, y: 0.75}
  m_EdgeRadius: 0
--- !u!1001 &4975023219582745785
PrefabInstance:
  m_ObjectHideFlags: 0
  serializedVersion: 2
  m_Modification:
    m_TransformParent: {fileID: 0}
    m_Modifications:
    - target: {fileID: 2520422629640377265, guid: 0e8130aab7dbf9b44be05ab88c0f2558,
        type: 3}
      propertyPath: m_Name
      value: Enemy 2
      objectReference: {fileID: 0}
    - target: {fileID: 1732855300492204639, guid: 0e8130aab7dbf9b44be05ab88c0f2558,
        type: 3}
      propertyPath: m_LocalPosition.x
      value: 0
      objectReference: {fileID: 0}
    - target: {fileID: 1732855300492204639, guid: 0e8130aab7dbf9b44be05ab88c0f2558,
        type: 3}
      propertyPath: m_LocalPosition.y
      value: 0
      objectReference: {fileID: 0}
    - target: {fileID: 1732855300492204639, guid: 0e8130aab7dbf9b44be05ab88c0f2558,
        type: 3}
      propertyPath: m_LocalPosition.z
      value: 0
      objectReference: {fileID: 0}
    - target: {fileID: 1732855300492204639, guid: 0e8130aab7dbf9b44be05ab88c0f2558,
        type: 3}
      propertyPath: m_LocalRotation.x
      value: 0
      objectReference: {fileID: 0}
    - target: {fileID: 1732855300492204639, guid: 0e8130aab7dbf9b44be05ab88c0f2558,
        type: 3}
      propertyPath: m_LocalRotation.y
      value: 0
      objectReference: {fileID: 0}
    - target: {fileID: 1732855300492204639, guid: 0e8130aab7dbf9b44be05ab88c0f2558,
        type: 3}
      propertyPath: m_LocalRotation.z
      value: 0
      objectReference: {fileID: 0}
    - target: {fileID: 1732855300492204639, guid: 0e8130aab7dbf9b44be05ab88c0f2558,
        type: 3}
      propertyPath: m_LocalRotation.w
      value: 1
      objectReference: {fileID: 0}
    - target: {fileID: 1732855300492204639, guid: 0e8130aab7dbf9b44be05ab88c0f2558,
        type: 3}
      propertyPath: m_RootOrder
      value: 0
      objectReference: {fileID: 0}
    - target: {fileID: 1732855300492204639, guid: 0e8130aab7dbf9b44be05ab88c0f2558,
        type: 3}
      propertyPath: m_LocalEulerAnglesHint.x
      value: 0
      objectReference: {fileID: 0}
    - target: {fileID: 1732855300492204639, guid: 0e8130aab7dbf9b44be05ab88c0f2558,
        type: 3}
      propertyPath: m_LocalEulerAnglesHint.y
      value: 0
      objectReference: {fileID: 0}
    - target: {fileID: 1732855300492204639, guid: 0e8130aab7dbf9b44be05ab88c0f2558,
        type: 3}
      propertyPath: m_LocalEulerAnglesHint.z
      value: 0
      objectReference: {fileID: 0}
    - target: {fileID: 4733412011575816238, guid: 0e8130aab7dbf9b44be05ab88c0f2558,
        type: 3}
      propertyPath: _maxHealth
      value: 6
      objectReference: {fileID: 0}
    m_RemovedComponents: []
  m_SourcePrefab: {fileID: 100100000, guid: 0e8130aab7dbf9b44be05ab88c0f2558, type: 3}
--- !u!1 &7489629414441791240 stripped
GameObject:
  m_CorrespondingSourceObject: {fileID: 2520422629640377265, guid: 0e8130aab7dbf9b44be05ab88c0f2558,
    type: 3}
  m_PrefabInstance: {fileID: 4975023219582745785}
  m_PrefabAsset: {fileID: 0}
