%YAML 1.1
%TAG !u! tag:unity3d.com,2011:
--- !u!1001 &5483275769114716679
PrefabInstance:
  m_ObjectHideFlags: 0
  serializedVersion: 2
  m_Modification:
    m_TransformParent: {fileID: 0}
    m_Modifications:
    - target: {fileID: 1725329311622987041, guid: 4eb6ee977a91e5a44bbc84d4c9a1e823,
        type: 3}
      propertyPath: m_Name
      value: Tower 1
      objectReference: {fileID: 0}
    - target: {fileID: 3508045445018888031, guid: 4eb6ee977a91e5a44bbc84d4c9a1e823,
        type: 3}
      propertyPath: m_LocalPosition.x
      value: 0
      objectReference: {fileID: 0}
    - target: {fileID: 3508045445018888031, guid: 4eb6ee977a91e5a44bbc84d4c9a1e823,
        type: 3}
      propertyPath: m_LocalPosition.y
      value: 0
      objectReference: {fileID: 0}
    - target: {fileID: 3508045445018888031, guid: 4eb6ee977a91e5a44bbc84d4c9a1e823,
        type: 3}
      propertyPath: m_LocalPosition.z
      value: 0
      objectReference: {fileID: 0}
    - target: {fileID: 3508045445018888031, guid: 4eb6ee977a91e5a44bbc84d4c9a1e823,
        type: 3}
      propertyPath: m_LocalRotation.x
      value: 0
      objectReference: {fileID: 0}
    - target: {fileID: 3508045445018888031, guid: 4eb6ee977a91e5a44bbc84d4c9a1e823,
        type: 3}
      propertyPath: m_LocalRotation.y
      value: 0
      objectReference: {fileID: 0}
    - target: {fileID: 3508045445018888031, guid: 4eb6ee977a91e5a44bbc84d4c9a1e823,
        type: 3}
      propertyPath: m_LocalRotation.z
      value: 0
      objectReference: {fileID: 0}
    - target: {fileID: 3508045445018888031, guid: 4eb6ee977a91e5a44bbc84d4c9a1e823,
        type: 3}
      propertyPath: m_LocalRotation.w
      value: 1
      objectReference: {fileID: 0}
    - target: {fileID: 3508045445018888031, guid: 4eb6ee977a91e5a44bbc84d4c9a1e823,
        type: 3}
      propertyPath: m_RootOrder
      value: 0
      objectReference: {fileID: 0}
    - target: {fileID: 3508045445018888031, guid: 4eb6ee977a91e5a44bbc84d4c9a1e823,
        type: 3}
      propertyPath: m_LocalEulerAnglesHint.x
      value: 0
      objectReference: {fileID: 0}
    - target: {fileID: 3508045445018888031, guid: 4eb6ee977a91e5a44bbc84d4c9a1e823,
        type: 3}
      propertyPath: m_LocalEulerAnglesHint.y
      value: 0
      objectReference: {fileID: 0}
    - target: {fileID: 3508045445018888031, guid: 4eb6ee977a91e5a44bbc84d4c9a1e823,
        type: 3}
      propertyPath: m_LocalEulerAnglesHint.z
      value: 0
      objectReference: {fileID: 0}
    - target: {fileID: 5002331741197787162, guid: 4eb6ee977a91e5a44bbc84d4c9a1e823,
        type: 3}
      propertyPath: _shootPower
      value: 2
      objectReference: {fileID: 0}
    - target: {fileID: 5002331741197787162, guid: 4eb6ee977a91e5a44bbc84d4c9a1e823,
        type: 3}
      propertyPath: _shootDistance
      value: 5
      objectReference: {fileID: 0}
    - target: {fileID: 5002331741197787162, guid: 4eb6ee977a91e5a44bbc84d4c9a1e823,
        type: 3}
      propertyPath: _shootDelay
      value: 3
      objectReference: {fileID: 0}
    - target: {fileID: 5002331741197787162, guid: 4eb6ee977a91e5a44bbc84d4c9a1e823,
        type: 3}
      propertyPath: _bulletSpeed
      value: 4
      objectReference: {fileID: 0}
    - target: {fileID: 5002331741197787162, guid: 4eb6ee977a91e5a44bbc84d4c9a1e823,
        type: 3}
      propertyPath: _towerPlace
      value: 
      objectReference: {fileID: 4142166389827821535}
    - target: {fileID: 5002331741197787162, guid: 4eb6ee977a91e5a44bbc84d4c9a1e823,
        type: 3}
      propertyPath: _towerHead
      value: 
      objectReference: {fileID: 7086114258344485028}
    - target: {fileID: 5002331741197787162, guid: 4eb6ee977a91e5a44bbc84d4c9a1e823,
        type: 3}
      propertyPath: _bulletPrefab
      value: 
      objectReference: {fileID: 1537957463674272636, guid: fcf0d6f9855339a4ab05bf5171879601,
        type: 3}
    m_RemovedComponents: []
  m_SourcePrefab: {fileID: 100100000, guid: 4eb6ee977a91e5a44bbc84d4c9a1e823, type: 3}
--- !u!212 &4142166389827821535 stripped
SpriteRenderer:
  m_CorrespondingSourceObject: {fileID: 8458723410055869912, guid: 4eb6ee977a91e5a44bbc84d4c9a1e823,
    type: 3}
  m_PrefabInstance: {fileID: 5483275769114716679}
  m_PrefabAsset: {fileID: 0}
--- !u!212 &7086114258344485028 stripped
SpriteRenderer:
  m_CorrespondingSourceObject: {fileID: 3336724346891848355, guid: 4eb6ee977a91e5a44bbc84d4c9a1e823,
    type: 3}
  m_PrefabInstance: {fileID: 5483275769114716679}
  m_PrefabAsset: {fileID: 0}
