%YAML 1.1
%TAG !u! tag:unity3d.com,2011:
--- !u!1001 &1569954479957631206
PrefabInstance:
  m_ObjectHideFlags: 0
  serializedVersion: 2
  m_Modification:
    m_TransformParent: {fileID: 0}
    m_Modifications:
    - target: {fileID: 7059771553675050875, guid: aa5d3eda104002643a1d73552b32cc72,
        type: 3}
      propertyPath: m_Name
      value: Ground Template Variant 2
      objectReference: {fileID: 0}
    - target: {fileID: 5664487803251845704, guid: aa5d3eda104002643a1d73552b32cc72,
        type: 3}
      propertyPath: m_LocalPosition.x
      value: 0
      objectReference: {fileID: 0}
    - target: {fileID: 5664487803251845704, guid: aa5d3eda104002643a1d73552b32cc72,
        type: 3}
      propertyPath: m_LocalPosition.y
      value: 0
      objectReference: {fileID: 0}
    - target: {fileID: 5664487803251845704, guid: aa5d3eda104002643a1d73552b32cc72,
        type: 3}
      propertyPath: m_LocalPosition.z
      value: 0
      objectReference: {fileID: 0}
    - target: {fileID: 5664487803251845704, guid: aa5d3eda104002643a1d73552b32cc72,
        type: 3}
      propertyPath: m_LocalRotation.x
      value: 0
      objectReference: {fileID: 0}
    - target: {fileID: 5664487803251845704, guid: aa5d3eda104002643a1d73552b32cc72,
        type: 3}
      propertyPath: m_LocalRotation.y
      value: 0
      objectReference: {fileID: 0}
    - target: {fileID: 5664487803251845704, guid: aa5d3eda104002643a1d73552b32cc72,
        type: 3}
      propertyPath: m_LocalRotation.z
      value: 0
      objectReference: {fileID: 0}
    - target: {fileID: 5664487803251845704, guid: aa5d3eda104002643a1d73552b32cc72,
        type: 3}
      propertyPath: m_LocalRotation.w
      value: 1
      objectReference: {fileID: 0}
    - target: {fileID: 5664487803251845704, guid: aa5d3eda104002643a1d73552b32cc72,
        type: 3}
      propertyPath: m_RootOrder
      value: 0
      objectReference: {fileID: 0}
    - target: {fileID: 5664487803251845704, guid: aa5d3eda104002643a1d73552b32cc72,
        type: 3}
      propertyPath: m_LocalEulerAnglesHint.x
      value: 0
      objectReference: {fileID: 0}
    - target: {fileID: 5664487803251845704, guid: aa5d3eda104002643a1d73552b32cc72,
        type: 3}
      propertyPath: m_LocalEulerAnglesHint.y
      value: 0
      objectReference: {fileID: 0}
    - target: {fileID: 5664487803251845704, guid: aa5d3eda104002643a1d73552b32cc72,
        type: 3}
      propertyPath: m_LocalEulerAnglesHint.z
      value: 0
      objectReference: {fileID: 0}
    - target: {fileID: 4792729611781998072, guid: aa5d3eda104002643a1d73552b32cc72,
        type: 3}
      propertyPath: m_IsActive
      value: 0
      objectReference: {fileID: 0}
    - target: {fileID: 1465826211223660930, guid: aa5d3eda104002643a1d73552b32cc72,
        type: 3}
      propertyPath: m_IsActive
      value: 1
      objectReference: {fileID: 0}
    - target: {fileID: 3362073345764895435, guid: aa5d3eda104002643a1d73552b32cc72,
        type: 3}
      propertyPath: m_IsActive
      value: 0
      objectReference: {fileID: 0}
    - target: {fileID: 7090044724420569212, guid: aa5d3eda104002643a1d73552b32cc72,
        type: 3}
      propertyPath: m_IsActive
      value: 1
      objectReference: {fileID: 0}
    - target: {fileID: 5056255306790714413, guid: aa5d3eda104002643a1d73552b32cc72,
        type: 3}
      propertyPath: m_IsActive
      value: 0
      objectReference: {fileID: 0}
    m_RemovedComponents: []
  m_SourcePrefab: {fileID: 100100000, guid: aa5d3eda104002643a1d73552b32cc72, type: 3}
