{
    "columns": [
        "blok",
        "oznaka_programa",
        "program_ustanove",
        "pozicija",
        "ustanova_predmeta",
        "oznaka_predmeta"
    ],
    "key": "blok",
    "type": "serijska",
    "linked_files": [
        "plan_studijske_grupe_data"
    ]
}