{
  "images" : [
    {
      "filename" : "b4E149C26F49A0Bf46F43C266E6Cee13.png",
      "idiom" : "universal",
      "scale" : "1x"
    },
    {
      "filename" : "b4E149C26F49A0Bf46F43C266E6Cee13@2x.png",
      "scale" : "2x",
      "idiom" : "universal"
    },
    {
      "idiom" : "universal",
      "filename" : "b4E149C26F49A0Bf46F43C266E6Cee13@3x.png",
      "scale" : "3x"
    }
  ],
  "info" : {
    "version" : 1,
    "author" : "xcode"
  }
}