[gd_scene load_steps=4 format=3 uid="uid://oj1jmsavqpfk"]

[ext_resource type="Texture2D" uid="uid://by37p80xd2j4n" path="res://Player/player.png" id="1_stqy6"]
[ext_resource type="Script" path="res://Player/player.gd" id="1_ujcye"]

[sub_resource type="RectangleShape2D" id="RectangleShape2D_k7xqs"]
size = Vector2(64, 64)

[node name="Player" type="CharacterBody2D"]
collision_layer = 5
script = ExtResource("1_ujcye")

[node name="CollisionShape2D" type="CollisionShape2D" parent="."]
shape = SubResource("RectangleShape2D_k7xqs")

[node name="Sprite2D" type="Sprite2D" parent="."]
scale = Vector2(2, 2)
texture = ExtResource("1_stqy6")

[node name="ShotCooldown" type="Timer" parent="."]
one_shot = true

[node name="Muzzle" type="Marker2D" parent="."]
position = Vector2(0, -16)
