%YAML 1.1
%TAG !u! tag:unity3d.com,2011:
--- !u!162 &1
EditorUserSettings:
  m_ObjectHideFlags: 0
  serializedVersion: 4
  m_ConfigSettings:
    RecentlyUsedScenePath-0:
      value: 22424703114646680e0b0227036c6c111b07142f1f2b233e2867083debf42d
      flags: 0
    RecentlyUsedScenePath-1:
      value: 224247031146467a1e1d09365f105c1518120b651f383439233d5d07f0e13733acf238e0f323
      flags: 0
    RecentlyUsedScenePath-2:
      value: 2242470311464676020a09301e1c6b1f030511242b1705313f391c30e9df103defe879dae43f31392a4dc933071b5167bc1f0702e212
      flags: 0
    RecentlyUsedScenePath-3:
      value: 22424703114646680c031c2e15105c1518120b651f2b233e283a5210e3f27a2decee22f0
      flags: 0
    RecentlyUsedScenePath-4:
      value: 224247031146467a1e1d09365f105c1518120b65083a2f3639692921e3e33f76f7e93ffdfe
      flags: 0
    vcSharedLogLevel:
      value: 0d5e400f0650
      flags: 0
  m_VCAutomaticAdd: 1
  m_VCDebugCom: 0
  m_VCDebugCmd: 0
  m_VCDebugOut: 0
  m_SemanticMergeMode: 2
  m_VCShowFailedCheckout: 1
  m_VCOverwriteFailedCheckoutAssets: 1
  m_VCProjectOverlayIcons: 1
  m_VCHierarchyOverlayIcons: 1
  m_VCOtherOverlayIcons: 1
  m_VCAllowAsyncUpdate: 1
