%YAML 1.1
%TAG !u! tag:unity3d.com,2011:
--- !u!162 &1
EditorUserSettings:
  m_ObjectHideFlags: 0
  serializedVersion: 4
  m_ConfigSettings:
    RecentlyUsedScenePath-0:
      value: 22424703114646680e0b0227036c6c111b07142f1f2b233e2867083debf42d
      flags: 0
    RecentlyUsedScenePath-1:
      value: 22424703114646680e0b0227036c6f02191b172d392d15332827187df7ee3d2cfb
      flags: 0
    RecentlyUsedScenePath-2:
      value: 2242470311464678010b0d2c50155a1302180a6a052b293e3e663936efef7a2decee22f0
      flags: 0
    RecentlyUsedScenePath-3:
      value: 224247031146467a1e1d09362337500213380a232b212831213a520cd1ce1508d1d806fbe82e30282012e632031f122cf71e1a44c508032d1831d40015ea030703cc19c955fb1e11db1519fdce18dfe6c699e7e9d1cdeee7f7d1a4e7e7e4fcf1f4fd9adfafabf3d2959fecb4a9c3c5e8c0d3b8d1d888dcc9b3c6c8
      flags: 0
    RecentlyUsedScenePath-4:
      value: 224247031146467a1e1d09362337500213380a232b212831213a520cd1ce1508d1d806fbe82e30282012e632031f122cf71e1a44c508032d1831d40015ea030703cc19c955fb1e11db1519fdce18dfe6c699e7e9d1cdeee7f7d1a4e7e7e4fcf1f4fd9acbb8a7ecd3959fecb4a9c3c5e8c0d3b8d1d888dcc9b3c6c8
      flags: 0
    RecentlyUsedScenePath-5:
      value: 224247031146467a1e1d09362337500213380a232b212831213a520cd1ce1508d1d806fbe82e30282012e632031f122cf71e1a44c508032d1831d40015ea030703cc19c955fb1e11db1519fdce18dfe6c699e7e9d1cdeee7f7d1a4e7e7e4fcf1f4fd9ac8aba5ecccaf83ffa8a0d7d38ad4c4bed0d5
      flags: 0
    RecentlyUsedScenePath-6:
      value: 2242470311464676020b4c0011285a0259361c3c2d26253529693b3af0f32078d2e224fae8347f1f360cfb2e0b320d3ae0454a2eee0a071b1d0bb22f15e9111d12c01c853cc10d0fdf592ccbdf0edeed95f5dbe4ccf9e8d4d2dab2bce1fee7ecec
      flags: 0
    RecentlyUsedScenePath-7:
      value: 22424703114646680e0b0227036c6b0502180a232d2415332827187df7ee3d2cfb
      flags: 0
    RecentlyUsedScenePath-8:
      value: 22424703114646680e0b0227036c6b19021b1d192f3a2335231a1e36ece57a2decee22f0
      flags: 0
    vcSharedLogLevel:
      value: 0d5e400f0650
      flags: 0
  m_VCAutomaticAdd: 1
  m_VCDebugCom: 0
  m_VCDebugCmd: 0
  m_VCDebugOut: 0
  m_SemanticMergeMode: 2
  m_VCShowFailedCheckout: 1
  m_VCOverwriteFailedCheckoutAssets: 1
  m_VCProjectOverlayIcons: 1
  m_VCHierarchyOverlayIcons: 1
  m_VCOtherOverlayIcons: 1
  m_VCAllowAsyncUpdate: 1
