%YAML 1.1
%TAG !u! tag:unity3d.com,2011:
--- !u!1045 &1
EditorBuildSettings:
  m_ObjectHideFlags: 0
  serializedVersion: 2
  m_Scenes:
  - enabled: 1
    path: Assets/Scenes/TitleScreenScene.unity
    guid: 9fc0d4010bbf28b4594072e72b8655ab
  - enabled: 1
    path: Assets/Scenes/PrologueScene.unity
    guid: 16d90ddc00950ab448ccf78d0c1fccda
  - enabled: 1
    path: Assets/Scenes/TutorialScene.unity
    guid: fb60b76269a5c0849b68606012d0a8ca
  m_configObjects:
    com.unity.input.settings: {fileID: 11400000, guid: 0bcc01573166ab34e937155b2889c627, type: 2}
