# MagicaVoxel @ Ephtracy

# group
o 

# material
mtllib NotPaulThatsForGodDamnSure(2).mtl
usemtl palette

# normals
vn -1 0 0
vn 1 0 0
vn 0 0 1
vn 0 0 -1
vn 0 -1 0
vn 0 1 0

# texcoords
vt 0.189453 0.5
vt 0.216797 0.5
vt 0.248047 0.5
vt 0.767578 0.5
vt 0.791016 0.5
vt 0.958984 0.5
vt 0.962891 0.5
vt 0.994141 0.5

# verts
v -12.8 20.7 -0.2
v -12.8 20.7 -5
v -12.8 23.1 -0.2
v -12.8 23.1 -5
v -6 0 0.7
v -6 0 -3.8
v -6 2.4 0.7
v -6 2.4 -1.3
v -6 2.4 -3.7
v -6 2.4 -3.8
v -6 7.2 -1.3
v -6 7.2 -3.7
v -5.8 7.2 -1.3
v -5.8 7.2 -3.7
v -5.8 9.6 -1.3
v -5.8 9.6 -3.7
v -4.9 9.6 -1.3
v -4.9 9.6 -3.7
v -4.9 12 -1.3
v -4.9 12 -3.7
v -4.2 12 -1.3
v -4.2 12 -3.7
v -4.2 14.4 -1.3
v -4.2 14.4 -3.7
v -2.5 14.4 -0.2
v -2.5 14.4 -1.3
v -2.5 14.4 -2.6
v -2.5 20.7 -0.2
v -2.5 20.7 -2.6
v -2.3 14.5 -2.6
v -2.3 14.5 -4.9
v -2.3 22.9 -2.6
v -2.3 22.9 -4.9
v -2.3 22.9 -5
v -2.3 23.1 -0.3
v -2.3 23.1 -2.6
v -2.3 25.6 -0.3
v -2.3 25.6 -5
v -2.1 14.5 -0.0999998
v -2.1 14.5 -0.2
v -2.1 22.9 -0.0999998
v -2.1 22.9 -0.2
v -1.5 23.7 -0.2
v -1.5 23.7 -0.3
v -1.5 23.8 -0.2
v -1.5 23.8 -0.3
v -1.3 23.8 -0.2
v -1.3 23.8 -0.3
v -1.3 23.9 -0.2
v -1.3 23.9 -0.3
v -1.3 24.8 -0.2
v -1.3 24.8 -0.3
v -1.3 25.1 -0.2
v -1.3 25.1 -0.3
v -1.2 24.7 -0.2
v -1.2 24.7 -0.3
v -1.2 24.8 -0.2
v -1.2 24.8 -0.3
v -1.2 25.1 -0.2
v -1.2 25.1 -0.3
v -1.2 25.2 -0.2
v -1.2 25.2 -0.3
v -1.1 24.6 -0.2
v -1.1 24.6 -0.3
v -1.1 24.7 -0.2
v -1.1 24.7 -0.3
v -1.1 25.2 -0.2
v -1.1 25.2 -0.3
v -1.1 25.3 -0.2
v -1.1 25.3 -0.3
v -0.900001 23.9 -0.2
v -0.900001 23.9 -0.3
v -0.900001 24 -0.2
v -0.900001 24 -0.3
v -0.900001 24.9 -0.2
v -0.900001 24.9 -0.3
v -0.900001 25 -0.2
v -0.900001 25 -0.3
v -0.6 24 -0.2
v -0.6 24 -0.3
v -0.6 24.1 -0.2
v -0.6 24.1 -0.3
v -0.200001 24.1 -0.2
v -0.200001 24.1 -0.3
v -0.200001 24.2 -0.2
v -0.200001 24.2 -0.3
v -0.200001 24.3 0.2
v -0.200001 24.3 -0.3
v -0.200001 24.5 0.2
v -0.200001 24.5 0.1
v -0.200001 24.6 0.1
v -0.200001 24.6 1.78814e-007
v -0.200001 24.7 1.78814e-007
v -0.200001 24.7 -0.0999998
v -0.200001 24.8 -0.0999998
v -0.200001 24.8 -0.2
v -0.200001 24.9 -0.2
v -0.200001 24.9 -0.3
v -0.1 24.1 -0.0999998
v -0.1 24.1 -0.2
v -0.1 24.2 -0.0999998
v -0.1 24.2 -0.2
v 0.2 14.6 -2.5
v 0.2 14.6 -3.6
v 0.2 14.6 -4.8
v 0.2 14.8 -2.5
v 0.2 14.8 -3.6
v 0.2 22.9 -2.5
v 0.2 22.9 -4.8
v 0.2 24 -0.2
v 0.2 24 -0.3
v 0.2 24.1 -0.2
v 0.2 24.1 -0.3
v 0.299999 14.6 1.78814e-007
v 0.299999 14.6 -0.0999998
v 0.299999 19.6 -0.0999998
v 0.299999 19.7 1.78814e-007
v 0.299999 19.7 -0.0999998
v 0.299999 20.2 -0.0999998
v 0.299999 20.3 1.78814e-007
v 0.299999 20.3 -0.0999998
v 0.299999 21.3 1.78814e-007
v 0.299999 21.3 -0.0999998
v 0.299999 21.4 1.78814e-007
v 0.299999 21.4 -0.0999998
v 0.299999 22.2 1.78814e-007
v 0.299999 22.2 -0.0999998
v 0.299999 22.3 1.78814e-007
v 0.299999 22.3 -0.0999998
v 0.299999 22.9 1.78814e-007
v 0.299999 22.9 -0.0999998
v 0.4 24.8 -0.2
v 0.4 24.8 -0.3
v 0.4 25.1 -0.2
v 0.4 25.1 -0.3
v 0.5 23.9 -0.2
v 0.5 23.9 -0.3
v 0.5 24 -0.2
v 0.5 24 -0.3
v 0.5 24.7 -0.2
v 0.5 24.7 -0.3
v 0.5 24.8 -0.2
v 0.5 24.8 -0.3
v 0.5 25.1 -0.2
v 0.5 25.1 -0.3
v 0.5 25.2 -0.2
v 0.5 25.2 -0.3
v 0.599999 24.6 -0.2
v 0.599999 24.6 -0.3
v 0.599999 24.7 -0.2
v 0.599999 24.7 -0.3
v 0.599999 25.2 -0.2
v 0.599999 25.2 -0.3
v 0.599999 25.3 -0.2
v 0.599999 25.3 -0.3
v 0.799999 12 -1.2
v 0.799999 12 -3.6
v 0.799999 14.6 -1.2
v 0.799999 14.6 -3.6
v 0.799999 23.8 -0.2
v 0.799999 23.8 -0.3
v 0.799999 23.9 -0.2
v 0.799999 23.9 -0.3
v 1.1 23.7 -0.2
v 1.1 23.7 -0.3
v 1.1 23.8 -0.2
v 1.1 23.8 -0.3
v 1.4 9.6 -1.8
v 1.4 9.6 -4.2
v 1.4 12 -1.8
v 1.4 12 -3.6
v 1.4 12 -4.2
v 1.8 7.2 -1.8
v 1.8 7.2 -4.2
v 1.8 9.6 -1.8
v 1.8 9.6 -4.2
v 2.1 0 0.2
v 2.1 0 -4.6
v 2.1 2.4 0.2
v 2.1 2.4 -2
v 2.1 2.4 -4.4
v 2.1 2.4 -4.6
v 2.1 7.2 -2
v 2.1 7.2 -4.2
v 2.1 7.2 -4.4
v 2.7 20.9 -2.4
v 2.7 20.9 -5.1
v 2.7 22.9 -0.3
v 2.7 22.9 -2.4
v 2.7 23.2 -0.3
v 2.7 23.2 -5.1
v -3.6 0 0.7
v -3.6 0 -3.8
v -3.6 2.4 0.7
v -3.6 2.4 -1.3
v -3.6 2.4 -3.7
v -3.6 2.4 -3.8
v -3.6 7.2 -1.3
v -3.6 7.2 -3.7
v -3.4 7.2 -1.3
v -3.4 7.2 -3.7
v -3.4 9.6 -1.3
v -3.4 9.6 -3.7
v -2.5 9.6 -1.3
v -2.5 9.6 -3.7
v -2.5 12 -1.3
v -2.5 12 -3.7
v -2.5 20.7 -2.6
v -2.5 20.7 -5
v -2.5 23.1 -2.6
v -2.5 23.1 -5
v -2.1 14.4 -0.2
v -2.1 14.4 -1.3
v -2.1 14.4 -2.6
v -2.1 14.5 -0.2
v -2.1 14.5 -2.6
v -2.1 22.9 -0.2
v -2.1 22.9 -0.3
v -2.1 23.1 -0.2
v -2.1 23.1 -0.3
v -1.8 12 -1.3
v -1.8 12 -3.7
v -1.8 14.4 -1.3
v -1.8 14.4 -3.7
v -1.3 23.7 -0.2
v -1.3 23.7 -0.3
v -1.3 23.8 -0.2
v -1.3 23.8 -0.3
v -1 24.9 -0.2
v -1 24.9 -0.3
v -1 25 -0.2
v -1 25 -0.3
v -0.900001 23.8 -0.2
v -0.900001 23.8 -0.3
v -0.900001 23.9 -0.2
v -0.900001 23.9 -0.3
v -0.8 24.6 -0.2
v -0.8 24.6 -0.3
v -0.8 24.7 -0.2
v -0.8 24.7 -0.3
v -0.8 25.2 -0.2
v -0.8 25.2 -0.3
v -0.8 25.3 -0.2
v -0.8 25.3 -0.3
v -0.700001 24.7 -0.2
v -0.700001 24.7 -0.3
v -0.700001 24.8 -0.2
v -0.700001 24.8 -0.3
v -0.700001 25.1 -0.2
v -0.700001 25.1 -0.3
v -0.700001 25.2 -0.2
v -0.700001 25.2 -0.3
v -0.6 23.9 -0.2
v -0.6 23.9 -0.3
v -0.6 24 -0.2
v -0.6 24 -0.3
v -0.6 24.8 -0.2
v -0.6 24.8 -0.3
v -0.6 25.1 -0.2
v -0.6 25.1 -0.3
v -0.200001 24 -0.2
v -0.200001 24 -0.3
v -0.200001 24.1 -0.2
v -0.200001 24.1 -0.3
v 0 24.1 -0.0999998
v 0 24.1 -0.2
v 0 24.2 -0.0999998
v 0 24.2 -0.2
v 0 24.3 0.2
v 0 24.3 -0.3
v 0 24.5 0.2
v 0 24.5 0.1
v 0 24.6 0.1
v 0 24.6 1.78814e-007
v 0 24.7 1.78814e-007
v 0 24.7 -0.0999998
v 0 24.8 -0.0999998
v 0 24.8 -0.2
v 0 24.9 -0.2
v 0 24.9 -0.3
v 0.0999994 14.5 -2.5
v 0.0999994 14.5 -4.9
v 0.0999994 14.8 -2.5
v 0.0999994 22.9 -2.5
v 0.0999994 22.9 -4.9
v 0.2 24.1 -0.2
v 0.2 24.1 -0.3
v 0.2 24.2 -0.2
v 0.2 24.2 -0.3
v 0.299999 14.5 -0.0999998
v 0.299999 14.5 -1.2
v 0.299999 14.5 -2.5
v 0.299999 14.6 -0.0999998
v 0.299999 14.6 -1.2
v 0.299999 14.6 -2.5
v 0.5 24 -0.2
v 0.5 24 -0.3
v 0.5 24.1 -0.2
v 0.5 24.1 -0.3
v 0.799999 23.9 -0.2
v 0.799999 23.9 -0.3
v 0.799999 24 -0.2
v 0.799999 24 -0.3
v 0.9 24.6 -0.2
v 0.9 24.6 -0.3
v 0.9 24.7 -0.2
v 0.9 24.7 -0.3
v 0.9 25.2 -0.2
v 0.9 25.2 -0.3
v 0.9 25.3 -0.2
v 0.9 25.3 -0.3
v 1 24.7 -0.2
v 1 24.7 -0.3
v 1 24.8 -0.2
v 1 24.8 -0.3
v 1 25.1 -0.2
v 1 25.1 -0.3
v 1 25.2 -0.2
v 1 25.2 -0.3
v 1.1 23.8 -0.2
v 1.1 23.8 -0.3
v 1.1 23.9 -0.2
v 1.1 23.9 -0.3
v 1.1 24.8 -0.2
v 1.1 24.8 -0.3
v 1.1 25.1 -0.2
v 1.1 25.1 -0.3
v 1.3 23.7 -0.2
v 1.3 23.7 -0.3
v 1.3 23.8 -0.2
v 1.3 23.8 -0.3
v 2.4 22.9 -0.3
v 2.4 22.9 -4.8
v 2.4 22.9 -5
v 2.4 25.6 -0.3
v 2.4 25.6 -5
v 2.6 14.6 -3.6
v 2.6 14.6 -4.8
v 2.6 14.8 -3.6
v 2.6 15.1 -2.4
v 2.6 15.1 -3.6
v 2.6 22.9 -2.4
v 2.6 22.9 -4.8
v 2.7 14.6 1.78814e-007
v 2.7 14.6 -1.2
v 2.7 14.8 -1.2
v 2.7 14.8 -3.6
v 2.7 15.1 -2.4
v 2.7 15.1 -3.6
v 2.7 20.9 -0.3
v 2.7 20.9 -2.4
v 2.7 22.9 1.78814e-007
v 2.7 22.9 -0.3
v 3.2 12 -1.2
v 3.2 12 -1.8
v 3.2 12 -3.6
v 3.2 14.8 -1.2
v 3.2 14.8 -3.6
v 3.8 9.6 -1.8
v 3.8 9.6 -4.2
v 3.8 12 -1.8
v 3.8 12 -4.2
v 4.2 7.2 -1.8
v 4.2 7.2 -2
v 4.2 7.2 -4.2
v 4.2 9.6 -1.8
v 4.2 9.6 -4.2
v 4.5 0 0.2
v 4.5 0 -4.6
v 4.5 2.4 0.2
v 4.5 2.4 -2
v 4.5 2.4 -4.4
v 4.5 2.4 -4.6
v 4.5 7.2 -2
v 4.5 7.2 -4.4
v 12.8 20.9 -0.3
v 12.8 20.9 -5.1
v 12.8 23.2 -0.3
v 12.8 23.2 -5.1
v -6 0 0.7
v -6 2.4 0.7
v -3.6 0 0.7
v -3.6 2.4 0.7
v -0.200001 24.3 0.2
v -0.200001 24.5 0.2
v 0 24.3 0.2
v 0 24.5 0.2
v 2.1 0 0.2
v 2.1 2.4 0.2
v 4.5 0 0.2
v 4.5 2.4 0.2
v -0.200001 24.5 0.1
v -0.200001 24.6 0.1
v 0 24.5 0.1
v 0 24.6 0.1
v -0.200001 24.6 1.78814e-007
v -0.200001 24.7 1.78814e-007
v 0 24.6 1.78814e-007
v 0 24.7 1.78814e-007
v 0.299999 14.6 1.78814e-007
v 0.299999 19.7 1.78814e-007
v 0.299999 20.3 1.78814e-007
v 0.299999 21.3 1.78814e-007
v 0.299999 21.4 1.78814e-007
v 0.299999 22.2 1.78814e-007
v 0.299999 22.3 1.78814e-007
v 0.299999 22.9 1.78814e-007
v 0.4 19.7 1.78814e-007
v 0.4 19.8 1.78814e-007
v 0.4 20.3 1.78814e-007
v 0.4 20.4 1.78814e-007
v 0.5 18.5 1.78814e-007
v 0.5 19.3 1.78814e-007
v 0.5 19.8 1.78814e-007
v 0.5 19.9 1.78814e-007
v 0.5 20.4 1.78814e-007
v 0.5 20.5 1.78814e-007
v 0.599999 18.6 1.78814e-007
v 0.599999 18.8 1.78814e-007
v 0.599999 18.9 1.78814e-007
v 0.599999 19.2 1.78814e-007
v 0.599999 19.9 1.78814e-007
v 0.599999 20 1.78814e-007
v 0.599999 20.5 1.78814e-007
v 0.599999 20.6 1.78814e-007
v 0.7 20 1.78814e-007
v 0.7 20.1 1.78814e-007
v 0.7 20.6 1.78814e-007
v 0.7 20.7 1.78814e-007
v 0.7 22.2 1.78814e-007
v 0.7 22.3 1.78814e-007
v 0.799999 20.1 1.78814e-007
v 0.799999 20.2 1.78814e-007
v 0.799999 21.3 1.78814e-007
v 0.799999 21.4 1.78814e-007
v 0.9 18.5 1.78814e-007
v 0.9 18.6 1.78814e-007
v 0.9 18.8 1.78814e-007
v 0.9 18.9 1.78814e-007
v 0.9 20.2 1.78814e-007
v 0.9 20.3 1.78814e-007
v 0.9 20.6 1.78814e-007
v 0.9 20.7 1.78814e-007
v 1 19.2 1.78814e-007
v 1 19.3 1.78814e-007
v 1 20.3 1.78814e-007
v 1 20.4 1.78814e-007
v 1 20.5 1.78814e-007
v 1 20.6 1.78814e-007
v 1.1 18.4 1.78814e-007
v 1.1 19.3 1.78814e-007
v 1.1 20.4 1.78814e-007
v 1.1 20.5 1.78814e-007
v 1.2 18.5 1.78814e-007
v 1.2 18.8 1.78814e-007
v 1.2 18.9 1.78814e-007
v 1.2 19.2 1.78814e-007
v 1.6 18.4 1.78814e-007
v 1.6 18.5 1.78814e-007
v 1.6 18.8 1.78814e-007
v 1.6 18.9 1.78814e-007
v 1.6 19.2 1.78814e-007
v 1.6 19.3 1.78814e-007
v 1.8 18.3 1.78814e-007
v 1.8 18.4 1.78814e-007
v 1.8 18.8 1.78814e-007
v 1.8 19.3 1.78814e-007
v 1.9 18.9 1.78814e-007
v 1.9 19.2 1.78814e-007
v 2.3 18.4 1.78814e-007
v 2.3 18.8 1.78814e-007
v 2.4 18.3 1.78814e-007
v 2.4 18.9 1.78814e-007
v 2.4 19.2 1.78814e-007
v 2.4 19.3 1.78814e-007
v 2.7 14.6 1.78814e-007
v 2.7 22.9 1.78814e-007
v -2.1 14.5 -0.0999998
v -2.1 22.9 -0.0999998
v -1.2 19.2 -0.0999998
v -1.2 19.3 -0.0999998
v -0.900001 18.5 -0.0999998
v -0.900001 19.2 -0.0999998
v -0.8 18.5 -0.0999998
v -0.8 19.2 -0.0999998
v -0.5 19.2 -0.0999998
v -0.5 19.3 -0.0999998
v -0.5 20.3 -0.0999998
v -0.5 20.6 -0.0999998
v -0.400001 18.5 -0.0999998
v -0.400001 19.3 -0.0999998
v -0.400001 20.2 -0.0999998
v -0.400001 20.3 -0.0999998
v -0.400001 20.6 -0.0999998
v -0.400001 20.7 -0.0999998
v -0.400001 21.3 -0.0999998
v -0.400001 21.4 -0.0999998
v -0.400001 22.2 -0.0999998
v -0.400001 22.3 -0.0999998
v -0.3 18.5 -0.0999998
v -0.3 19.2 -0.0999998
v -0.3 20.1 -0.0999998
v -0.3 20.2 -0.0999998
v -0.200001 18.7 -0.0999998
v -0.200001 18.8 -0.0999998
v -0.200001 20 -0.0999998
v -0.200001 20.1 -0.0999998
v -0.200001 20.6 -0.0999998
v -0.200001 20.7 -0.0999998
v -0.200001 24.7 -0.0999998
v -0.200001 24.8 -0.0999998
v -0.1 18.6 -0.0999998
v -0.1 18.7 -0.0999998
v -0.1 18.8 -0.0999998
v -0.1 18.9 -0.0999998
v -0.1 19.9 -0.0999998
v -0.1 20 -0.0999998
v -0.1 20.5 -0.0999998
v -0.1 20.6 -0.0999998
v -0.1 24.1 -0.0999998
v -0.1 24.2 -0.0999998
v 0 18.5 -0.0999998
v 0 18.6 -0.0999998
v 0 18.7 -0.0999998
v 0 18.8 -0.0999998
v 0 18.9 -0.0999998
v 0 19 -0.0999998
v 0 19.8 -0.0999998
v 0 19.9 -0.0999998
v 0 20.4 -0.0999998
v 0 20.5 -0.0999998
v 0 24.1 -0.0999998
v 0 24.2 -0.0999998
v 0 24.7 -0.0999998
v 0 24.8 -0.0999998
v 0.0999994 18.5 -0.0999998
v 0.0999994 18.6 -0.0999998
v 0.0999994 19 -0.0999998
v 0.0999994 19.2 -0.0999998
v 0.0999994 19.7 -0.0999998
v 0.0999994 19.8 -0.0999998
v 0.0999994 20.3 -0.0999998
v 0.0999994 20.4 -0.0999998
v 0.0999994 21.4 -0.0999998
v 0.0999994 22.2 -0.0999998
v 0.2 18.9 -0.0999998
v 0.2 19.3 -0.0999998
v 0.2 19.6 -0.0999998
v 0.2 19.7 -0.0999998
v 0.2 20.2 -0.0999998
v 0.2 20.3 -0.0999998
v 0.2 21.4 -0.0999998
v 0.2 22.2 -0.0999998
v 0.299999 14.5 -0.0999998
v 0.299999 14.6 -0.0999998
v 0.299999 19.6 -0.0999998
v 0.299999 19.7 -0.0999998
v 0.299999 20.2 -0.0999998
v 0.299999 20.3 -0.0999998
v 0.299999 21.3 -0.0999998
v 0.299999 21.4 -0.0999998
v 0.299999 22.2 -0.0999998
v 0.299999 22.3 -0.0999998
v 0.299999 22.9 -0.0999998
v -12.8 20.7 -0.2
v -12.8 23.1 -0.2
v -5.4 20.7 -0.2
v -5.4 23.1 -0.2
v -2.5 14.4 -0.2
v -2.5 20.7 -0.2
v -2.1 14.4 -0.2
v -2.1 14.5 -0.2
v -2.1 22.9 -0.2
v -2.1 23.1 -0.2
v -1.5 23.7 -0.2
v -1.5 23.8 -0.2
v -1.3 23.7 -0.2
v -1.3 23.8 -0.2
v -1.3 23.9 -0.2
v -1.3 24.8 -0.2
v -1.3 25.1 -0.2
v -1.2 24.7 -0.2
v -1.2 24.8 -0.2
v -1.2 25.1 -0.2
v -1.2 25.2 -0.2
v -1.1 24.6 -0.2
v -1.1 24.7 -0.2
v -1.1 24.9 -0.2
v -1.1 25 -0.2
v -1.1 25.2 -0.2
v -1.1 25.3 -0.2
v -1 24.8 -0.2
v -1 24.9 -0.2
v -1 25 -0.2
v -1 25.1 -0.2
v -0.900001 23.8 -0.2
v -0.900001 23.9 -0.2
v -0.900001 24 -0.2
v -0.900001 24.8 -0.2
v -0.900001 24.9 -0.2
v -0.900001 25 -0.2
v -0.900001 25.1 -0.2
v -0.8 24.6 -0.2
v -0.8 24.7 -0.2
v -0.8 24.9 -0.2
v -0.8 25 -0.2
v -0.8 25.2 -0.2
v -0.8 25.3 -0.2
v -0.700001 24.7 -0.2
v -0.700001 24.8 -0.2
v -0.700001 25.1 -0.2
v -0.700001 25.2 -0.2
v -0.6 23.9 -0.2
v -0.6 24 -0.2
v -0.6 24.1 -0.2
v -0.6 24.8 -0.2
v -0.6 25.1 -0.2
v -0.200001 24 -0.2
v -0.200001 24.1 -0.2
v -0.200001 24.2 -0.2
v -0.200001 24.8 -0.2
v -0.200001 24.9 -0.2
v -0.1 24.1 -0.2
v -0.1 24.2 -0.2
v 0 24.1 -0.2
v 0 24.2 -0.2
v 0 24.8 -0.2
v 0 24.9 -0.2
v 0.2 24 -0.2
v 0.2 24.1 -0.2
v 0.2 24.2 -0.2
v 0.4 24.8 -0.2
v 0.4 25.1 -0.2
v 0.5 23.9 -0.2
v 0.5 24 -0.2
v 0.5 24.1 -0.2
v 0.5 24.7 -0.2
v 0.5 24.8 -0.2
v 0.5 25.1 -0.2
v 0.5 25.2 -0.2
v 0.599999 24.6 -0.2
v 0.599999 24.7 -0.2
v 0.599999 24.9 -0.2
v 0.599999 25 -0.2
v 0.599999 25.2 -0.2
v 0.599999 25.3 -0.2
v 0.7 24.8 -0.2
v 0.7 24.9 -0.2
v 0.7 25 -0.2
v 0.7 25.1 -0.2
v 0.799999 23.8 -0.2
v 0.799999 23.9 -0.2
v 0.799999 24 -0.2
v 0.799999 24.8 -0.2
v 0.799999 24.9 -0.2
v 0.799999 25 -0.2
v 0.799999 25.1 -0.2
v 0.9 24.6 -0.2
v 0.9 24.7 -0.2
v 0.9 24.9 -0.2
v 0.9 25 -0.2
v 0.9 25.2 -0.2
v 0.9 25.3 -0.2
v 1 24.7 -0.2
v 1 24.8 -0.2
v 1 25.1 -0.2
v 1 25.2 -0.2
v 1.1 23.7 -0.2
v 1.1 23.8 -0.2
v 1.1 23.9 -0.2
v 1.1 24.8 -0.2
v 1.1 25.1 -0.2
v 1.3 23.7 -0.2
v 1.3 23.8 -0.2
v -2.3 23.1 -0.3
v -2.3 25.6 -0.3
v -2.1 22.9 -0.3
v -2.1 23.1 -0.3
v -1.5 23.7 -0.3
v -1.5 23.8 -0.3
v -1.3 23.7 -0.3
v -1.3 23.8 -0.3
v -1.3 23.9 -0.3
v -1.3 24.8 -0.3
v -1.3 25.1 -0.3
v -1.2 24.7 -0.3
v -1.2 24.8 -0.3
v -1.2 25.1 -0.3
v -1.2 25.2 -0.3
v -1.1 24.6 -0.3
v -1.1 24.7 -0.3
v -1.1 25.2 -0.3
v -1.1 25.3 -0.3
v -1 24.9 -0.3
v -1 25 -0.3
v -0.900001 23.8 -0.3
v -0.900001 23.9 -0.3
v -0.900001 24 -0.3
v -0.900001 24.9 -0.3
v -0.900001 25 -0.3
v -0.8 24.6 -0.3
v -0.8 24.7 -0.3
v -0.8 25.2 -0.3
v -0.8 25.3 -0.3
v -0.700001 24.7 -0.3
v -0.700001 24.8 -0.3
v -0.700001 25.1 -0.3
v -0.700001 25.2 -0.3
v -0.6 23.9 -0.3
v -0.6 24 -0.3
v -0.6 24.1 -0.3
v -0.6 24.8 -0.3
v -0.6 25.1 -0.3
v -0.200001 24 -0.3
v -0.200001 24.1 -0.3
v -0.200001 24.2 -0.3
v -0.200001 24.3 -0.3
v -0.200001 24.9 -0.3
v 0 24.3 -0.3
v 0 24.9 -0.3
v 0.2 24 -0.3
v 0.2 24.1 -0.3
v 0.2 24.2 -0.3
v 0.4 24.8 -0.3
v 0.4 25.1 -0.3
v 0.5 23.9 -0.3
v 0.5 24 -0.3
v 0.5 24.1 -0.3
v 0.5 24.7 -0.3
v 0.5 24.8 -0.3
v 0.5 25.1 -0.3
v 0.5 25.2 -0.3
v 0.599999 24.6 -0.3
v 0.599999 24.7 -0.3
v 0.599999 25.2 -0.3
v 0.599999 25.3 -0.3
v 0.799999 23.8 -0.3
v 0.799999 23.9 -0.3
v 0.799999 24 -0.3
v 0.9 24.6 -0.3
v 0.9 24.7 -0.3
v 0.9 25.2 -0.3
v 0.9 25.3 -0.3
v 1 24.7 -0.3
v 1 24.8 -0.3
v 1 25.1 -0.3
v 1 25.2 -0.3
v 1.1 23.7 -0.3
v 1.1 23.8 -0.3
v 1.1 23.9 -0.3
v 1.1 24.8 -0.3
v 1.1 25.1 -0.3
v 1.3 23.7 -0.3
v 1.3 23.8 -0.3
v 2.4 22.9 -0.3
v 2.4 25.6 -0.3
v 2.7 20.9 -0.3
v 2.7 22.9 -0.3
v 2.7 23.2 -0.3
v 5.1 20.9 -0.3
v 5.1 23.2 -0.3
v 12.8 20.9 -0.3
v 12.8 23.2 -0.3
v 0.799999 12 -1.2
v 0.799999 14.6 -1.2
v 2.7 14.6 -1.2
v 2.7 14.8 -1.2
v 3.2 12 -1.2
v 3.2 14.8 -1.2
v -6 2.4 -1.3
v -6 7.2 -1.3
v -5.8 7.2 -1.3
v -5.8 9.6 -1.3
v -4.9 9.6 -1.3
v -4.9 12 -1.3
v -4.2 12 -1.3
v -4.2 14.4 -1.3
v -3.6 2.4 -1.3
v -3.6 7.2 -1.3
v -3.4 7.2 -1.3
v -3.4 9.6 -1.3
v -2.5 9.6 -1.3
v -2.5 12 -1.3
v -2.5 14.4 -1.3
v -2.1 14.4 -1.3
v -1.8 12 -1.3
v -1.8 14.4 -1.3
v 1.4 9.6 -1.8
v 1.4 12 -1.8
v 1.8 7.2 -1.8
v 1.8 9.6 -1.8
v 3.2 12 -1.8
v 3.8 9.6 -1.8
v 3.8 12 -1.8
v 4.2 7.2 -1.8
v 4.2 9.6 -1.8
v 2.1 2.4 -2
v 2.1 7.2 -2
v 4.2 7.2 -2
v 4.5 2.4 -2
v 4.5 7.2 -2
v 2.6 15.1 -2.4
v 2.6 22.9 -2.4
v 2.7 15.1 -2.4
v 2.7 20.9 -2.4
v 2.7 22.9 -2.4
v 0.0999994 14.5 -2.5
v 0.0999994 14.8 -2.5
v 0.0999994 22.9 -2.5
v 0.2 14.6 -2.5
v 0.2 14.8 -2.5
v 0.2 22.9 -2.5
v 0.299999 14.5 -2.5
v 0.299999 14.6 -2.5
v -2.5 14.4 -2.6
v -2.5 20.7 -2.6
v -2.5 23.1 -2.6
v -2.3 14.5 -2.6
v -2.3 22.9 -2.6
v -2.3 23.1 -2.6
v -2.1 14.4 -2.6
v -2.1 14.5 -2.6
v 0.799999 12 -3.6
v 0.799999 14.6 -3.6
v 1.4 12 -3.6
v 2.6 14.6 -3.6
v 2.6 14.8 -3.6
v 2.6 15.1 -3.6
v 2.7 14.8 -3.6
v 2.7 15.1 -3.6
v 3.2 12 -3.6
v 3.2 14.8 -3.6
v -6 2.4 -3.7
v -6 7.2 -3.7
v -5.8 7.2 -3.7
v -5.8 9.6 -3.7
v -4.9 9.6 -3.7
v -4.9 12 -3.7
v -4.2 12 -3.7
v -4.2 14.4 -3.7
v -3.6 2.4 -3.7
v -3.6 7.2 -3.7
v -3.4 7.2 -3.7
v -3.4 9.6 -3.7
v -2.5 9.6 -3.7
v -2.5 12 -3.7
v -1.8 12 -3.7
v -1.8 14.4 -3.7
v -6 0 -3.8
v -6 2.4 -3.8
v -3.6 0 -3.8
v -3.6 2.4 -3.8
v 1.4 9.6 -4.2
v 1.4 12 -4.2
v 1.8 7.2 -4.2
v 1.8 9.6 -4.2
v 2.1 7.2 -4.2
v 3.8 9.6 -4.2
v 3.8 12 -4.2
v 4.2 7.2 -4.2
v 4.2 9.6 -4.2
v 2.1 2.4 -4.4
v 2.1 7.2 -4.4
v 4.5 2.4 -4.4
v 4.5 7.2 -4.4
v 2.1 0 -4.6
v 2.1 2.4 -4.6
v 4.5 0 -4.6
v 4.5 2.4 -4.6
v 0.2 14.6 -4.8
v 0.2 22.9 -4.8
v 2.4 22.9 -4.8
v 2.6 14.6 -4.8
v 2.6 22.9 -4.8
v -2.3 14.5 -4.9
v -2.3 22.9 -4.9
v 0.0999994 14.5 -4.9
v 0.0999994 22.9 -4.9
v -12.8 20.7 -5
v -12.8 23.1 -5
v -5.4 20.7 -5
v -5.4 23.1 -5
v -2.5 20.7 -5
v -2.5 23.1 -5
v -2.3 22.9 -5
v -2.3 25.6 -5
v 2.4 22.9 -5
v 2.4 25.6 -5
v 2.7 20.9 -5.1
v 2.7 23.2 -5.1
v 5.1 20.9 -5.1
v 5.1 23.2 -5.1
v 12.8 20.9 -5.1
v 12.8 23.2 -5.1
v -6 0 0.7
v -3.6 0 0.7
v 2.1 0 0.2
v 4.5 0 0.2
v -6 0 -3.8
v -3.6 0 -3.8
v 2.1 0 -4.6
v 4.5 0 -4.6
v -3.6 7.2 -1.3
v -3.4 7.2 -1.3
v 1.8 7.2 -1.8
v 4.2 7.2 -1.8
v 2.1 7.2 -2
v 4.2 7.2 -2
v -3.6 7.2 -3.7
v -3.4 7.2 -3.7
v 1.8 7.2 -4.2
v 2.1 7.2 -4.2
v -3.4 9.6 -1.3
v -2.5 9.6 -1.3
v 1.4 9.6 -1.8
v 1.8 9.6 -1.8
v -3.4 9.6 -3.7
v -2.5 9.6 -3.7
v 1.4 9.6 -4.2
v 1.8 9.6 -4.2
v 0.799999 12 -1.2
v 3.2 12 -1.2
v -2.5 12 -1.3
v -1.8 12 -1.3
v 1.4 12 -1.8
v 3.2 12 -1.8
v 0.799999 12 -3.6
v 1.4 12 -3.6
v -2.5 12 -3.7
v -1.8 12 -3.7
v -2.5 14.4 -0.2
v -2.1 14.4 -0.2
v -2.5 14.4 -1.3
v -2.1 14.4 -1.3
v -2.1 14.5 -0.0999998
v 0.299999 14.5 -0.0999998
v -2.1 14.5 -0.2
v 0.0999994 14.5 -1.2
v 0.299999 14.5 -1.2
v 0.0999994 14.5 -2.5
v 0.299999 14.5 -2.5
v -2.3 14.5 -2.6
v -2.1 14.5 -2.6
v -2.3 14.5 -4.9
v 0.0999994 14.5 -4.9
v 0.299999 14.6 1.78814e-007
v 2.7 14.6 1.78814e-007
v 0.299999 14.6 -0.0999998
v 0.299999 14.6 -1.2
v 0.799999 14.6 -1.2
v 2.7 14.6 -1.2
v 0.2 14.6 -2.5
v 0.299999 14.6 -2.5
v 0.2 14.6 -3.6
v 0.799999 14.6 -3.6
v 2.6 14.6 -3.6
v 0.2 14.6 -4.8
v 2.6 14.6 -4.8
v -12.8 20.7 -0.2
v -5.4 20.7 -0.2
v -2.5 20.7 -0.2
v -2.5 20.7 -2.6
v -12.8 20.7 -5
v -5.4 20.7 -5
v -2.5 20.7 -5
v 2.7 20.9 -0.3
v 5.1 20.9 -0.3
v 12.8 20.9 -0.3
v 2.7 20.9 -2.4
v 2.7 20.9 -5.1
v 5.1 20.9 -5.1
v 12.8 20.9 -5.1
v 0.0999994 22.9 -2.5
v 0.2 22.9 -2.5
v 0.2 22.9 -4.8
v 2.4 22.9 -4.8
v -2.3 22.9 -4.9
v 0.0999994 22.9 -4.9
v -2.3 22.9 -5
v 2.4 22.9 -5
v -1.5 23.7 -0.2
v -1.3 23.7 -0.2
v 1.1 23.7 -0.2
v 1.3 23.7 -0.2
v -1.5 23.7 -0.3
v -1.3 23.7 -0.3
v 1.1 23.7 -0.3
v 1.3 23.7 -0.3
v -1.3 23.8 -0.2
v -0.900001 23.8 -0.2
v 0.799999 23.8 -0.2
v 1.1 23.8 -0.2
v -1.3 23.8 -0.3
v -0.900001 23.8 -0.3
v 0.799999 23.8 -0.3
v 1.1 23.8 -0.3
v -0.900001 23.9 -0.2
v -0.6 23.9 -0.2
v 0.5 23.9 -0.2
v 0.799999 23.9 -0.2
v -0.900001 23.9 -0.3
v -0.6 23.9 -0.3
v 0.5 23.9 -0.3
v 0.799999 23.9 -0.3
v -0.6 24 -0.2
v -0.200001 24 -0.2
v 0.2 24 -0.2
v 0.5 24 -0.2
v -0.6 24 -0.3
v -0.200001 24 -0.3
v 0.2 24 -0.3
v 0.5 24 -0.3
v -0.1 24.1 -0.0999998
v 0 24.1 -0.0999998
v -0.200001 24.1 -0.2
v -0.1 24.1 -0.2
v 0 24.1 -0.2
v 0.2 24.1 -0.2
v -0.200001 24.1 -0.3
v 0.2 24.1 -0.3
v -0.200001 24.3 0.2
v 0 24.3 0.2
v -0.200001 24.3 -0.3
v 0 24.3 -0.3
v -1.1 24.6 -0.2
v -0.8 24.6 -0.2
v 0.599999 24.6 -0.2
v 0.9 24.6 -0.2
v -1.1 24.6 -0.3
v -0.8 24.6 -0.3
v 0.599999 24.6 -0.3
v 0.9 24.6 -0.3
v -1.2 24.7 -0.2
v -1.1 24.7 -0.2
v -0.8 24.7 -0.2
v -0.700001 24.7 -0.2
v 0.5 24.7 -0.2
v 0.599999 24.7 -0.2
v 0.9 24.7 -0.2
v 1 24.7 -0.2
v -1.2 24.7 -0.3
v -1.1 24.7 -0.3
v -0.8 24.7 -0.3
v -0.700001 24.7 -0.3
v 0.5 24.7 -0.3
v 0.599999 24.7 -0.3
v 0.9 24.7 -0.3
v 1 24.7 -0.3
v -1.3 24.8 -0.2
v -1.2 24.8 -0.2
v -0.700001 24.8 -0.2
v -0.6 24.8 -0.2
v 0.4 24.8 -0.2
v 0.5 24.8 -0.2
v 1 24.8 -0.2
v 1.1 24.8 -0.2
v -1.3 24.8 -0.3
v -1.2 24.8 -0.3
v -0.700001 24.8 -0.3
v -0.6 24.8 -0.3
v 0.4 24.8 -0.3
v 0.5 24.8 -0.3
v 1 24.8 -0.3
v 1.1 24.8 -0.3
v -1 25 -0.2
v -0.900001 25 -0.2
v -1 25 -0.3
v -0.900001 25 -0.3
v -6 2.4 0.7
v -3.6 2.4 0.7
v 2.1 2.4 0.2
v 4.5 2.4 0.2
v -6 2.4 -1.3
v -3.6 2.4 -1.3
v 2.1 2.4 -2
v 4.5 2.4 -2
v -6 2.4 -3.7
v -3.6 2.4 -3.7
v -6 2.4 -3.8
v -3.6 2.4 -3.8
v 2.1 2.4 -4.4
v 4.5 2.4 -4.4
v 2.1 2.4 -4.6
v 4.5 2.4 -4.6
v -6 7.2 -1.3
v -5.8 7.2 -1.3
v 4.2 7.2 -2
v 4.5 7.2 -2
v -6 7.2 -3.7
v -5.8 7.2 -3.7
v 2.1 7.2 -4.2
v 4.2 7.2 -4.2
v 2.1 7.2 -4.4
v 4.5 7.2 -4.4
v -5.8 9.6 -1.3
v -4.9 9.6 -1.3
v 3.8 9.6 -1.8
v 4.2 9.6 -1.8
v -5.8 9.6 -3.7
v -4.9 9.6 -3.7
v 3.8 9.6 -4.2
v 4.2 9.6 -4.2
v -4.9 12 -1.3
v -4.2 12 -1.3
v 3.2 12 -1.8
v 3.8 12 -1.8
v 1.4 12 -3.6
v 3.2 12 -3.6
v -4.9 12 -3.7
v -4.2 12 -3.7
v 1.4 12 -4.2
v 3.8 12 -4.2
v -4.2 14.4 -1.3
v -2.5 14.4 -1.3
v -2.1 14.4 -1.3
v -1.8 14.4 -1.3
v -2.5 14.4 -2.6
v -2.1 14.4 -2.6
v -4.2 14.4 -3.7
v -1.8 14.4 -3.7
v 2.7 14.8 -1.2
v 3.2 14.8 -1.2
v 2.7 14.8 -3.6
v 3.2 14.8 -3.6
v 2.6 15.1 -2.4
v 2.7 15.1 -2.4
v 2.6 15.1 -3.6
v 2.7 15.1 -3.6
v 0.299999 22.9 1.78814e-007
v 2.7 22.9 1.78814e-007
v -2.1 22.9 -0.0999998
v 0.299999 22.9 -0.0999998
v -2.1 22.9 -0.2
v -2.1 22.9 -0.3
v 2.4 22.9 -0.3
v 2.7 22.9 -0.3
v 2.6 22.9 -2.4
v 2.7 22.9 -2.4
v 2.4 22.9 -4.8
v 2.6 22.9 -4.8
v -12.8 23.1 -0.2
v -5.4 23.1 -0.2
v -2.1 23.1 -0.2
v -2.3 23.1 -0.3
v -2.1 23.1 -0.3
v -2.5 23.1 -2.6
v -2.3 23.1 -2.6
v -12.8 23.1 -5
v -5.4 23.1 -5
v -2.5 23.1 -5
v 2.7 23.2 -0.3
v 5.1 23.2 -0.3
v 12.8 23.2 -0.3
v 2.7 23.2 -5.1
v 5.1 23.2 -5.1
v 12.8 23.2 -5.1
v -1.5 23.8 -0.2
v -1.3 23.8 -0.2
v 1.1 23.8 -0.2
v 1.3 23.8 -0.2
v -1.5 23.8 -0.3
v -1.3 23.8 -0.3
v 1.1 23.8 -0.3
v 1.3 23.8 -0.3
v -1.3 23.9 -0.2
v -0.900001 23.9 -0.2
v 0.799999 23.9 -0.2
v 1.1 23.9 -0.2
v -1.3 23.9 -0.3
v -0.900001 23.9 -0.3
v 0.799999 23.9 -0.3
v 1.1 23.9 -0.3
v -0.900001 24 -0.2
v -0.6 24 -0.2
v 0.5 24 -0.2
v 0.799999 24 -0.2
v -0.900001 24 -0.3
v -0.6 24 -0.3
v 0.5 24 -0.3
v 0.799999 24 -0.3
v -0.6 24.1 -0.2
v -0.200001 24.1 -0.2
v 0.2 24.1 -0.2
v 0.5 24.1 -0.2
v -0.6 24.1 -0.3
v -0.200001 24.1 -0.3
v 0.2 24.1 -0.3
v 0.5 24.1 -0.3
v -0.1 24.2 -0.0999998
v 0 24.2 -0.0999998
v -0.200001 24.2 -0.2
v -0.1 24.2 -0.2
v 0 24.2 -0.2
v 0.2 24.2 -0.2
v -0.200001 24.2 -0.3
v 0.2 24.2 -0.3
v -0.200001 24.5 0.2
v 0 24.5 0.2
v -0.200001 24.5 0.1
v 0 24.5 0.1
v -0.200001 24.6 0.1
v 0 24.6 0.1
v -0.200001 24.6 1.78814e-007
v 0 24.6 1.78814e-007
v -0.200001 24.7 1.78814e-007
v 0 24.7 1.78814e-007
v -0.200001 24.7 -0.0999998
v 0 24.7 -0.0999998
v -0.200001 24.8 -0.0999998
v 0 24.8 -0.0999998
v -0.200001 24.8 -0.2
v 0 24.8 -0.2
v -1 24.9 -0.2
v -0.900001 24.9 -0.2
v -0.200001 24.9 -0.2
v 0 24.9 -0.2
v -1 24.9 -0.3
v -0.900001 24.9 -0.3
v -0.200001 24.9 -0.3
v 0 24.9 -0.3
v -1.3 25.1 -0.2
v -1.2 25.1 -0.2
v -0.700001 25.1 -0.2
v -0.6 25.1 -0.2
v 0.4 25.1 -0.2
v 0.5 25.1 -0.2
v 1 25.1 -0.2
v 1.1 25.1 -0.2
v -1.3 25.1 -0.3
v -1.2 25.1 -0.3
v -0.700001 25.1 -0.3
v -0.6 25.1 -0.3
v 0.4 25.1 -0.3
v 0.5 25.1 -0.3
v 1 25.1 -0.3
v 1.1 25.1 -0.3
v -1.2 25.2 -0.2
v -1.1 25.2 -0.2
v -0.8 25.2 -0.2
v -0.700001 25.2 -0.2
v 0.5 25.2 -0.2
v 0.599999 25.2 -0.2
v 0.9 25.2 -0.2
v 1 25.2 -0.2
v -1.2 25.2 -0.3
v -1.1 25.2 -0.3
v -0.8 25.2 -0.3
v -0.700001 25.2 -0.3
v 0.5 25.2 -0.3
v 0.599999 25.2 -0.3
v 0.9 25.2 -0.3
v 1 25.2 -0.3
v -1.1 25.3 -0.2
v -0.8 25.3 -0.2
v 0.599999 25.3 -0.2
v 0.9 25.3 -0.2
v -1.1 25.3 -0.3
v -0.8 25.3 -0.3
v 0.599999 25.3 -0.3
v 0.9 25.3 -0.3
v -2.3 25.6 -0.3
v 2.4 25.6 -0.3
v -2.3 25.6 -5
v 2.4 25.6 -5

# faces
f 3/3/1 2/3/1 1/3/1
f 4/3/1 2/3/1 3/3/1
f 7/8/1 6/8/1 5/8/1
f 8/8/1 6/8/1 7/8/1
f 9/8/1 6/8/1 8/8/1
f 10/8/1 6/8/1 9/8/1
f 11/5/1 9/5/1 8/5/1
f 12/5/1 9/5/1 11/5/1
f 15/5/1 14/5/1 13/5/1
f 16/5/1 14/5/1 15/5/1
f 19/5/1 18/5/1 17/5/1
f 20/5/1 18/5/1 19/5/1
f 23/5/1 22/5/1 21/5/1
f 24/5/1 22/5/1 23/5/1
f 28/8/1 26/8/1 25/8/1
f 28/8/1 27/8/1 26/8/1
f 29/8/1 27/8/1 28/8/1
f 32/8/1 31/8/1 30/8/1
f 33/8/1 31/8/1 32/8/1
f 36/2/1 33/2/1 32/2/1
f 36/2/1 34/2/1 33/2/1
f 37/2/1 36/2/1 35/2/1
f 38/2/1 34/2/1 36/2/1
f 38/2/1 36/2/1 37/2/1
f 41/8/1 40/8/1 39/8/1
f 42/8/1 40/8/1 41/8/1
f 45/1/1 44/1/1 43/1/1
f 46/1/1 44/1/1 45/1/1
f 49/1/1 48/1/1 47/1/1
f 50/1/1 48/1/1 49/1/1
f 53/7/1 52/7/1 51/7/1
f 54/7/1 52/7/1 53/7/1
f 57/7/1 56/7/1 55/7/1
f 58/7/1 56/7/1 57/7/1
f 61/7/1 60/7/1 59/7/1
f 62/7/1 60/7/1 61/7/1
f 65/7/1 64/7/1 63/7/1
f 66/7/1 64/7/1 65/7/1
f 69/7/1 68/7/1 67/7/1
f 70/7/1 68/7/1 69/7/1
f 73/1/1 72/1/1 71/1/1
f 74/1/1 72/1/1 73/1/1
f 77/4/1 76/4/1 75/4/1
f 78/4/1 76/4/1 77/4/1
f 81/1/1 80/1/1 79/1/1
f 82/1/1 80/1/1 81/1/1
f 85/1/1 84/1/1 83/1/1
f 86/1/1 84/1/1 85/1/1
f 89/2/1 88/2/1 87/2/1
f 90/2/1 88/2/1 89/2/1
f 91/2/1 88/2/1 90/2/1
f 92/2/1 88/2/1 91/2/1
f 93/2/1 88/2/1 92/2/1
f 94/2/1 88/2/1 93/2/1
f 95/2/1 88/2/1 94/2/1
f 96/2/1 88/2/1 95/2/1
f 97/2/1 88/2/1 96/2/1
f 98/2/1 88/2/1 97/2/1
f 101/1/1 100/1/1 99/1/1
f 102/1/1 100/1/1 101/1/1
f 106/5/1 104/5/1 103/5/1
f 107/8/1 105/8/1 104/8/1
f 107/5/1 104/5/1 106/5/1
f 108/8/1 107/8/1 106/8/1
f 109/8/1 105/8/1 107/8/1
f 109/8/1 107/8/1 108/8/1
f 112/1/1 111/1/1 110/1/1
f 113/1/1 111/1/1 112/1/1
f 116/8/1 115/8/1 114/8/1
f 117/8/1 116/8/1 114/8/1
f 118/8/1 116/8/1 117/8/1
f 119/6/1 118/6/1 117/6/1
f 120/6/1 119/6/1 117/6/1
f 121/6/1 119/6/1 120/6/1
f 122/8/1 121/8/1 120/8/1
f 123/8/1 121/8/1 122/8/1
f 124/6/1 123/6/1 122/6/1
f 125/6/1 123/6/1 124/6/1
f 126/8/1 125/8/1 124/8/1
f 127/8/1 125/8/1 126/8/1
f 128/6/1 127/6/1 126/6/1
f 129/6/1 127/6/1 128/6/1
f 130/8/1 129/8/1 128/8/1
f 131/8/1 129/8/1 130/8/1
f 134/7/1 133/7/1 132/7/1
f 135/7/1 133/7/1 134/7/1
f 138/1/1 137/1/1 136/1/1
f 139/1/1 137/1/1 138/1/1
f 142/7/1 141/7/1 140/7/1
f 143/7/1 141/7/1 142/7/1
f 146/7/1 145/7/1 144/7/1
f 147/7/1 145/7/1 146/7/1
f 150/7/1 149/7/1 148/7/1
f 151/7/1 149/7/1 150/7/1
f 154/7/1 153/7/1 152/7/1
f 155/7/1 153/7/1 154/7/1
f 158/5/1 157/5/1 156/5/1
f 159/5/1 157/5/1 158/5/1
f 162/1/1 161/1/1 160/1/1
f 163/1/1 161/1/1 162/1/1
f 166/1/1 165/1/1 164/1/1
f 167/1/1 165/1/1 166/1/1
f 170/5/1 169/5/1 168/5/1
f 171/5/1 169/5/1 170/5/1
f 172/5/1 169/5/1 171/5/1
f 175/5/1 174/5/1 173/5/1
f 176/5/1 174/5/1 175/5/1
f 179/8/1 178/8/1 177/8/1
f 180/8/1 178/8/1 179/8/1
f 181/8/1 178/8/1 180/8/1
f 182/8/1 178/8/1 181/8/1
f 183/5/1 181/5/1 180/5/1
f 184/5/1 181/5/1 183/5/1
f 185/5/1 181/5/1 184/5/1
f 189/8/1 187/8/1 186/8/1
f 190/8/1 189/8/1 188/8/1
f 191/8/1 187/8/1 189/8/1
f 191/8/1 189/8/1 190/8/1
f 192/8/2 193/8/2 194/8/2
f 194/8/2 193/8/2 195/8/2
f 195/8/2 193/8/2 196/8/2
f 196/8/2 193/8/2 197/8/2
f 195/5/2 196/5/2 198/5/2
f 198/5/2 196/5/2 199/5/2
f 200/5/2 201/5/2 202/5/2
f 202/5/2 201/5/2 203/5/2
f 204/5/2 205/5/2 206/5/2
f 206/5/2 205/5/2 207/5/2
f 208/8/2 209/8/2 210/8/2
f 210/8/2 209/8/2 211/8/2
f 212/8/2 213/8/2 215/8/2
f 213/8/2 214/8/2 215/8/2
f 215/8/2 214/8/2 216/8/2
f 217/8/2 218/8/2 219/8/2
f 219/8/2 218/8/2 220/8/2
f 221/5/2 222/5/2 223/5/2
f 223/5/2 222/5/2 224/5/2
f 225/1/2 226/1/2 227/1/2
f 227/1/2 226/1/2 228/1/2
f 229/4/2 230/4/2 231/4/2
f 231/4/2 230/4/2 232/4/2
f 233/1/2 234/1/2 235/1/2
f 235/1/2 234/1/2 236/1/2
f 237/7/2 238/7/2 239/7/2
f 239/7/2 238/7/2 240/7/2
f 241/7/2 242/7/2 243/7/2
f 243/7/2 242/7/2 244/7/2
f 245/7/2 246/7/2 247/7/2
f 247/7/2 246/7/2 248/7/2
f 249/7/2 250/7/2 251/7/2
f 251/7/2 250/7/2 252/7/2
f 253/1/2 254/1/2 255/1/2
f 255/1/2 254/1/2 256/1/2
f 257/7/2 258/7/2 259/7/2
f 259/7/2 258/7/2 260/7/2
f 261/1/2 262/1/2 263/1/2
f 263/1/2 262/1/2 264/1/2
f 265/1/2 266/1/2 267/1/2
f 267/1/2 266/1/2 268/1/2
f 269/2/2 270/2/2 271/2/2
f 271/2/2 270/2/2 272/2/2
f 272/2/2 270/2/2 273/2/2
f 273/2/2 270/2/2 274/2/2
f 274/2/2 270/2/2 275/2/2
f 275/2/2 270/2/2 276/2/2
f 276/2/2 270/2/2 277/2/2
f 277/2/2 270/2/2 278/2/2
f 278/2/2 270/2/2 279/2/2
f 279/2/2 270/2/2 280/2/2
f 281/8/2 282/8/2 283/8/2
f 283/8/2 282/8/2 284/8/2
f 284/8/2 282/8/2 285/8/2
f 286/1/2 287/1/2 288/1/2
f 288/1/2 287/1/2 289/1/2
f 290/8/2 291/8/2 293/8/2
f 291/5/2 292/5/2 294/5/2
f 293/8/2 291/8/2 294/8/2
f 294/5/2 292/5/2 295/5/2
f 296/1/2 297/1/2 298/1/2
f 298/1/2 297/1/2 299/1/2
f 300/1/2 301/1/2 302/1/2
f 302/1/2 301/1/2 303/1/2
f 304/7/2 305/7/2 306/7/2
f 306/7/2 305/7/2 307/7/2
f 308/7/2 309/7/2 310/7/2
f 310/7/2 309/7/2 311/7/2
f 312/7/2 313/7/2 314/7/2
f 314/7/2 313/7/2 315/7/2
f 316/7/2 317/7/2 318/7/2
f 318/7/2 317/7/2 319/7/2
f 320/1/2 321/1/2 322/1/2
f 322/1/2 321/1/2 323/1/2
f 324/7/2 325/7/2 326/7/2
f 326/7/2 325/7/2 327/7/2
f 328/1/2 329/1/2 330/1/2
f 330/1/2 329/1/2 331/1/2
f 332/2/2 333/2/2 335/2/2
f 333/2/2 334/2/2 335/2/2
f 335/2/2 334/2/2 336/2/2
f 337/8/2 338/8/2 339/8/2
f 339/8/2 338/8/2 341/8/2
f 340/8/2 341/8/2 342/8/2
f 341/8/2 338/8/2 343/8/2
f 342/8/2 341/8/2 343/8/2
f 344/8/2 345/8/2 346/8/2
f 346/8/2 347/8/2 348/8/2
f 348/8/2 347/8/2 349/8/2
f 344/8/2 346/8/2 350/8/2
f 346/8/2 348/8/2 350/8/2
f 350/8/2 348/8/2 351/8/2
f 344/8/2 350/8/2 352/8/2
f 352/8/2 350/8/2 353/8/2
f 354/5/2 355/5/2 357/5/2
f 355/5/2 356/5/2 357/5/2
f 357/5/2 356/5/2 358/5/2
f 359/5/2 360/5/2 361/5/2
f 361/5/2 360/5/2 362/5/2
f 363/5/2 364/5/2 366/5/2
f 364/5/2 365/5/2 366/5/2
f 366/5/2 365/5/2 367/5/2
f 368/8/2 369/8/2 370/8/2
f 370/8/2 369/8/2 371/8/2
f 371/8/2 369/8/2 372/8/2
f 372/8/2 369/8/2 373/8/2
f 371/5/2 372/5/2 374/5/2
f 374/5/2 372/5/2 375/5/2
f 376/3/2 377/3/2 378/3/2
f 378/3/2 377/3/2 379/3/2
f 382/8/3 381/8/3 380/8/3
f 383/8/3 381/8/3 382/8/3
f 386/2/3 385/2/3 384/2/3
f 387/2/3 385/2/3 386/2/3
f 390/8/3 389/8/3 388/8/3
f 391/8/3 389/8/3 390/8/3
f 394/2/3 393/2/3 392/2/3
f 395/2/3 393/2/3 394/2/3
f 398/2/3 397/2/3 396/2/3
f 399/2/3 397/2/3 398/2/3
f 408/8/3 401/8/3 400/8/3
f 408/6/3 402/6/3 401/6/3
f 409/6/3 402/6/3 408/6/3
f 410/8/3 403/8/3 402/8/3
f 410/6/3 402/6/3 409/6/3
f 411/8/3 403/8/3 410/8/3
f 412/8/3 409/8/3 408/8/3
f 412/8/3 408/8/3 400/8/3
f 413/8/3 409/8/3 412/8/3
f 414/6/3 411/6/3 410/6/3
f 414/8/3 409/8/3 413/8/3
f 414/6/3 410/6/3 409/6/3
f 415/6/3 411/6/3 414/6/3
f 416/8/3 403/8/3 411/8/3
f 416/6/3 411/6/3 415/6/3
f 417/8/3 403/8/3 416/8/3
f 418/6/3 413/6/3 412/6/3
f 419/6/3 413/6/3 418/6/3
f 420/6/3 413/6/3 419/6/3
f 421/6/3 413/6/3 420/6/3
f 422/8/3 415/8/3 414/8/3
f 422/8/3 414/8/3 413/8/3
f 422/6/3 416/6/3 415/6/3
f 422/6/3 417/6/3 416/6/3
f 423/6/3 417/6/3 422/6/3
f 424/8/3 403/8/3 417/8/3
f 424/6/3 417/6/3 423/6/3
f 425/8/3 403/8/3 424/8/3
f 426/8/3 423/8/3 422/8/3
f 426/6/3 424/6/3 423/6/3
f 426/6/3 425/6/3 424/6/3
f 427/6/3 425/6/3 426/6/3
f 428/8/3 403/8/3 425/8/3
f 428/6/3 425/6/3 427/6/3
f 429/8/3 403/8/3 428/8/3
f 430/6/3 406/6/3 405/6/3
f 430/8/3 405/8/3 404/8/3
f 431/8/3 407/8/3 406/8/3
f 431/6/3 406/6/3 430/6/3
f 432/6/3 429/6/3 428/6/3
f 432/8/3 427/8/3 426/8/3
f 432/6/3 428/6/3 427/6/3
f 433/6/3 429/6/3 432/6/3
f 434/8/3 403/8/3 429/8/3
f 434/6/3 404/6/3 403/6/3
f 435/8/3 430/8/3 404/8/3
f 435/6/3 404/6/3 434/6/3
f 435/8/3 431/8/3 430/8/3
f 436/8/3 412/8/3 400/8/3
f 436/6/3 418/6/3 412/6/3
f 437/8/3 419/8/3 418/8/3
f 437/6/3 418/6/3 436/6/3
f 438/6/3 420/6/3 419/6/3
f 438/8/3 419/8/3 437/8/3
f 439/8/3 421/8/3 420/8/3
f 439/6/3 420/6/3 438/6/3
f 440/6/3 429/6/3 433/6/3
f 440/8/3 433/8/3 432/8/3
f 441/6/3 429/6/3 440/6/3
f 442/6/3 429/6/3 441/6/3
f 443/8/3 434/8/3 429/8/3
f 443/6/3 429/6/3 442/6/3
f 443/8/3 435/8/3 434/8/3
f 444/8/3 421/8/3 439/8/3
f 444/6/3 413/6/3 421/6/3
f 444/8/3 439/8/3 438/8/3
f 444/8/3 438/8/3 437/8/3
f 444/8/3 437/8/3 436/8/3
f 445/8/3 440/8/3 432/8/3
f 445/6/3 413/6/3 444/6/3
f 445/8/3 432/8/3 426/8/3
f 445/8/3 441/8/3 440/8/3
f 445/8/3 426/8/3 422/8/3
f 445/8/3 422/8/3 413/8/3
f 446/6/3 442/6/3 441/6/3
f 446/8/3 441/8/3 445/8/3
f 447/6/3 442/6/3 446/6/3
f 448/6/3 442/6/3 447/6/3
f 449/8/3 443/8/3 442/8/3
f 449/6/3 442/6/3 448/6/3
f 450/8/3 445/8/3 444/8/3
f 450/8/3 444/8/3 436/8/3
f 450/8/3 436/8/3 400/8/3
f 450/8/3 447/8/3 446/8/3
f 450/8/3 446/8/3 445/8/3
f 451/8/3 447/8/3 450/8/3
f 452/6/3 448/6/3 447/6/3
f 452/8/3 447/8/3 451/8/3
f 453/8/3 449/8/3 448/8/3
f 453/6/3 448/6/3 452/6/3
f 454/6/3 451/6/3 450/6/3
f 455/6/3 451/6/3 454/6/3
f 456/6/3 451/6/3 455/6/3
f 457/6/3 451/6/3 456/6/3
f 458/8/3 450/8/3 400/8/3
f 458/6/3 454/6/3 450/6/3
f 459/8/3 455/8/3 454/8/3
f 459/6/3 454/6/3 458/6/3
f 460/6/3 456/6/3 455/6/3
f 460/8/3 455/8/3 459/8/3
f 461/8/3 457/8/3 456/8/3
f 461/6/3 456/6/3 460/6/3
f 462/6/3 451/6/3 457/6/3
f 462/8/3 457/8/3 461/8/3
f 463/8/3 452/8/3 451/8/3
f 463/6/3 451/6/3 462/6/3
f 463/8/3 453/8/3 452/8/3
f 464/8/3 462/8/3 461/8/3
f 464/8/3 461/8/3 460/8/3
f 464/8/3 463/8/3 462/8/3
f 464/8/3 458/8/3 400/8/3
f 464/8/3 460/8/3 459/8/3
f 464/8/3 459/8/3 458/8/3
f 465/8/3 463/8/3 464/8/3
f 466/8/3 463/8/3 465/8/3
f 467/8/3 453/8/3 463/8/3
f 467/8/3 463/8/3 466/8/3
f 468/6/3 467/6/3 466/6/3
f 469/6/3 467/6/3 468/6/3
f 470/8/3 466/8/3 465/8/3
f 470/6/3 465/6/3 464/6/3
f 471/6/3 468/6/3 466/6/3
f 471/8/3 466/8/3 470/8/3
f 472/8/3 464/8/3 400/8/3
f 472/6/3 470/6/3 464/6/3
f 472/6/3 471/6/3 470/6/3
f 473/6/3 468/6/3 471/6/3
f 473/6/3 471/6/3 472/6/3
f 473/8/3 469/8/3 468/8/3
f 474/6/3 467/6/3 469/6/3
f 474/8/3 469/8/3 473/8/3
f 475/8/3 453/8/3 467/8/3
f 475/6/3 467/6/3 474/6/3
f 476/8/3 473/8/3 472/8/3
f 476/8/3 472/8/3 400/8/3
f 476/8/3 475/8/3 474/8/3
f 476/8/3 474/8/3 473/8/3
f 477/8/3 443/8/3 449/8/3
f 477/8/3 475/8/3 476/8/3
f 477/8/3 435/8/3 443/8/3
f 477/8/3 431/8/3 435/8/3
f 477/8/3 407/8/3 431/8/3
f 477/8/3 453/8/3 475/8/3
f 477/8/3 449/8/3 453/8/3
f 480/8/3 479/8/3 478/8/3
f 481/8/3 479/8/3 480/8/3
f 482/8/3 480/8/3 478/8/3
f 483/6/3 481/6/3 480/6/3
f 483/8/3 480/8/3 482/8/3
f 484/8/3 482/8/3 478/8/3
f 484/6/3 483/6/3 482/6/3
f 485/6/3 481/6/3 483/6/3
f 485/6/3 483/6/3 484/6/3
f 486/8/3 485/8/3 484/8/3
f 486/6/3 481/6/3 485/6/3
f 487/8/3 479/8/3 481/8/3
f 487/6/3 481/6/3 486/6/3
f 488/8/3 479/8/3 487/8/3
f 489/8/3 479/8/3 488/8/3
f 490/8/3 486/8/3 484/8/3
f 490/8/3 484/8/3 478/8/3
f 490/8/3 487/8/3 486/8/3
f 490/8/3 488/8/3 487/8/3
f 491/8/3 488/8/3 490/8/3
f 492/8/3 488/8/3 491/8/3
f 493/6/3 489/6/3 488/6/3
f 493/8/3 488/8/3 492/8/3
f 494/8/3 479/8/3 489/8/3
f 494/6/3 489/6/3 493/6/3
f 495/8/3 479/8/3 494/8/3
f 496/8/3 479/8/3 495/8/3
f 497/8/3 479/8/3 496/8/3
f 498/8/3 479/8/3 497/8/3
f 499/8/3 479/8/3 498/8/3
f 500/8/3 490/8/3 478/8/3
f 500/6/3 491/6/3 490/6/3
f 501/6/3 491/6/3 500/6/3
f 502/8/3 492/8/3 491/8/3
f 503/6/3 493/6/3 492/6/3
f 503/8/3 492/8/3 502/8/3
f 503/6/3 494/6/3 493/6/3
f 503/6/3 495/6/3 494/6/3
f 504/8/3 501/8/3 500/8/3
f 505/8/3 501/8/3 504/8/3
f 506/8/3 502/8/3 491/8/3
f 507/6/3 503/6/3 502/6/3
f 507/8/3 502/8/3 506/8/3
f 508/6/3 495/6/3 503/6/3
f 508/6/3 503/6/3 507/6/3
f 509/8/3 496/8/3 495/8/3
f 509/6/3 495/6/3 508/6/3
f 512/8/3 504/8/3 500/8/3
f 513/6/3 505/6/3 504/6/3
f 513/8/3 504/8/3 512/8/3
f 514/8/3 501/8/3 505/8/3
f 514/6/3 505/6/3 513/6/3
f 515/8/3 501/8/3 514/8/3
f 516/8/3 506/8/3 491/8/3
f 517/6/3 507/6/3 506/6/3
f 517/8/3 506/8/3 516/8/3
f 517/6/3 508/6/3 507/6/3
f 518/6/3 508/6/3 517/6/3
f 519/8/3 509/8/3 508/8/3
f 519/6/3 508/6/3 518/6/3
f 522/8/3 500/8/3 478/8/3
f 522/8/3 512/8/3 500/8/3
f 523/6/3 513/6/3 512/6/3
f 523/8/3 512/8/3 522/8/3
f 524/8/3 514/8/3 513/8/3
f 524/6/3 513/6/3 523/6/3
f 525/6/3 515/6/3 514/6/3
f 525/8/3 514/8/3 524/8/3
f 526/8/3 501/8/3 515/8/3
f 526/6/3 515/6/3 525/6/3
f 527/8/3 501/8/3 526/8/3
f 528/8/3 516/8/3 491/8/3
f 529/6/3 518/6/3 517/6/3
f 529/8/3 516/8/3 528/8/3
f 529/6/3 517/6/3 516/6/3
f 530/6/3 518/6/3 529/6/3
f 531/8/3 519/8/3 518/8/3
f 531/6/3 518/6/3 530/6/3
f 532/1/3 521/1/3 520/1/3
f 533/1/3 521/1/3 532/1/3
f 534/2/3 511/2/3 510/2/3
f 535/2/3 511/2/3 534/2/3
f 536/8/3 522/8/3 478/8/3
f 536/6/3 523/6/3 522/6/3
f 537/8/3 524/8/3 523/8/3
f 537/6/3 523/6/3 536/6/3
f 537/8/3 525/8/3 524/8/3
f 537/8/3 526/8/3 525/8/3
f 538/8/3 501/8/3 527/8/3
f 538/6/3 527/6/3 526/6/3
f 539/6/3 491/6/3 501/6/3
f 539/8/3 501/8/3 538/8/3
f 540/8/3 528/8/3 491/8/3
f 541/6/3 530/6/3 529/6/3
f 541/8/3 528/8/3 540/8/3
f 541/6/3 529/6/3 528/6/3
f 542/6/3 530/6/3 541/6/3
f 543/8/3 531/8/3 530/8/3
f 543/6/3 530/6/3 542/6/3
f 544/6/3 497/6/3 496/6/3
f 544/8/3 498/8/3 497/8/3
f 545/6/3 499/6/3 498/6/3
f 545/8/3 498/8/3 544/8/3
f 546/6/3 538/6/3 526/6/3
f 546/8/3 526/8/3 537/8/3
f 546/8/3 537/8/3 536/8/3
f 546/6/3 539/6/3 538/6/3
f 547/6/3 491/6/3 539/6/3
f 547/6/3 539/6/3 546/6/3
f 547/8/3 540/8/3 491/8/3
f 548/8/3 540/8/3 547/8/3
f 549/6/3 542/6/3 541/6/3
f 549/8/3 540/8/3 548/8/3
f 549/6/3 541/6/3 540/6/3
f 550/6/3 542/6/3 549/6/3
f 551/8/3 543/8/3 542/8/3
f 551/6/3 542/6/3 550/6/3
f 552/6/3 544/6/3 496/6/3
f 552/6/3 545/6/3 544/6/3
f 553/6/3 499/6/3 545/6/3
f 553/6/3 545/6/3 552/6/3
f 554/8/3 536/8/3 478/8/3
f 554/8/3 548/8/3 547/8/3
f 554/8/3 546/8/3 536/8/3
f 554/8/3 547/8/3 546/8/3
f 555/8/3 548/8/3 554/8/3
f 556/6/3 550/6/3 549/6/3
f 556/8/3 548/8/3 555/8/3
f 556/6/3 549/6/3 548/6/3
f 557/6/3 550/6/3 556/6/3
f 558/8/3 551/8/3 550/8/3
f 558/6/3 550/6/3 557/6/3
f 559/8/3 543/8/3 551/8/3
f 559/8/3 551/8/3 558/8/3
f 560/6/3 552/6/3 496/6/3
f 560/8/3 543/8/3 559/8/3
f 560/8/3 519/8/3 531/8/3
f 560/8/3 531/8/3 543/8/3
f 560/8/3 509/8/3 519/8/3
f 560/8/3 496/8/3 509/8/3
f 561/8/3 553/8/3 552/8/3
f 561/6/3 552/6/3 560/6/3
f 562/6/3 499/6/3 553/6/3
f 562/8/3 553/8/3 561/8/3
f 563/8/3 479/8/3 499/8/3
f 563/6/3 499/6/3 562/6/3
f 564/8/3 479/8/3 563/8/3
f 567/3/3 566/3/3 565/3/3
f 568/3/3 566/3/3 567/3/3
f 570/8/3 568/8/3 567/8/3
f 571/8/3 570/8/3 569/8/3
f 572/8/3 570/8/3 571/8/3
f 573/8/3 568/8/3 570/8/3
f 573/8/3 570/8/3 572/8/3
f 574/8/3 568/8/3 573/8/3
f 577/1/3 576/1/3 575/1/3
f 578/1/3 576/1/3 577/1/3
f 583/7/3 581/7/3 580/7/3
f 584/7/3 581/7/3 583/7/3
f 587/7/3 583/7/3 582/7/3
f 587/7/3 585/7/3 584/7/3
f 587/7/3 584/7/3 583/7/3
f 588/7/3 585/7/3 587/7/3
f 589/7/3 585/7/3 588/7/3
f 590/7/3 585/7/3 589/7/3
f 592/7/3 587/7/3 586/7/3
f 592/7/3 588/7/3 587/7/3
f 593/4/3 589/4/3 588/4/3
f 593/7/3 588/7/3 592/7/3
f 594/7/3 591/7/3 590/7/3
f 594/4/3 589/4/3 593/4/3
f 594/7/3 590/7/3 589/7/3
f 595/7/3 591/7/3 594/7/3
f 596/1/3 579/1/3 578/1/3
f 597/1/3 579/1/3 596/1/3
f 599/4/3 593/4/3 592/4/3
f 599/7/3 592/7/3 586/7/3
f 600/4/3 593/4/3 599/4/3
f 601/4/3 595/4/3 594/4/3
f 602/7/3 591/7/3 595/7/3
f 602/4/3 595/4/3 601/4/3
f 603/7/3 600/7/3 599/7/3
f 603/7/3 599/7/3 586/7/3
f 604/7/3 600/7/3 603/7/3
f 605/4/3 601/4/3 600/4/3
f 605/7/3 600/7/3 604/7/3
f 606/7/3 602/7/3 601/7/3
f 606/4/3 601/4/3 605/4/3
f 607/7/3 591/7/3 602/7/3
f 607/7/3 602/7/3 606/7/3
f 608/7/3 591/7/3 607/7/3
f 609/7/3 606/7/3 605/7/3
f 609/7/3 607/7/3 606/7/3
f 609/7/3 605/7/3 604/7/3
f 610/7/3 607/7/3 609/7/3
f 611/7/3 607/7/3 610/7/3
f 612/7/3 607/7/3 611/7/3
f 613/1/3 598/1/3 597/1/3
f 614/1/3 598/1/3 613/1/3
f 616/7/3 611/7/3 610/7/3
f 617/7/3 611/7/3 616/7/3
f 618/1/3 615/1/3 614/1/3
f 619/1/3 615/1/3 618/1/3
f 623/1/3 620/1/3 619/1/3
f 624/1/3 620/1/3 623/1/3
f 627/2/3 622/2/3 621/2/3
f 628/2/3 622/2/3 627/2/3
f 630/1/3 626/1/3 625/1/3
f 631/1/3 626/1/3 630/1/3
f 635/1/3 630/1/3 629/1/3
f 636/1/3 630/1/3 635/1/3
f 638/7/3 633/7/3 632/7/3
f 639/7/3 633/7/3 638/7/3
f 642/7/3 639/7/3 638/7/3
f 642/7/3 638/7/3 637/7/3
f 642/7/3 640/7/3 639/7/3
f 643/7/3 640/7/3 642/7/3
f 644/7/3 640/7/3 643/7/3
f 645/7/3 640/7/3 644/7/3
f 647/7/3 642/7/3 641/7/3
f 647/7/3 643/7/3 642/7/3
f 648/4/3 644/4/3 643/4/3
f 648/7/3 643/7/3 647/7/3
f 649/7/3 645/7/3 644/7/3
f 649/4/3 644/4/3 648/4/3
f 649/7/3 646/7/3 645/7/3
f 650/7/3 646/7/3 649/7/3
f 652/1/3 635/1/3 634/1/3
f 653/1/3 635/1/3 652/1/3
f 654/4/3 648/4/3 647/4/3
f 654/7/3 647/7/3 641/7/3
f 655/8/3 649/8/3 648/8/3
f 655/4/3 648/4/3 654/4/3
f 656/4/3 650/4/3 649/4/3
f 656/8/3 649/8/3 655/8/3
f 657/7/3 646/7/3 650/7/3
f 657/4/3 650/4/3 656/4/3
f 658/7/3 654/7/3 641/7/3
f 658/7/3 655/7/3 654/7/3
f 659/7/3 655/7/3 658/7/3
f 660/4/3 656/4/3 655/4/3
f 660/7/3 655/7/3 659/7/3
f 661/7/3 657/7/3 656/7/3
f 661/4/3 656/4/3 660/4/3
f 662/7/3 646/7/3 657/7/3
f 662/7/3 657/7/3 661/7/3
f 663/7/3 646/7/3 662/7/3
f 664/7/3 661/7/3 660/7/3
f 664/7/3 662/7/3 661/7/3
f 664/7/3 660/7/3 659/7/3
f 665/7/3 662/7/3 664/7/3
f 666/7/3 662/7/3 665/7/3
f 667/7/3 662/7/3 666/7/3
f 669/1/3 652/1/3 651/1/3
f 670/1/3 652/1/3 669/1/3
f 671/7/3 666/7/3 665/7/3
f 672/7/3 666/7/3 671/7/3
f 673/1/3 669/1/3 668/1/3
f 674/1/3 669/1/3 673/1/3
f 678/2/3 676/2/3 675/2/3
f 679/2/3 676/2/3 678/2/3
f 679/2/3 678/2/3 677/2/3
f 680/2/3 676/2/3 679/2/3
f 681/2/3 679/2/3 677/2/3
f 682/2/3 676/2/3 680/2/3
f 683/2/3 676/2/3 682/2/3
f 684/2/3 676/2/3 683/2/3
f 685/2/3 676/2/3 684/2/3
f 686/2/3 684/2/3 683/2/3
f 687/2/3 684/2/3 686/2/3
f 688/2/3 676/2/3 685/2/3
f 689/2/3 676/2/3 688/2/3
f 690/2/3 686/2/3 683/2/3
f 691/2/3 686/2/3 690/2/3
f 692/2/3 676/2/3 689/2/3
f 693/2/3 676/2/3 692/2/3
f 696/2/3 682/2/3 681/2/3
f 697/2/3 690/2/3 683/2/3
f 698/2/3 690/2/3 697/2/3
f 699/2/3 695/2/3 694/2/3
f 700/2/3 695/2/3 699/2/3
f 701/2/3 690/2/3 698/2/3
f 704/2/3 676/2/3 693/2/3
f 705/2/3 702/2/3 701/2/3
f 708/2/3 704/2/3 703/2/3
f 709/2/3 697/2/3 696/2/3
f 710/2/3 706/2/3 705/2/3
f 710/2/3 701/2/3 698/2/3
f 710/2/3 705/2/3 701/2/3
f 711/2/3 706/2/3 710/2/3
f 712/2/3 706/2/3 711/2/3
f 713/2/3 708/2/3 707/2/3
f 714/2/3 710/2/3 709/2/3
f 715/2/3 712/2/3 711/2/3
f 715/2/3 713/2/3 712/2/3
f 716/2/3 713/2/3 715/2/3
f 717/2/3 713/2/3 716/2/3
f 718/2/3 713/2/3 717/2/3
f 719/2/3 717/2/3 716/2/3
f 720/2/3 713/2/3 718/2/3
f 721/2/3 714/2/3 709/2/3
f 721/2/3 715/2/3 714/2/3
f 722/2/3 715/2/3 721/2/3
f 723/2/3 720/2/3 719/2/3
f 723/2/3 719/2/3 716/2/3
f 724/2/3 723/2/3 722/2/3
f 724/2/3 720/2/3 723/2/3
f 725/2/3 708/2/3 713/2/3
f 725/2/3 720/2/3 724/2/3
f 725/2/3 713/2/3 720/2/3
f 726/2/3 709/2/3 696/2/3
f 726/2/3 721/2/3 709/2/3
f 727/2/3 721/2/3 726/2/3
f 728/2/3 724/2/3 722/2/3
f 729/2/3 724/2/3 728/2/3
f 730/2/3 724/2/3 729/2/3
f 731/2/3 708/2/3 725/2/3
f 732/2/3 704/2/3 708/2/3
f 732/2/3 708/2/3 731/2/3
f 733/2/3 729/2/3 728/2/3
f 733/2/3 728/2/3 727/2/3
f 734/2/3 729/2/3 733/2/3
f 735/2/3 704/2/3 732/2/3
f 736/2/3 676/2/3 704/2/3
f 736/2/3 704/2/3 735/2/3
f 737/2/3 696/2/3 681/2/3
f 737/2/3 726/2/3 696/2/3
f 738/2/3 726/2/3 737/2/3
f 739/2/3 733/2/3 727/2/3
f 740/2/3 739/2/3 738/2/3
f 740/2/3 733/2/3 739/2/3
f 743/2/3 676/2/3 736/2/3
f 744/2/3 741/2/3 740/2/3
f 747/2/3 743/2/3 742/2/3
f 748/2/3 681/2/3 677/2/3
f 748/2/3 737/2/3 681/2/3
f 749/2/3 737/2/3 748/2/3
f 750/2/3 745/2/3 744/2/3
f 750/2/3 740/2/3 738/2/3
f 750/2/3 744/2/3 740/2/3
f 751/2/3 745/2/3 750/2/3
f 752/2/3 747/2/3 746/2/3
f 753/2/3 748/2/3 677/2/3
f 754/2/3 751/2/3 750/2/3
f 754/2/3 752/2/3 751/2/3
f 754/2/3 750/2/3 749/2/3
f 755/2/3 753/2/3 677/2/3
f 755/2/3 754/2/3 753/2/3
f 756/2/3 752/2/3 754/2/3
f 756/2/3 754/2/3 755/2/3
f 756/2/3 743/2/3 747/2/3
f 756/2/3 747/2/3 752/2/3
f 756/2/3 676/2/3 743/2/3
f 760/8/3 758/8/3 757/8/3
f 760/8/3 759/8/3 758/8/3
f 761/8/3 759/8/3 760/8/3
f 762/3/3 761/3/3 760/3/3
f 763/3/3 761/3/3 762/3/3
f 766/5/3 765/5/3 764/5/3
f 768/5/3 766/5/3 764/5/3
f 768/5/3 767/5/3 766/5/3
f 769/5/3 767/5/3 768/5/3
f 772/5/3 771/5/3 770/5/3
f 774/5/3 773/5/3 772/5/3
f 776/5/3 775/5/3 774/5/3
f 778/5/3 772/5/3 770/5/3
f 778/5/3 777/5/3 776/5/3
f 778/5/3 776/5/3 774/5/3
f 778/5/3 774/5/3 772/5/3
f 779/5/3 777/5/3 778/5/3
f 780/5/3 777/5/3 779/5/3
f 781/5/3 777/5/3 780/5/3
f 782/5/3 777/5/3 781/5/3
f 783/5/3 777/5/3 782/5/3
f 784/5/3 777/5/3 783/5/3
f 785/5/3 784/5/3 783/5/3
f 786/5/3 785/5/3 783/5/3
f 787/5/3 785/5/3 786/5/3
f 791/5/3 789/5/3 788/5/3
f 792/5/3 789/5/3 791/5/3
f 792/5/3 791/5/3 790/5/3
f 793/5/3 792/5/3 790/5/3
f 794/5/3 792/5/3 793/5/3
f 795/5/3 793/5/3 790/5/3
f 796/5/3 793/5/3 795/5/3
f 799/5/3 798/5/3 797/5/3
f 800/5/3 799/5/3 797/5/3
f 801/5/3 799/5/3 800/5/3
f 802/8/4 803/8/4 804/8/4
f 804/8/4 803/8/4 805/8/4
f 805/8/4 803/8/4 806/8/4
f 807/5/4 808/5/4 810/5/4
f 808/8/4 809/8/4 811/8/4
f 810/5/4 808/5/4 811/5/4
f 811/8/4 809/8/4 812/8/4
f 807/5/4 810/5/4 813/5/4
f 813/5/4 810/5/4 814/5/4
f 815/8/4 816/8/4 818/8/4
f 816/8/4 817/8/4 818/8/4
f 818/8/4 817/8/4 819/8/4
f 819/8/4 817/8/4 820/8/4
f 815/8/4 818/8/4 821/8/4
f 821/8/4 818/8/4 822/8/4
f 823/5/4 824/5/4 825/5/4
f 825/5/4 824/5/4 826/5/4
f 826/5/4 827/5/4 829/5/4
f 827/8/4 828/8/4 829/8/4
f 829/8/4 828/8/4 830/8/4
f 825/5/4 826/5/4 831/5/4
f 826/5/4 829/5/4 831/5/4
f 831/5/4 829/5/4 832/5/4
f 833/5/4 834/5/4 835/5/4
f 835/5/4 836/5/4 837/5/4
f 837/5/4 838/5/4 839/5/4
f 833/5/4 835/5/4 841/5/4
f 839/5/4 840/5/4 841/5/4
f 837/5/4 839/5/4 841/5/4
f 835/5/4 837/5/4 841/5/4
f 841/5/4 840/5/4 842/5/4
f 842/5/4 840/5/4 843/5/4
f 843/5/4 840/5/4 844/5/4
f 844/5/4 840/5/4 845/5/4
f 845/5/4 840/5/4 846/5/4
f 846/5/4 840/5/4 847/5/4
f 847/5/4 840/5/4 848/5/4
f 849/8/4 850/8/4 851/8/4
f 851/8/4 850/8/4 852/8/4
f 853/5/4 854/5/4 856/5/4
f 855/5/4 856/5/4 857/5/4
f 856/5/4 854/5/4 858/5/4
f 857/5/4 856/5/4 858/5/4
f 858/5/4 854/5/4 859/5/4
f 857/5/4 858/5/4 860/5/4
f 860/5/4 858/5/4 861/5/4
f 862/5/4 863/5/4 864/5/4
f 864/5/4 863/5/4 865/5/4
f 866/8/4 867/8/4 868/8/4
f 868/8/4 867/8/4 869/8/4
f 870/8/4 871/8/4 872/8/4
f 870/8/4 872/8/4 873/8/4
f 873/8/4 872/8/4 874/8/4
f 875/8/4 876/8/4 877/8/4
f 877/8/4 876/8/4 878/8/4
f 879/3/4 880/3/4 881/3/4
f 881/3/4 880/3/4 882/3/4
f 881/8/4 882/8/4 883/8/4
f 883/8/4 882/8/4 884/8/4
f 885/2/4 886/2/4 887/2/4
f 887/2/4 886/2/4 888/2/4
f 889/8/4 890/8/4 891/8/4
f 891/8/4 890/8/4 892/8/4
f 891/3/4 892/3/4 893/3/4
f 893/3/4 892/3/4 894/3/4
f 899/8/5 896/8/5 895/8/5
f 900/8/5 896/8/5 899/8/5
f 901/8/5 898/8/5 897/8/5
f 902/8/5 898/8/5 901/8/5
f 907/5/5 906/5/5 905/5/5
f 908/5/5 906/5/5 907/5/5
f 909/5/5 904/5/5 903/5/5
f 910/5/5 904/5/5 909/5/5
f 911/5/5 907/5/5 905/5/5
f 912/5/5 907/5/5 911/5/5
f 917/5/5 914/5/5 913/5/5
f 918/5/5 914/5/5 917/5/5
f 919/5/5 916/5/5 915/5/5
f 920/5/5 916/5/5 919/5/5
f 925/5/5 922/5/5 921/5/5
f 926/5/5 922/5/5 925/5/5
f 927/5/5 925/5/5 921/5/5
f 928/5/5 925/5/5 927/5/5
f 929/5/5 924/5/5 923/5/5
f 930/5/5 924/5/5 929/5/5
f 933/8/5 932/8/5 931/8/5
f 934/8/5 932/8/5 933/8/5
f 937/8/5 936/8/5 935/8/5
f 938/8/5 936/8/5 937/8/5
f 939/8/5 936/8/5 938/8/5
f 940/8/5 938/8/5 937/8/5
f 940/5/5 939/5/5 938/5/5
f 941/5/5 939/5/5 940/5/5
f 943/8/5 940/8/5 937/8/5
f 944/8/5 943/8/5 942/8/5
f 945/8/5 940/8/5 943/8/5
f 945/8/5 943/8/5 944/8/5
f 948/8/5 947/8/5 946/8/5
f 949/8/5 947/8/5 948/8/5
f 950/8/5 947/8/5 949/8/5
f 951/8/5 947/8/5 950/8/5
f 953/5/5 950/5/5 949/5/5
f 954/5/5 953/5/5 952/5/5
f 955/5/5 950/5/5 953/5/5
f 955/5/5 953/5/5 954/5/5
f 957/8/5 955/8/5 954/8/5
f 957/8/5 956/8/5 955/8/5
f 958/8/5 956/8/5 957/8/5
f 962/8/5 961/8/5 960/8/5
f 963/3/5 960/3/5 959/3/5
f 964/8/5 962/8/5 960/8/5
f 964/3/5 960/3/5 963/3/5
f 965/8/5 962/8/5 964/8/5
f 969/8/5 967/8/5 966/8/5
f 970/8/5 967/8/5 969/8/5
f 971/3/5 968/3/5 967/3/5
f 971/8/5 967/8/5 970/8/5
f 972/3/5 968/3/5 971/3/5
f 975/2/5 974/2/5 973/2/5
f 978/2/5 975/2/5 973/2/5
f 978/2/5 976/2/5 975/2/5
f 979/2/5 978/2/5 977/2/5
f 980/2/5 976/2/5 978/2/5
f 980/2/5 978/2/5 979/2/5
f 985/1/5 982/1/5 981/1/5
f 986/1/5 982/1/5 985/1/5
f 987/1/5 984/1/5 983/1/5
f 988/1/5 984/1/5 987/1/5
f 993/1/5 990/1/5 989/1/5
f 994/1/5 990/1/5 993/1/5
f 995/1/5 992/1/5 991/1/5
f 996/1/5 992/1/5 995/1/5
f 1001/1/5 998/1/5 997/1/5
f 1002/1/5 998/1/5 1001/1/5
f 1003/1/5 1000/1/5 999/1/5
f 1004/1/5 1000/1/5 1003/1/5
f 1009/1/5 1006/1/5 1005/1/5
f 1010/1/5 1006/1/5 1009/1/5
f 1011/1/5 1008/1/5 1007/1/5
f 1012/1/5 1008/1/5 1011/1/5
f 1016/1/5 1014/1/5 1013/1/5
f 1017/1/5 1014/1/5 1016/1/5
f 1019/1/5 1016/1/5 1015/1/5
f 1019/1/5 1018/1/5 1017/1/5
f 1019/1/5 1017/1/5 1016/1/5
f 1020/1/5 1018/1/5 1019/1/5
f 1023/2/5 1022/2/5 1021/2/5
f 1024/2/5 1022/2/5 1023/2/5
f 1029/7/5 1026/7/5 1025/7/5
f 1030/7/5 1026/7/5 1029/7/5
f 1031/7/5 1028/7/5 1027/7/5
f 1032/7/5 1028/7/5 1031/7/5
f 1041/7/5 1034/7/5 1033/7/5
f 1042/7/5 1034/7/5 1041/7/5
f 1043/7/5 1036/7/5 1035/7/5
f 1044/7/5 1036/7/5 1043/7/5
f 1045/7/5 1038/7/5 1037/7/5
f 1046/7/5 1038/7/5 1045/7/5
f 1047/7/5 1040/7/5 1039/7/5
f 1048/7/5 1040/7/5 1047/7/5
f 1057/7/5 1050/7/5 1049/7/5
f 1058/7/5 1050/7/5 1057/7/5
f 1059/7/5 1052/7/5 1051/7/5
f 1060/7/5 1052/7/5 1059/7/5
f 1061/7/5 1054/7/5 1053/7/5
f 1062/7/5 1054/7/5 1061/7/5
f 1063/7/5 1056/7/5 1055/7/5
f 1064/7/5 1056/7/5 1063/7/5
f 1067/4/5 1066/4/5 1065/4/5
f 1068/4/5 1066/4/5 1067/4/5
f 1069/8/6 1070/8/6 1073/8/6
f 1073/8/6 1070/8/6 1074/8/6
f 1071/8/6 1072/8/6 1075/8/6
f 1075/8/6 1072/8/6 1076/8/6
f 1077/8/6 1078/8/6 1079/8/6
f 1079/8/6 1078/8/6 1080/8/6
f 1081/8/6 1082/8/6 1083/8/6
f 1083/8/6 1082/8/6 1084/8/6
f 1085/5/6 1086/5/6 1089/5/6
f 1089/5/6 1086/5/6 1090/5/6
f 1087/5/6 1088/5/6 1092/5/6
f 1091/5/6 1092/5/6 1093/5/6
f 1092/5/6 1088/5/6 1094/5/6
f 1093/5/6 1092/5/6 1094/5/6
f 1095/5/6 1096/5/6 1099/5/6
f 1099/5/6 1096/5/6 1100/5/6
f 1097/5/6 1098/5/6 1101/5/6
f 1101/5/6 1098/5/6 1102/5/6
f 1105/5/6 1106/5/6 1108/5/6
f 1103/5/6 1104/5/6 1109/5/6
f 1109/5/6 1104/5/6 1110/5/6
f 1107/5/6 1108/5/6 1111/5/6
f 1108/5/6 1106/5/6 1112/5/6
f 1111/5/6 1108/5/6 1112/5/6
f 1113/5/6 1114/5/6 1117/5/6
f 1115/5/6 1116/5/6 1118/5/6
f 1113/5/6 1117/5/6 1119/5/6
f 1117/5/6 1118/5/6 1119/5/6
f 1118/5/6 1116/5/6 1120/5/6
f 1119/5/6 1118/5/6 1120/5/6
f 1121/5/6 1122/5/6 1123/5/6
f 1123/5/6 1122/5/6 1124/5/6
f 1125/8/6 1126/8/6 1127/8/6
f 1127/8/6 1126/8/6 1128/8/6
f 1129/8/6 1130/8/6 1132/8/6
f 1131/8/6 1132/8/6 1133/8/6
f 1133/8/6 1132/8/6 1134/8/6
f 1132/8/6 1130/8/6 1135/8/6
f 1134/8/6 1132/8/6 1135/8/6
f 1135/8/6 1130/8/6 1136/8/6
f 1135/8/6 1136/8/6 1137/8/6
f 1137/8/6 1136/8/6 1138/8/6
f 1135/8/6 1137/8/6 1139/8/6
f 1139/8/6 1137/8/6 1140/8/6
f 1142/8/6 1143/8/6 1144/8/6
f 1144/8/6 1143/8/6 1145/8/6
f 1142/8/6 1144/8/6 1146/8/6
f 1146/8/6 1144/8/6 1147/8/6
f 1141/3/6 1142/3/6 1148/3/6
f 1142/8/6 1146/8/6 1149/8/6
f 1148/3/6 1142/3/6 1149/3/6
f 1149/8/6 1146/8/6 1150/8/6
f 1151/8/6 1152/8/6 1154/8/6
f 1152/3/6 1153/3/6 1155/3/6
f 1154/8/6 1152/8/6 1155/8/6
f 1155/3/6 1153/3/6 1156/3/6
f 1157/1/6 1158/1/6 1161/1/6
f 1161/1/6 1158/1/6 1162/1/6
f 1159/1/6 1160/1/6 1163/1/6
f 1163/1/6 1160/1/6 1164/1/6
f 1165/1/6 1166/1/6 1169/1/6
f 1169/1/6 1166/1/6 1170/1/6
f 1167/1/6 1168/1/6 1171/1/6
f 1171/1/6 1168/1/6 1172/1/6
f 1173/1/6 1174/1/6 1177/1/6
f 1177/1/6 1174/1/6 1178/1/6
f 1175/1/6 1176/1/6 1179/1/6
f 1179/1/6 1176/1/6 1180/1/6
f 1181/1/6 1182/1/6 1185/1/6
f 1185/1/6 1182/1/6 1186/1/6
f 1183/1/6 1184/1/6 1187/1/6
f 1187/1/6 1184/1/6 1188/1/6
f 1189/1/6 1190/1/6 1192/1/6
f 1192/1/6 1190/1/6 1193/1/6
f 1191/1/6 1192/1/6 1195/1/6
f 1193/1/6 1194/1/6 1195/1/6
f 1192/1/6 1193/1/6 1195/1/6
f 1195/1/6 1194/1/6 1196/1/6
f 1197/2/6 1198/2/6 1199/2/6
f 1199/2/6 1198/2/6 1200/2/6
f 1201/2/6 1202/2/6 1203/2/6
f 1203/2/6 1202/2/6 1204/2/6
f 1205/2/6 1206/2/6 1207/2/6
f 1207/2/6 1206/2/6 1208/2/6
f 1209/2/6 1210/2/6 1211/2/6
f 1211/2/6 1210/2/6 1212/2/6
f 1213/4/6 1214/4/6 1217/4/6
f 1217/4/6 1214/4/6 1218/4/6
f 1215/2/6 1216/2/6 1219/2/6
f 1219/2/6 1216/2/6 1220/2/6
f 1221/7/6 1222/7/6 1229/7/6
f 1229/7/6 1222/7/6 1230/7/6
f 1223/7/6 1224/7/6 1231/7/6
f 1231/7/6 1224/7/6 1232/7/6
f 1225/7/6 1226/7/6 1233/7/6
f 1233/7/6 1226/7/6 1234/7/6
f 1227/7/6 1228/7/6 1235/7/6
f 1235/7/6 1228/7/6 1236/7/6
f 1237/7/6 1238/7/6 1245/7/6
f 1245/7/6 1238/7/6 1246/7/6
f 1239/7/6 1240/7/6 1247/7/6
f 1247/7/6 1240/7/6 1248/7/6
f 1241/7/6 1242/7/6 1249/7/6
f 1249/7/6 1242/7/6 1250/7/6
f 1243/7/6 1244/7/6 1251/7/6
f 1251/7/6 1244/7/6 1252/7/6
f 1253/7/6 1254/7/6 1257/7/6
f 1257/7/6 1254/7/6 1258/7/6
f 1255/7/6 1256/7/6 1259/7/6
f 1259/7/6 1256/7/6 1260/7/6
f 1261/2/6 1262/2/6 1263/2/6
f 1263/2/6 1262/2/6 1264/2/6
