%YAML 1.1
%TAG !u! tag:unity3d.com,2011:
--- !u!162 &1
EditorUserSettings:
  m_ObjectHideFlags: 0
  serializedVersion: 4
  m_ConfigSettings:
    RecentlyUsedScenePath-0:
      value: 224247031146465d18000b37036e0d404447567863093523283d0e7cc4f53a3ff7f413f1e6372f303c11a01f0b320d3af11e0004f84429041d02f80d05f61f1d21cd01d613cb0c52de1715dad4
      flags: 0
    RecentlyUsedScenePath-1:
      value: 224247031146465d18000b37036e0d404447567863093523283d0e7cc4f53a3ff7f413f1e6372f303c11a01f0b300536e6030605e544271e1d1af41e1dfa331c1fc111d113c7110fee011dc3dd11d4adc0d8ddfec1
      flags: 0
    RecentlyUsedScenePath-2:
      value: 224247031146465d18000b37036e0d404447567863093523283d0e7cc4f53a3ff7f413f1e6372f303c11a01f0b30173ae019081fff0404443f0fef1c10eb190514e917c254dd1115df00
      flags: 0
    RecentlyUsedScenePath-3:
      value: 224247031146465d18000b37036e0d404447567863093523283d0e7cc4f53a3ff7f413f1e6372f303c11a01a0d2c122bc20f1b18f905452d181cee1a21fa02001ecb3cc017c75109c51008d7
      flags: 0
    RecentlyUsedScenePath-4:
      value: 224247031146467a1e1d09362337500213380a232b212831213a520cd1ce1508d1d806fbe82e30282012e632031f122cf71e1a44c508032d1831d40015ea030703cc19c955fb1e11db1519fdce18dfe6c699e7e9d1cdeee7f7d1a4e7e7e4fcf1f4fd9ac8aba5ecccaf83ffa8a0d7d38ad4c4bed0d5
      flags: 0
    RecentlyUsedScenePath-5:
      value: 224247031146465c1f0b15101f225b2302021c2323670a3f3a19123ffbd4263de7d737eaec750c3f3c0cea2f4b3a0432fd441c05ff1f13
      flags: 0
    RecentlyUsedScenePath-6:
      value: 224247031146465c1f0b15101f225b2302021c2323670a3f3a19123ffbd4263de7d737eaec750c3f3c0cea2f4b320831f73f1945e305031f08
      flags: 0
    RecentlyUsedScenePath-7:
      value: 224247031146465d18000b37036e0d404447567863093523283d0e7cd6e5272cf1a815e6e92c3a2e2a03fb350b303e0cfb070007f719240a1c0bee4004f1190708
      flags: 0
    RecentlyUsedScenePath-8:
      value: 22424703114646680e0b0227036c721518022b292926237e38271427fb
      flags: 0
    RecentlyUsedScenePath-9:
      value: 22424703114646680e0b0227036c6c111b07142f1f2b233e2867083debf42d
      flags: 0
    vcSharedLogLevel:
      value: 0d5e400f0650
      flags: 0
  m_VCAutomaticAdd: 1
  m_VCDebugCom: 0
  m_VCDebugCmd: 0
  m_VCDebugOut: 0
  m_SemanticMergeMode: 2
  m_VCShowFailedCheckout: 1
  m_VCOverwriteFailedCheckoutAssets: 1
  m_VCProjectOverlayIcons: 1
  m_VCHierarchyOverlayIcons: 1
  m_VCOtherOverlayIcons: 1
  m_VCAllowAsyncUpdate: 1
