{
    "parts": [
       {
           "ID":"START",
           "text":"Evening Commisar.",
           "responses": [
               {
                   "text": "Evening.",
                   "ID":"part1"
                },
                {
                    "text": "Have you decided you're going to be useful today?.",
                    "ID":"part2"
                 }, {
                    "text": "What is it?",
                    "ID":"part3"
                 }, {
                    "text": "Have you found the spy yet?.",
                    "ID":"part3"
                 }
           ]
       },
       {
        "ID":"part1",
        "text":"'Tis a nice one- it's only minus 40 as opposed to the usual minus 45!",
        "responses": [
            {
                "text": "Get to the point",
                "ID":"part3"
             },
             {
                 "text": "Any luck finding the spy?",
                 "ID":"part3"
              }, {
                 "text": "Why are you here?",
                 "ID":"part3"
              }, {
                 "text": "Y'know what, i just realised- isn't it kind of weird that i still don't know you're actual name?",
                 "ID":"part8"
              }
        ]
    },
	{
        "ID":"part2",
        "text":"Depends. Have you decided that you're going to give me a fair wage and maternity leave?",
		"responses": [
            {
                "text": "Touchè",
                "ID":"part5"
             },
             {
                 "text": "Remind me again what you've done to deserve either of those things?",
                 "ID":"part6"
              }, {
                 "text": "Yeah, yeah- you're cheque's in the mail. Just tell me why you're here.",
                 "ID":"part3"
              }, {
                 "text": "Maternity leave?! You're not even... whatever. Why are you here?",
                 "ID":"part3"
              }
        ]
    },
    {
        "ID":"part3",
        "text":"We've had some luck with a mister Ciscero, who has been oh-so-courtous enough to tell us- once he stopped gurgling on a damp rag, that is- that the spy we are looking for resides in cell 5- the Maritine staffers area. Now, keep in mind that he could possibly be trying to throw us off the scent, and maybe HE is the real spy... But, y'know, i think i'll leave that for you to mull over",
        "responses": [
            {
                "text": "Thank you.",
                "ID":"part5"
             },
             {
                 "text": "There, was that so hard?",
                 "ID":"part6"
              }, {
                 "text": "That's it?! He didn't confess anything a bit more USEFUll?",
                 "ID":"part7"
              }, {
                 "text": "I probably could've gleemed that from my own investigation- and you want a payrise?",
                 "ID":"part8"
              }
        ]
    },  
    {
        "ID":"part4",
        "text":"Example text 4"
    }
	{
        "ID":"part5",
        "text":"Example text 3",
        "nextId":"part4"
    },  
    {
        "ID":"part6",
        "text":"Example text 4"
    }
	{
        "ID":"part7",
        "text":"Example text 3",
        "nextId":"part4"
    },  
    {
        "ID":"part8",
        "text":"Example text 4"
    }
    ]
}