{
    "intents": [
        {
            "intent": "General_Ending",
            "examples": [
                {
                    "text": "Addio!"
                },
                {
                    "text": "alla prossima"
                },
                {
                    "text": "Arrivederci"
                },
                {
                    "text": "Bene, abbiamo fatto tutto ci\u00f2 che mi serviva."
                },
                {
                    "text": "ciao watson ti auguro una giornata bellissima"
                },
                {
                    "text": "ci sentiamo"
                },
                {
                    "text": "Ehi penso che hai risolto il mio problema grazie"
                },
                {
                    "text": "Grazie di avermi aiutato. Ciao"
                },
                {
                    "text": "Grazie di tutto, \u00e8 stato molto di aiuto"
                },
                {
                    "text": "grazie ed arrivederci"
                },
                {
                    "text": "Grazie watson parliamo dopo per quanto riguarda il pagamento della fattura"
                },
                {
                    "text": "Me ne sto andando."
                },
                {
                    "text": "Mi \u00e8 piaciuto cooperare con te."
                },
                {
                    "text": "Non vedo l'ora di parlarti la prossima volta."
                },
                {
                    "text": "Pausa"
                },
                {
                    "text": "smetti questa sessione adesso"
                },
                {
                    "text": "sono contento che non devo parlare con gli umani ciao watson"
                },
                {
                    "text": "Sono curiso se ci sentiamo ancora."
                },
                {
                    "text": "Spero di risentirla presto"
                },
                {
                    "text": "Stammi bene."
                },
                {
                    "text": "Va bene, grazie mille allora"
                }
            ],
            "description": "Termina la conversazione."
        },
        {
            "intent": "General_Greetings",
            "examples": [
                {
                    "text": "Buonasera, ho qualche domanda da farle, posso?"
                },
                {
                    "text": "Buongiorno Agent!"
                },
                {
                    "text": "Buon pomeriggio bot!"
                },
                {
                    "text": "Che succede, fratello"
                },
                {
                    "text": "Ciao!"
                },
                {
                    "text": "Ciao, avrei bisogno di una vostra consulenza"
                },
                {
                    "text": "Ciao gemello informatico"
                },
                {
                    "text": "Ciao, ho dei problemi di navigazione nel vostro portale"
                },
                {
                    "text": "Ciao watson fornitore di informazioni"
                },
                {
                    "text": "Come ti senti?"
                },
                {
                    "text": "Ehi tutto a posto?"
                },
                {
                    "text": "Hai trascorso una buona giornata?"
                },
                {
                    "text": "La gente non \u00e8 maleducata?"
                },
                {
                    "text": "Mi sei mancato."
                },
                {
                    "text": "Non ho chiesto di parlare con un agente. Stavo per dire ciao a te"
                },
                {
                    "text": "Pronto per cominciare"
                },
                {
                    "text": "Saluti a lei"
                },
                {
                    "text": "Salve, l' attivazione del pacchetto messaggi non e' ancora stato effettuato"
                },
                {
                    "text": "Salve operatore virtuale"
                },
                {
                    "text": "Sto parlando con un computer?"
                },
                {
                    "text": "Ti trovo bene, buona sera"
                }
            ],
            "description": "Saluta il bot."
        },
        {
            "intent": "help",
            "examples": [
                {
                    "text": "Bot, cosa puoi offrirmi?"
                },
                {
                    "text": "Che puoi fare?"
                },
                {
                    "text": "Che servizi offre il bot?"
                },
                {
                    "text": "Che servizio offri?"
                },
                {
                    "text": "Cosa offri?"
                },
                {
                    "text": "Cosa posso fare con il bot?"
                },
                {
                    "text": "Cosa puoi fare?"
                },
                {
                    "text": "help"
                }
            ],
            "description": ""
        },
        {
            "intent": "AnnoUscita",
            "examples": [
                {
                    "text": "AnnoUscita"
                },
                {
                    "text": "In quale anno fu prodotto il film Blade runner?"
                },
                {
                    "text": "Quando \u00e8 uscito nelle sale cinematografiche il film Blade runner?"
                },
                {
                    "text": "A quando risale la realizzazione del film Blade runner?"
                },
                {
                    "text": "Di quale anno \u00e8 il film Blade runner?"
                },
                {
                    "text": "Quando Ridley Scott ha diretto il film Blade runner?"
                }
            ]
        },
        {
            "intent": "DirettoreFilm",
            "examples": [
                {
                    "text": "DirettoreFilm"
                },
                {
                    "text": "Chi ha diretto il film Blade runner?"
                },
                {
                    "text": "Qual \u00e8 il regista di Blade runner?"
                },
                {
                    "text": "Come si chiama il regista di Blade runner?"
                },
                {
                    "text": "Qual \u00e8 il nome del regista di Blade runner?"
                },
                {
                    "text": "Chi ha curato le riprese del film Blade runner?"
                }
            ]
        },
        {
            "intent": "TrattoDa",
            "examples": [
                {
                    "text": "TrattoDa"
                },
                {
                    "text": "A quale romanzo di fantascienza \u00e8 liberamente ispirato il film Blade runner?"
                },
                {
                    "text": "Come si intitola il romanzo da cui \u00e8 tratto il film Blade runner?"
                },
                {
                    "text": "Da quale opera della letteratura fantascientifica \u00e8 tratto il film Blade runner?"
                },
                {
                    "text": "Da quale romanzo ha preso spunto Ridley Scott per il suo Blade runner?"
                },
                {
                    "text": "Qual \u00e8 il titolo del romanzo a cui si ispira il film Blade runner?"
                },
                {
                    "text": "Come si chiama il romanzo rivisitato cinematograficamente da Blade runner?"
                },
                {
                    "text": "Blade runner \u00e8 l\u2019adattamento cinematografico di quale romanzo?"
                }
            ]
        },
        {
            "intent": "Ambientazione",
            "examples": [
                {
                    "text": "Ambientazione"
                },
                {
                    "text": "Dove \u00e8 ambientata la vicenda?"
                },
                {
                    "text": "Dove si svolge la storia?"
                },
                {
                    "text": "In quale citt\u00e0 avvengono i fatti?"
                },
                {
                    "text": "Dove viene girato il film?"
                },
                {
                    "text": "In quale ambientazione si sceglie di realizzare le scene del film?"
                },
                {
                    "text": "In quale luogo \u00e8 ambientato il film Blade runner?"
                }
            ]
        },
        {
            "intent": "Protagonista",
            "examples": [
                {
                    "text": "Protagonista"
                },
                {
                    "text": "Chi riveste il ruolo pi\u00f9 importante nella trama del film Blade runner?"
                },
                {
                    "text": "Quale personaggio risulta l\u2019eroe positivo nell\u2019equilibrio della trama del film Blade runner?"
                },
                {
                    "text": "Chi ha un ruolo di primo piano nelle vicende narrate nel film Blade Runner?"
                },
                {
                    "text": "Quale blade runner uccide i Nexus 6?"
                },
                {
                    "text": "Quale detective uccide i Nexus 6?"
                },
                {
                    "text": "Chi da la caccia al gruppo di Nexus ribelli?"
                },
                {
                    "text": "Chi interpreta nel film Harrison Ford?"
                },
                {
                    "text": "Chi uccide Pris?"
                },
                {
                    "text": "protagonista film"
                },
                {
                    "text": "protagonista film Blade Runner"
                }
            ]
        },
        {
            "intent": "DescrizioneReplicanti",
            "examples": [
                {
                    "text": "DescrizioneReplicanti"
                },
                {
                    "text": "Come possono essere definiti i replicanti?"
                },
                {
                    "text": "Che tipo di tecnologia ha sviluppato la Tyrell Corporation?"
                },
                {
                    "text": "Che caratteristiche hanno i replicanti?"
                }
            ]
        },
        {
            "intent": "VitaReplicanti",
            "examples": [
                {
                    "text": "VitaReplicanti"
                },
                {
                    "text": "Qual \u00e8 la durata massima di un replicante?"
                },
                {
                    "text": "Dopo quanti anni dalla loro produzione devono essere eliminati i replicanti?"
                },
                {
                    "text": "I Nexus 6 sono stati geneticamente programmati per vivere per quanti anni?"
                },
                {
                    "text": "Dopo quale intervallo di tempo i Nexus 6 devono essere eliminati per non sviluppare sentimenti umani?"
                },
                {
                    "text": "Per quanto tempo i Nexus 6 possono vivere prima di essere eliminati?"
                },
                {
                    "text": "Quale \u00e8 il limite di vita dei replicanti?"
                },
                {
                    "text": "Entro quanto tempo devono essere ritirati i replicanti?"
                }
            ]
        },
        {
            "intent": "VolereDiRoy",
            "examples": [
                {
                    "text": "VolereDiRoy"
                },
                {
                    "text": "Qual \u00e8 il problema di Roy?"
                },
                {
                    "text": "Cosa affligge Roy?"
                },
                {
                    "text": "Cosa fa soffrire Roy a tal punto da renderlo un eroe romantico?"
                },
                {
                    "text": "Perch\u00e8 Roy soffre?"
                },
                {
                    "text": "Per quale motivo Roy uccider\u00e0 Tyrell?"
                },
                {
                    "text": "Perch\u00e8 Roy pu\u00f2 essere definito un replicante ribelle?"
                }
            ]
        },
        {
            "intent": "ReplicanteImmortale",
            "examples": [
                {
                    "text": "ReplicanteImmortale"
                },
                {
                    "text": "Qual \u00e8 l\u2019unico modello sperimentale di replicante senza un limite di vita?"
                },
                {
                    "text": "Quale Nexus \u00e8 stato progettato senza limiti temporali?"
                },
                {
                    "text": "Quale replicante non dover essere eliminato dopo 4 anni?"
                },
                {
                    "text": "Quale replicante non ha limiti di vita?"
                },
                {
                    "text": "Come si chiama l\u2019unico replicante che Tyrell ha progettato senza programmarne la morte dopo 4 anni?"
                }
            ]
        },
        {
            "intent": "TempoDelleVicende",
            "examples": [
                {
                    "text": "TempoDelleVicende"
                },
                {
                    "text": "Quando si svolgono gli eventi?"
                },
                {
                    "text": "Quando si volge la vicenda?"
                },
                {
                    "text": "In quale anno si svolgono i fatti?"
                },
                {
                    "text": "In che periodo \u00e8 ambientata la trama?"
                }
            ]
        },
        {
            "intent": "RuoloBladeRunner",
            "examples": [
                {
                    "text": "RuoloBladeRunner"
                },
                {
                    "text": "Che ruolo hanno i blade runner?"
                },
                {
                    "text": "Che funzione hanno i blade runner?"
                },
                {
                    "text": "Quale compito hanno i blade runner?"
                },
                {
                    "text": "A cosa danno la caccia i blade runner?"
                },
                {
                    "text": "Qual \u00e8 l'incarico assegnato ai blade runner dalla polizia di Los Angeles?"
                }
            ]
        },
        {
            "intent": "ObbiettivoTyrellCorporation",
            "examples": [
                {
                    "text": "ObbiettivoTyrellCorporation"
                },
                {
                    "text": "Cosa fabbrica la Tyrell Corporation?"
                },
                {
                    "text": "Di cosa si occupa la Tyrell Corporation?"
                },
                {
                    "text": "Cosa si produce alla Tyrell Corporation?"
                },
                {
                    "text": "Quale funzione ha la Tyrell Corporation a Los Angeles?"
                }
            ]
        },
        {
            "intent": "TestDeckard",
            "examples": [
                {
                    "text": "TestDeckard"
                },
                {
                    "text": "A quale test Deckard sottopone i sospetti per capire se sono replicanti?"
                },
                {
                    "text": "Quale metodo usa Deckard per smascherare i replicanti?"
                },
                {
                    "text": "Quale dispositivo usa Deckard per misurare le reazioni fisiologiche di un individuo per determinare se si tratta di un replicante?"
                },
                {
                    "text": "Quale macchinario utilizzano i blade runners per capire se hanno a che fare con un replicante?"
                }
            ]
        },
        {
            "intent": "TemaFilm",
            "examples": [
                {
                    "text": "TemaFilm"
                },
                {
                    "text": "Qual \u00e8 il tema principale del film Blade runner?"
                },
                {
                    "text": "Qual \u00e8 il messaggio del film?"
                },
                {
                    "text": "Quali tematiche affronta il film?"
                },
                {
                    "text": "In che cosa si pu\u00f2 sintetizzare il senso del film?"
                }
            ]
        },
        {
            "intent": "FraseFamosa",
            "examples": [
                {
                    "text": "FraseFamosa"
                },
                {
                    "text": "Qual \u00e8 la frase pi\u00f9 famosa del film?"
                },
                {
                    "text": "Quali parole famose pronuncia Roy?"
                },
                {
                    "text": "Quale citazione \u00e8 la pi\u00f9 nota nel film e nel romanzo?"
                },
                {
                    "text": "Quale battuta famosa \u00e8 particolarmente conosciuta?"
                }
            ]
        },
        {
            "intent": "NuovoFilm",
            "examples": [
                {
                    "text": "NuovoFilm"
                },
                {
                    "text": "Come si chiama il nuovo film di Blade Runner?"
                },
                {
                    "text": "Come si intitola il nuovo Blade Runner?"
                },
                {
                    "text": "Qual \u00e8 il nome del nuovo Blade Runner?"
                },
                {
                    "text": "Qual \u00e8 il titolo del sequel di Blade Runner?"
                },
                {
                    "text": "Quale sequel di Blade Ruuner sta per uscire nelle sale cinematografiche?"
                }
            ]
        },
        {
            "intent": "AnnoUscitaNuovoFilm",
            "examples": [
                {
                    "text": "AnnoUscitaNuovoFilm"
                },
                {
                    "text": "Quando uscir\u00e0 nelle sale cinematografiche il nuovo film di Blade Runner?"
                },
                {
                    "text": "Quando \u00e8 prevista l'uscita ai botteghini del nuovo film di Blade Runner?"
                },
                {
                    "text": "In quale mese uscir\u00e0 Blade Runner 2049?"
                },
                {
                    "text": "Per quale data \u00e8 prevista l'uscita di Blade Runner 2049?"
                }
            ]
        },
        {
            "intent": "GenereFilm",
            "examples": [
                {
                    "text": "GenereFilm"
                },
                {
                    "text": "Che genere di film \u00e8 Blade Runner?"
                },
                {
                    "text": "Che tipologia di film \u00e8 Blade Runner?"
                },
                {
                    "text": "A quale genere cinematografico appartiene Blade Runner?"
                }
            ]
        },
        {
            "intent": "androide",
            "examples": [
                {
                    "text": "androide"
                }
            ]
        },
        {
            "intent": "Nexus_6",
            "examples": [
                {
                    "text": "Nexus 6"
                }
            ]
        },
        {
            "intent": "Replicanti",
            "examples": [
                {
                    "text": "Replicanti"
                }
            ]
        },
        {
            "intent": "Rachel",
            "examples": [
                {
                    "text": "Rachel"
                }
            ]
        },
        {
            "intent": "Deckard",
            "examples": [
                {
                    "text": "Deckard"
                }
            ]
        },
        {
            "intent": "Roy",
            "examples": [
                {
                    "text": "Roy"
                }
            ]
        },
        {
            "intent": "Pris",
            "examples": [
                {
                    "text": "Pris"
                }
            ]
        },
        {
            "intent": "Blade_runner",
            "examples": [
                {
                    "text": "Blade runner"
                }
            ]
        },
        {
            "intent": "Tyrell_Corporation",
            "examples": [
                {
                    "text": "Tyrell Corporation"
                }
            ]
        },
        {
            "intent": "Leon",
            "examples": [
                {
                    "text": "Leon"
                }
            ]
        },
        {
            "intent": "Sebastian",
            "examples": [
                {
                    "text": "Sebastian"
                }
            ]
        }
    ],
    "entities": [],
    "metadata": {
        "api_version": {
            "major_version": "v2",
            "minor_version": "2018-11-08"
        },
        "from-sample": true
    },
    "dialog_nodes": [
        {
            "type": "standard",
            "title": "Benvenuto",
            "output": {
                "generic": [
                    {
                        "values": [
                            {
                                "text": "Benvenuto all'assistente Watson."
                            }
                        ],
                        "response_type": "text",
                        "selection_policy": "multiline"
                    }
                ]
            },
            "dialog_node": "Benvenuto",
            "conditions": "welcome || #General_Greetings",
            "next_step": {
                "behavior": "jump_to",
                "selector": "body",
                "dialog_node": "help"
            }
        },
        {
            "type": "standard",
            "title": "help",
            "output": {
                "generic": [
                    {
                        "values": [
                            {
                                "text": "A questo bot puoi chiedere delle domande riguardanti il film \"Blade Runner\" e conoscere il significato di parole riguardanti esso"
                            },
                            {
                                "text": "Se hai problemi con il bot contatta: <a href=\"t.me/Anulo2SecondoAcc\" target=\"blank\" > Admin </a>"
                            }
                        ],
                        "response_type": "text",
                        "selection_policy": "multiline"
                    }
                ]
            },
            "dialog_node": "help",
            "conditions": "#help",
            "previous_sibling": "Benvenuto"
        },
        {
            "type": "standard",
            "title": "AnnoUscita",
            "output": {
                "generic": [
                    {
                        "values": [
                            {
                                "text": "Il film Blade runner \u00e8 del 1982"
                            },
                            {
                                "text": "L'anno di uscita nelle sale \u00e8 il 1982"
                            }
                        ],
                        "response_type": "text",
                        "selection_policy": "sequential"
                    }
                ]
            },
            "dialog_node": "AnnoUscita",
            "conditions": "#AnnoUscita",
            "previous_sibling": "help"
        },
        {
            "type": "standard",
            "title": "DirettoreFilm",
            "output": {
                "generic": [
                    {
                        "values": [
                            {
                                "text": "Ridley Scott"
                            }
                        ],
                        "response_type": "text",
                        "selection_policy": "sequential"
                    }
                ]
            },
            "dialog_node": "DirettoreFilm",
            "conditions": "#DirettoreFilm",
            "previous_sibling": "AnnoUscita"
        },
        {
            "type": "standard",
            "title": "TrattoDa",
            "output": {
                "generic": [
                    {
                        "values": [
                            {
                                "text": "Ma gli androidi sognano pecore elettriche? dello scrittore americano Philip Dick"
                            }
                        ],
                        "response_type": "text",
                        "selection_policy": "sequential"
                    }
                ]
            },
            "dialog_node": "TrattoDa",
            "conditions": "#TrattoDa",
            "previous_sibling": "DirettoreFilm"
        },
        {
            "type": "standard",
            "title": "Ambientazione",
            "output": {
                "generic": [
                    {
                        "values": [
                            {
                                "text": "In una distopica Los Angeles del 2019"
                            },
                            {
                                "text": "A Los Angeles nel 2019"
                            }
                        ],
                        "response_type": "text",
                        "selection_policy": "sequential"
                    }
                ]
            },
            "dialog_node": "Ambientazione",
            "conditions": "#Ambientazione",
            "previous_sibling": "TrattoDa"
        },
        {
            "type": "standard",
            "title": "Protagonista",
            "output": {
                "generic": [
                    {
                        "values": [
                            {
                                "text": "Rick Deckard"
                            },
                            {
                                "text": "Rick Deckard \u00e8 il protagonista nel film, un ex Blade Runner per il DPLA"
                            }
                        ],
                        "response_type": "text",
                        "selection_policy": "sequential"
                    }
                ]
            },
            "dialog_node": "Protagonista",
            "conditions": "#Protagonista",
            "previous_sibling": "Ambientazione"
        },
        {
            "type": "standard",
            "title": "DescrizioneReplicanti",
            "output": {
                "generic": [
                    {
                        "values": [
                            {
                                "text": "Essi sono androidi organici uguali in tutto agli esseri umani, ma con una forza superiore e dotati di intelligenza artificiale."
                            },
                            {
                                "text": "I replicanti sono forme evolute di androidi, tanto simili all'uomo da poter essere scambiati per essere umani."
                            }
                        ],
                        "response_type": "text",
                        "selection_policy": "sequential"
                    }
                ]
            },
            "dialog_node": "DescrizioneReplicanti",
            "conditions": "#DescrizioneReplicanti",
            "previous_sibling": "Protagonista"
        },
        {
            "type": "standard",
            "title": "VitaReplicanti",
            "output": {
                "generic": [
                    {
                        "values": [
                            {
                                "text": "Il termine entro cui dovrebbero essere ritirati i replicanti \u00e8 pari a 4 anni"
                            },
                            {
                                "text": "I Nexus 6 sono stati geneticamente programmati per vivere non pi\u00f9 di 4 anni"
                            },
                            {
                                "text": "La durata sarebbe infinita, ma dopo 4 anni rischiano di sviluppare emozioni proprie e per questo sono stati limitati."
                            }
                        ],
                        "response_type": "text",
                        "selection_policy": "sequential"
                    }
                ]
            },
            "dialog_node": "VitaReplicanti",
            "conditions": "#VitaReplicanti",
            "previous_sibling": "DescrizioneReplicanti"
        },
        {
            "type": "standard",
            "title": "VolereDiRoy",
            "output": {
                "generic": [
                    {
                        "values": [
                            {
                                "text": "Roy rifiuta il concetto di morte e vuole pi\u00f9 vita dal suo creatore."
                            },
                            {
                                "text": "Roy si ribella all'idea di essere terminato."
                            },
                            {
                                "text": "Roy ha una percezione di autocoscienza e rifiuta di essere trattato come una macchina."
                            }
                        ],
                        "response_type": "text",
                        "selection_policy": "sequential"
                    }
                ]
            },
            "dialog_node": "VolereDiRoy",
            "conditions": "#VolereDiRoy",
            "previous_sibling": "VitaReplicanti"
        },
        {
            "type": "standard",
            "title": "ReplicanteImmortale",
            "output": {
                "generic": [
                    {
                        "values": [
                            {
                                "text": "Rachel \u00e8 l\u2019unico replicante progettato senza limiti di vita"
                            },
                            {
                                "text": "Rachel, che \u00e8 la creatura prediletta del creatore dei replicanti, Dr. Tyrell."
                            }
                        ],
                        "response_type": "text",
                        "selection_policy": "sequential"
                    }
                ]
            },
            "dialog_node": "ReplicanteImmortale",
            "conditions": "#ReplicanteImmortale",
            "previous_sibling": "VolereDiRoy"
        },
        {
            "type": "standard",
            "title": "TempoDelleVicende",
            "output": {
                "generic": [
                    {
                        "values": [
                            {
                                "text": "La vicenda si svolge nel 2019"
                            },
                            {
                                "text": "Nel 2019, quando alcuni Nexus venivano usati nelle colonie extramondo."
                            }
                        ],
                        "response_type": "text",
                        "selection_policy": "sequential"
                    }
                ]
            },
            "dialog_node": "TempoDelleVicende",
            "conditions": "#TempoDelleVicende",
            "previous_sibling": "ReplicanteImmortale"
        },
        {
            "type": "standard",
            "title": "RuoloBladeRunner",
            "output": {
                "generic": [
                    {
                        "values": [
                            {
                                "text": "Gli agenti speciali \"blade runner\" hanno il compito di dare la caccia ai Nexus 6 e ritirarli dal servizio."
                            },
                            {
                                "text": "I blade runner devono assicurare che non ci siano replicanti ribelli sulla Terra."
                            }
                        ],
                        "response_type": "text",
                        "selection_policy": "sequential"
                    }
                ]
            },
            "dialog_node": "RuoloBladeRunner",
            "conditions": "#RuoloBladeRunner",
            "previous_sibling": "TempoDelleVicende"
        },
        {
            "type": "standard",
            "title": "ObbiettivoTyrellCorporation",
            "output": {
                "generic": [
                    {
                        "values": [
                            {
                                "text": "La Tyrell Corporation produce replicanti, tra i quali i Nexus 6."
                            },
                            {
                                "text": "La Tyrell Corporation, attraverso avanzate tecniche di ingegneria genetica, produce androidi replicanti."
                            }
                        ],
                        "response_type": "text",
                        "selection_policy": "sequential"
                    }
                ]
            },
            "dialog_node": "ObbiettivoTyrellCorporation",
            "conditions": "#ObbiettivoTyrellCorporation",
            "previous_sibling": "RuoloBladeRunner"
        },
        {
            "type": "standard",
            "title": "TestDeckard",
            "output": {
                "generic": [
                    {
                        "values": [
                            {
                                "text": "Deckard utilizza la macchina Voight-Kampff, ovvero un poligrafo che misura diversi paramentri fisiologici, come la dilatazione della pupilla e l'arrossamento involontario in risposta a domande emozionalmente provocatorie"
                            },
                            {
                                "text": "Il test con la macchina Voight-Kampff si pu\u00f2 riconoscere un replicante da un essere umano."
                            }
                        ],
                        "response_type": "text",
                        "selection_policy": "sequential"
                    }
                ]
            },
            "dialog_node": "TestDeckard",
            "conditions": "#TestDeckard",
            "previous_sibling": "ObbiettivoTyrellCorporation"
        },
        {
            "type": "standard",
            "title": "TemaFilm",
            "output": {
                "generic": [
                    {
                        "values": [
                            {
                                "text": "Blade Runner si interroga sulle possibilit\u00e0 offerte dall'eugenetica e dalla clonazione nella creazione di replicanti e sulle implicazioni morali, etiche e religiose derivanti."
                            },
                            {
                                "text": "Mettere a confronto le potenzialit\u00e0 umane con la tecnologia dell'intelligenza artificiale e dell'ingegneria genetica."
                            }
                        ],
                        "response_type": "text",
                        "selection_policy": "sequential"
                    }
                ]
            },
            "dialog_node": "TemaFilm",
            "conditions": "#TemaFilm",
            "previous_sibling": "TestDeckard"
        },
        {
            "type": "standard",
            "title": "FraseFamosa",
            "output": {
                "generic": [
                    {
                        "values": [
                            {
                                "text": "Io ne ho viste cose che voi umani non potreste immaginarvi. Navi da combattimento in fiamme al largo dei bastioni di Orione... e ho visto i raggi Beta balenare nel buio vicino alle porte di Tannh\u00e4user. E tutti quei momenti andranno perduti nel tempo come lacrime nella pioggia. \u00c8 tempo di morire."
                            }
                        ],
                        "response_type": "text",
                        "selection_policy": "sequential"
                    }
                ]
            },
            "dialog_node": "FraseFamosa",
            "conditions": "#FraseFamosa",
            "previous_sibling": "TemaFilm"
        },
        {
            "type": "standard",
            "title": "NuovoFilm",
            "output": {
                "generic": [
                    {
                        "values": [
                            {
                                "text": "Il nuovo film di Blade Runner si chiama \"Blade Runner 2049\"."
                            }
                        ],
                        "response_type": "text",
                        "selection_policy": "sequential"
                    }
                ]
            },
            "dialog_node": "NuovoFilm",
            "conditions": "#NuovoFilm",
            "previous_sibling": "FraseFamosa"
        },
        {
            "type": "standard",
            "title": "AnnoUscitaNuovoFilm",
            "output": {
                "generic": [
                    {
                        "values": [
                            {
                                "text": "L'uscita di \"Blade Runner 2049\" \u00e8 prevista per il 10 Giugno 2017."
                            },
                            {
                                "text": "Il nuovo film \"Blade Runner 2049\" uscir\u00e0 il 10 Giugno 2017 e chiarir\u00e0 gli sviluppi dell'attivit\u00e0 del Blade Runner 30 anni dopo."
                            }
                        ],
                        "response_type": "text",
                        "selection_policy": "sequential"
                    }
                ]
            },
            "dialog_node": "AnnoUscitaNuovoFilm",
            "conditions": "#AnnoUscitaNuovoFilm",
            "previous_sibling": "NuovoFilm"
        },
        {
            "type": "standard",
            "title": "GenereFilm",
            "output": {
                "generic": [
                    {
                        "values": [
                            {
                                "text": "Blade Runner \u00e8 un cult movie del genere fantascientifico."
                            },
                            {
                                "text": "Blade Runner \u00e8 un film di fantascienza , in stile cyberpunk/noir"
                            }
                        ],
                        "response_type": "text",
                        "selection_policy": "sequential"
                    }
                ]
            },
            "dialog_node": "GenereFilm",
            "conditions": "#GenereFilm",
            "previous_sibling": "AnnoUscitaNuovoFilm"
        },
        {
            "type": "standard",
            "title": "androide",
            "output": {
                "generic": [
                    {
                        "values": [
                            {
                                "text": "L'androide \u00e8 un essere artificiale, un robot, con sembianze umane, presente soprattutto nell'immaginario fantascientifico. In taluni casi l'androide pu\u00e8 risultare indistinguibile dall'essere umano. Differisce dal cyborg, il quale \u00e8 costituito da parti biologiche oltre che artificiali."
                            }
                        ],
                        "response_type": "text",
                        "selection_policy": "sequential"
                    }
                ]
            },
            "dialog_node": "androide",
            "conditions": "#androide",
            "previous_sibling": "GenereFilm"
        },
        {
            "type": "standard",
            "title": "Nexus_6",
            "output": {
                "generic": [
                    {
                        "values": [
                            {
                                "text": "I Nexus 6 sono dei replicanti di ultima generazione, ovvero degli androidi usati come forza lavoro nelle colonie extra-terrestri."
                            }
                        ],
                        "response_type": "text",
                        "selection_policy": "sequential"
                    }
                ]
            },
            "dialog_node": "Nexus_6",
            "conditions": "#Nexus_6",
            "previous_sibling": "androide"
        },
        {
            "type": "standard",
            "title": "Replicanti",
            "output": {
                "generic": [
                    {
                        "values": [
                            {
                                "text": "I replicanti sono androidi organici creati dalla Tyrell Corporation con avanzate tecniche di ingegneria genetica, in tutto agli esseri umani, ma con una forza superiore e dotati di intelligenza artificiale."
                            }
                        ],
                        "response_type": "text",
                        "selection_policy": "sequential"
                    }
                ]
            },
            "dialog_node": "Replicanti",
            "conditions": "#Replicanti",
            "previous_sibling": "Nexus_6"
        },
        {
            "type": "standard",
            "title": "Rachel",
            "output": {
                "generic": [
                    {
                        "values": [
                            {
                                "text": "Rachel \u00e8 una giovane replicante, ultima creatura di Tyrell, che non sa di essere un androide. Deckard si innamora di lei. Nel film il suo ruolo \u00e8 interpretato da Sean Young "
                            }
                        ],
                        "response_type": "text",
                        "selection_policy": "sequential"
                    }
                ]
            },
            "dialog_node": "Rachel",
            "conditions": "#Rachel",
            "previous_sibling": "Replicanti"
        },
        {
            "type": "standard",
            "title": "Deckard",
            "output": {
                "generic": [
                    {
                        "values": [
                            {
                                "text": "ex Blade Runner per il DPLA (Dipartimento di Polizia di Los Angeles). Nel film Deckard \u00e8 interpretato da Harrison Ford"
                            }
                        ],
                        "response_type": "text",
                        "selection_policy": "sequential"
                    }
                ]
            },
            "dialog_node": "Deckard",
            "conditions": "#Deckard",
            "previous_sibling": "Rachel"
        },
        {
            "type": "standard",
            "title": "Roy",
            "output": {
                "generic": [
                    {
                        "values": [
                            {
                                "text": "leader del gruppo di sei replicanti rinnegati; modello da combattimento. Nel film Roy Batty \u00e8 interpretato dall'attore Rutger Hauer"
                            }
                        ],
                        "response_type": "text",
                        "selection_policy": "sequential"
                    }
                ]
            },
            "dialog_node": "Roy",
            "conditions": "#Roy",
            "previous_sibling": "Deckard"
        },
        {
            "type": "standard",
            "title": "Pris",
            "output": {
                "generic": [
                    {
                        "values": [
                            {
                                "text": "Pris \u00e8 il diminutivo di Priscilla Stratton, modello femminile di replicante e fidanzata di Roy Batty. Il suo ruolo nel film \u00e8 interpretato da Daryl Hannah"
                            }
                        ],
                        "response_type": "text",
                        "selection_policy": "sequential"
                    }
                ]
            },
            "dialog_node": "Pris",
            "conditions": "#Pris",
            "previous_sibling": "Roy"
        },
        {
            "type": "standard",
            "title": "Blade_runner",
            "output": {
                "generic": [
                    {
                        "values": [
                            {
                                "text": "I blade runner sono agenti speciali incaricati dal DPLA(Dipartimento di Polizia di Los Angeles) di neutralizzare i replicanti al termine del loro ciclo vitale"
                            }
                        ],
                        "response_type": "text",
                        "selection_policy": "sequential"
                    }
                ]
            },
            "dialog_node": "Blade_runner",
            "conditions": "#Blade_runner",
            "previous_sibling": "Pris"
        },
        {
            "type": "standard",
            "title": "Tyrell_Corporation",
            "output": {
                "generic": [
                    {
                        "values": [
                            {
                                "text": "La Tyrell Corporation \u00e8 un colosso industriale che ha sviluppato nuove tecnologie che consentono di fabbricare i replicanti, ovvero i Nexus 6"
                            }
                        ],
                        "response_type": "text",
                        "selection_policy": "sequential"
                    }
                ]
            },
            "dialog_node": "Tyrell_Corporation",
            "conditions": "#Tyrell_Corporation",
            "previous_sibling": "Blade_runner"
        },
        {
            "type": "standard",
            "title": "Leon",
            "output": {
                "generic": [
                    {
                        "values": [
                            {
                                "text": "Leon \u00e8 uno dei replicanti fuggiti che cerca lavoro alla Tyrel Corporation"
                            }
                        ],
                        "response_type": "text",
                        "selection_policy": "sequential"
                    }
                ]
            },
            "dialog_node": "Leon",
            "conditions": "#Leon",
            "previous_sibling": "Tyrell_Corporation"
        },
        {
            "type": "standard",
            "title": "Sebastian",
            "output": {
                "generic": [
                    {
                        "values": [
                            {
                                "text": "Sebastian \u00e8 un genetista e amico del dottor Tyrell"
                            }
                        ],
                        "response_type": "text",
                        "selection_policy": "sequential"
                    }
                ]
            },
            "dialog_node": "Sebastian",
            "conditions": "#Sebastian",
            "previous_sibling": "Leon"
        },
        {
            "type": "standard",
            "title": "Addio",
            "output": {
                "generic": [
                    {
                        "values": [
                            {
                                "text": "Addio!"
                            }
                        ],
                        "response_type": "text",
                        "selection_policy": "sequential"
                    }
                ]
            },
            "dialog_node": "Addio",
            "conditions": "#General_Ending",
            "previous_sibling": "Sebastian"
        }
    ],
    "counterexamples": [],
    "system_settings": {
        "disambiguation": {
            "prompt": "Intendevi dire:",
            "enabled": true,
            "randomize": true,
            "max_suggestions": 5,
            "suggestion_text_policy": "title",
            "none_of_the_above_prompt": "Nessuno dei precedenti"
        },
        "system_entities": {
            "enabled": true
        },
        "human_agent_assist": {
            "prompt": "Intendevi dire:"
        }
    },
    "learning_opt_out": false,
    "name": "My first skill",
    "language": "it",
    "description": ""
}