domande,risposte
In quale anno fu prodotto il film Blade runner?,about_pecore1
In quale anno fu prodotto il film Blade runner?,about_pecore1
Quando è uscito nelle sale cinematografiche il film Blade runner?,about_pecore1
Quando è uscito nelle sale cinematografiche il film Blade runner?,about_pecore1
A quando risale la realizzazione del film Blade runner?,about_pecore1
A quando risale la realizzazione del film Blade runner?,about_pecore1
Di quale anno è il film Blade runner?,about_pecore1
Di quale anno è il film Blade runner?,about_pecore1
Quando Ridley Scott ha diretto il film Blade runner?,about_pecore1
Quando Ridley Scott ha diretto il film Blade runner?,about_pecore1
Chi ha diretto il film Blade runner?,about_pecore2
Qual è il regista di Blade runner?,about_pecore2
Come si chiama il regista di Blade runner?,about_pecore2
Qual è il nome del regista di Blade runner?,about_pecore2
Chi ha curato le riprese del film Blade runner?,about_pecore2
A quale romanzo di fantascienza è liberamente ispirato il film Blade runner?,about_pecore3
Come si intitola il romanzo da cui è tratto il film Blade runner?,about_pecore3
Da quale opera della letteratura fantascientifica è tratto il film Blade runner?,about_pecore3
Da quale romanzo ha preso spunto Ridley Scott per il suo Blade runner?,about_pecore3
Qual è il titolo del romanzo a cui si ispira il film Blade runner?,about_pecore3
Come si chiama il romanzo rivisitato cinematograficamente da Blade runner?,about_pecore3
Blade runner è l’adattamento cinematografico di quale romanzo?,about_pecore3
Dove è ambientata la vicenda?,about_pecore4
Dove è ambientata la vicenda?,about_pecore4
Dove si svolge la storia?,about_pecore4
Dove si svolge la storia?,about_pecore4
In quale città avvengono i fatti?,about_pecore4
In quale città avvengono i fatti?,about_pecore4
Dove viene girato il film?,about_pecore4
Dove viene girato il film?,about_pecore4
In quale ambientazione si sceglie di realizzare le scene del film?,about_pecore4
In quale ambientazione si sceglie di realizzare le scene del film?,about_pecore4
In quale luogo è ambientato il film Blade runner?,about_pecore4
In quale luogo è ambientato il film Blade runner?,about_pecore4
Chi riveste il ruolo più importante nella trama del film Blade runner?,about_pecore5
Quale personaggio risulta l’eroe positivo nell’equilibrio della trama del film Blade runner?,about_pecore5
Chi ha un ruolo di primo piano nelle vicende narrate nel film Blade Runner?,about_pecore5
Quale blade runner uccide i Nexus 6?,about_pecore5
Quale detective uccide i Nexus 6?,about_pecore5
Chi da la caccia al gruppo di Nexus ribelli?,about_pecore5
Chi interpreta nel film Harrison Ford?,about_pecore5
Chi uccide Pris?,about_pecore5
Come possono essere definiti i replicanti?,about_pecore6
Come possono essere definiti i replicanti?,about_pecore6
Che tipo di tecnologia ha sviluppato la Tyrell Corporation?,about_pecore6
Che tipo di tecnologia ha sviluppato la Tyrell Corporation?,about_pecore6
Che caratteristiche hanno i replicanti?,about_pecore6
Che caratteristiche hanno i replicanti?,about_pecore6
Qual è la durata massima di un replicante?,about_pecore7
Qual è la durata massima di un replicante?,about_pecore7
Qual è la durata massima di un replicante?,about_pecore7
Dopo quanti anni dalla loro produzione devono essere eliminati i replicanti?,about_pecore7
Dopo quanti anni dalla loro produzione devono essere eliminati i replicanti?,about_pecore7
Dopo quanti anni dalla loro produzione devono essere eliminati i replicanti?,about_pecore7
I Nexus 6 sono stati geneticamente programmati per vivere per quanti anni?,about_pecore7
I Nexus 6 sono stati geneticamente programmati per vivere per quanti anni?,about_pecore7
I Nexus 6 sono stati geneticamente programmati per vivere per quanti anni?,about_pecore7
Dopo quale intervallo di tempo i Nexus 6 devono essere eliminati per non sviluppare sentimenti umani?,about_pecore7
Dopo quale intervallo di tempo i Nexus 6 devono essere eliminati per non sviluppare sentimenti umani?,about_pecore7
Dopo quale intervallo di tempo i Nexus 6 devono essere eliminati per non sviluppare sentimenti umani?,about_pecore7
Per quanto tempo i Nexus 6 possono vivere prima di essere eliminati?,about_pecore7
Per quanto tempo i Nexus 6 possono vivere prima di essere eliminati?,about_pecore7
Per quanto tempo i Nexus 6 possono vivere prima di essere eliminati?,about_pecore7
Quale è il limite di vita dei replicanti?,about_pecore7
Quale è il limite di vita dei replicanti?,about_pecore7
Quale è il limite di vita dei replicanti?,about_pecore7
Entro quanto tempo devono essere ritirati i replicanti?,about_pecore7
Entro quanto tempo devono essere ritirati i replicanti?,about_pecore7
Entro quanto tempo devono essere ritirati i replicanti?,about_pecore7
Qual è il problema di Roy?,about_pecore8
Qual è il problema di Roy?,about_pecore8
Qual è il problema di Roy?,about_pecore8
Cosa affligge Roy?,about_pecore8
Cosa affligge Roy?,about_pecore8
Cosa affligge Roy?,about_pecore8
Cosa fa soffrire Roy a tal punto da renderlo un eroe romantico?,about_pecore8
Cosa fa soffrire Roy a tal punto da renderlo un eroe romantico?,about_pecore8
Cosa fa soffrire Roy a tal punto da renderlo un eroe romantico?,about_pecore8
Perchè Roy soffre?,about_pecore8
Perchè Roy soffre?,about_pecore8
Perchè Roy soffre?,about_pecore8
Per quale motivo Roy ucciderà Tyrell?,about_pecore8
Per quale motivo Roy ucciderà Tyrell?,about_pecore8
Per quale motivo Roy ucciderà Tyrell?,about_pecore8
Perchè Roy può essere definito un replicante ribelle?,about_pecore8
Perchè Roy può essere definito un replicante ribelle?,about_pecore8
Perchè Roy può essere definito un replicante ribelle?,about_pecore8
Qual è l’unico modello sperimentale di replicante senza un limite di vita?,about_pecore9
Qual è l’unico modello sperimentale di replicante senza un limite di vita?,about_pecore9
Quale Nexus è stato progettato senza limiti temporali?,about_pecore9
Quale Nexus è stato progettato senza limiti temporali?,about_pecore9
Quale replicante non dover essere eliminato dopo 4 anni?,about_pecore9
Quale replicante non dover essere eliminato dopo 4 anni?,about_pecore9
Quale replicante non ha limiti di vita?,about_pecore9
Quale replicante non ha limiti di vita?,about_pecore9
Come si chiama l’unico replicante che Tyrell ha progettato senza programmarne la morte dopo 4 anni?,about_pecore9
Come si chiama l’unico replicante che Tyrell ha progettato senza programmarne la morte dopo 4 anni?,about_pecore9
Quando si svolgono gli eventi?,about_pecore10
Quando si svolgono gli eventi?,about_pecore10
Quando si volge la vicenda?,about_pecore10
Quando si volge la vicenda?,about_pecore10
In quale anno si svolgono i fatti?,about_pecore10
In quale anno si svolgono i fatti?,about_pecore10
In che periodo è ambientata la trama?,about_pecore10
In che periodo è ambientata la trama?,about_pecore10
Che ruolo hanno i blade runner?,about_pecore11
Che ruolo hanno i blade runner?,about_pecore11
Che funzione hanno i blade runner?,about_pecore11
Che funzione hanno i blade runner?,about_pecore11
Quale compito hanno i blade runner?,about_pecore11
Quale compito hanno i blade runner?,about_pecore11
A cosa danno la caccia i blade runner?,about_pecore11
A cosa danno la caccia i blade runner?,about_pecore11
Qual è l'incarico assegnato ai blade runner dalla polizia di Los Angeles?,about_pecore11
Qual è l'incarico assegnato ai blade runner dalla polizia di Los Angeles?,about_pecore11
Cosa fabbrica la Tyrell Corporation?,about_pecore12
Cosa fabbrica la Tyrell Corporation?,about_pecore12
Di cosa si occupa la Tyrell Corporation?,about_pecore12
Di cosa si occupa la Tyrell Corporation?,about_pecore12
Cosa si produce alla Tyrell Corporation?,about_pecore12
Cosa si produce alla Tyrell Corporation?,about_pecore12
Quale funzione ha la Tyrell Corporation a Los Angeles?,about_pecore12
Quale funzione ha la Tyrell Corporation a Los Angeles?,about_pecore12
A quale test Deckard sottopone i sospetti per capire se sono replicanti?,about_pecore13
A quale test Deckard sottopone i sospetti per capire se sono replicanti?,about_pecore13
Quale metodo usa Deckard per smascherare i replicanti?,about_pecore13
Quale metodo usa Deckard per smascherare i replicanti?,about_pecore13
Quale dispositivo usa Deckard per misurare le reazioni fisiologiche di un individuo per determinare se si tratta di un replicante?,about_pecore13
Quale dispositivo usa Deckard per misurare le reazioni fisiologiche di un individuo per determinare se si tratta di un replicante?,about_pecore13
Quale macchinario utilizzano i blade runners per capire se hanno a che fare con un replicante?,about_pecore13
Quale macchinario utilizzano i blade runners per capire se hanno a che fare con un replicante?,about_pecore13
Qual è il tema principale del film Blade runner?,about_pecore14
Qual è il tema principale del film Blade runner?,about_pecore14
Qual è il messaggio del film?,about_pecore14
Qual è il messaggio del film?,about_pecore14
Quali tematiche affronta il film?,about_pecore14
Quali tematiche affronta il film?,about_pecore14
In che cosa si può sintetizzare il senso del film?,about_pecore14
In che cosa si può sintetizzare il senso del film?,about_pecore14
Qual è la frase più famosa del film?,about_pecore15
Quali parole famose pronuncia Roy?,about_pecore15
Quale citazione è la più nota nel film e nel romanzo?,about_pecore15
Quale battuta famosa è particolarmente conosciuta?,about_pecore15
Come si chiama il nuovo film di Blade Runner?,about_pecore16
Come si intitola il nuovo Blade Runner?,about_pecore16
Qual è il nome del nuovo Blade Runner?,about_pecore16
Qual è il titolo del sequel di Blade Runner?,about_pecore16
Quale sequel di Blade Ruuner sta per uscire nelle sale cinematografiche?,about_pecore16
Quando uscirà nelle sale cinematografiche il nuovo film di Blade Runner?,about_pecore17
Quando uscirà nelle sale cinematografiche il nuovo film di Blade Runner?,about_pecore17
Quando è prevista l'uscita ai botteghini del nuovo film di Blade Runner?,about_pecore17
Quando è prevista l'uscita ai botteghini del nuovo film di Blade Runner?,about_pecore17
In quale mese uscirà Blade Runner 2049?,about_pecore17
In quale mese uscirà Blade Runner 2049?,about_pecore17
Per quale data è prevista l'uscita di Blade Runner 2049?,about_pecore17
Per quale data è prevista l'uscita di Blade Runner 2049?,about_pecore17
Che genere di film è Blade Runner?,about_pecore18
Che genere di film è Blade Runner?,about_pecore18
Che tipologia di film è Blade Runner?,about_pecore18
Che tipologia di film è Blade Runner?,about_pecore18
A quale genere cinematografico appartiene Blade Runner?,about_pecore18
A quale genere cinematografico appartiene Blade Runner?,about_pecore18
