{
  "results": [
    {
      "command": "Zig/fib",
      "mean": 2.6427747386799996,
      "stddev": 0.014045615442780417,
      "median": 2.63905233998,
      "user": 2.6351277399999997,
      "system": 0.0023188799999999993,
      "min": 2.62626717648,
      "max": 2.66812897748,
      "times": [
        2.64743470148,
        2.6426850174800003,
        2.66562769148,
        2.64076115948,
        2.63504481648,
        2.63734352048,
        2.66812897748,
        2.63266818048,
        2.63178614548,
        2.62626717648
      ],
      "exit_codes": [
        0,
        0,
        0,
        0,
        0,
        0,
        0,
        0,
        0,
        0
      ]
    },
    {
      "command": "Nim/fib",
      "mean": 1.8074160117799998,
      "stddev": 0.015467072962804442,
      "median": 1.8033635069799998,
      "user": 1.80254264,
      "system": 0.0016684799999999993,
      "min": 1.7952603864799999,
      "max": 1.83977769448,
      "times": [
        1.8010771884799999,
        1.79605333048,
        1.83082821348,
        1.7972907014800001,
        1.7952603864799999,
        1.79594722048,
        1.80642994948,
        1.80564982548,
        1.83977769448,
        1.80584560748
      ],
      "exit_codes": [
        0,
        0,
        0,
        0,
        0,
        0,
        0,
        0,
        0,
        0
      ]
    },
    {
      "command": "Crystal/fib",
      "mean": 3.89826619308,
      "stddev": 0.008271004210444723,
      "median": 3.8962682954799996,
      "user": 3.88917164,
      "system": 0.002058203999999999,
      "min": 3.88982008448,
      "max": 3.91711484948,
      "times": [
        3.8987071704800003,
        3.90789879848,
        3.89596138148,
        3.88982008448,
        3.91711484948,
        3.89108271848,
        3.89376304948,
        3.8943604614800003,
        3.89737820748,
        3.89657520948
      ],
      "exit_codes": [
        0,
        0,
        0,
        0,
        0,
        0,
        0,
        0,
        0,
        0
      ]
    },
    {
      "command": "Chapel/fib",
      "mean": 2.93123085568,
      "stddev": 0.0065097325326980895,
      "median": 2.93153001898,
      "user": 2.92245794,
      "system": 0.015917179999999996,
      "min": 2.92097114648,
      "max": 2.94426363748,
      "times": [
        2.92458529848,
        2.94426363748,
        2.92617930948,
        2.93128610648,
        2.93260648648,
        2.93177393148,
        2.92097114648,
        2.93686328248,
        2.9309382844800003,
        2.93284107348
      ],
      "exit_codes": [
        0,
        0,
        0,
        0,
        0,
        0,
        0,
        0,
        0,
        0
      ]
    },
    {
      "command": "OCaml/fib",
      "mean": 4.24619735928,
      "stddev": 0.011522126418808102,
      "median": 4.24330740098,
      "user": 4.232893639999999,
      "system": 0.0036501799999999994,
      "min": 4.23390005148,
      "max": 4.27648874848,
      "times": [
        4.2464947984800006,
        4.27648874848,
        4.247080326480001,
        4.249320449480001,
        4.24069864848,
        4.24524688248,
        4.241041006480001,
        4.24136791948,
        4.23390005148,
        4.240334761480001
      ],
      "exit_codes": [
        0,
        0,
        0,
        0,
        0,
        0,
        0,
        0,
        0,
        0
      ]
    },
    {
      "command": "OCaml/fib-unsafe",
      "mean": 4.24386001738,
      "stddev": 0.00947510757594741,
      "median": 4.2460205039800005,
      "user": 4.23176254,
      "system": 0.003312379999999999,
      "min": 4.229583890480001,
      "max": 4.254993850480001,
      "times": [
        4.24818744848,
        4.254993850480001,
        4.229583890480001,
        4.245988646480001,
        4.24605236148,
        4.252064835480001,
        4.24206793048,
        4.25471847848,
        4.23394195848,
        4.231000773480001
      ],
      "exit_codes": [
        0,
        0,
        0,
        0,
        0,
        0,
        0,
        0,
        0,
        0
      ]
    },
    {
      "command": "OCaml/fib+flambda",
      "mean": 4.245972589680001,
      "stddev": 0.012334748745554947,
      "median": 4.2443790334800005,
      "user": 4.23440164,
      "system": 0.003184441999999999,
      "min": 4.22763091048,
      "max": 4.2648124344800005,
      "times": [
        4.230384095480001,
        4.2648124344800005,
        4.2410086724800005,
        4.2613875534800005,
        4.256340385480001,
        4.2419590104800005,
        4.22763091048,
        4.2467990564800004,
        4.23994888248,
        4.24945489548
      ],
      "exit_codes": [
        0,
        0,
        0,
        0,
        0,
        0,
        0,
        0,
        0,
        0
      ]
    },
    {
      "command": "OCaml/fib+flambda-unsafe",
      "mean": 4.25147515038,
      "stddev": 0.012646966915851253,
      "median": 4.24705543598,
      "user": 4.240604639999999,
      "system": 0.002992879999999999,
      "min": 4.2358475684800005,
      "max": 4.276424724480001,
      "times": [
        4.245723794480001,
        4.24371678648,
        4.251023275480001,
        4.2358475684800005,
        4.24472887948,
        4.269668950480001,
        4.276424724480001,
        4.24304432148,
        4.24838707748,
        4.25618612548
      ],
      "exit_codes": [
        0,
        0,
        0,
        0,
        0,
        0,
        0,
        0,
        0,
        0
      ]
    },
    {
      "command": "OCaml/fib_binet",
      "mean": 0.0020483803869306917,
      "stddev": 0.001248606731837973,
      "median": 0.002075907479999999,
      "user": 0.0014577664356435647,
      "system": 0.0015057816831683145,
      "min": 0.0,
      "max": 0.005777825479999999,
      "times": [
        0.0,
        0.0010131294799999987,
        0.0017577014799999994,
        0.00345583548,
        0.00070133848,
        0.001385822479999999,
        0.000656017479999999,
        0.0,
        0.0010048854799999994,
        0.0024006874799999993,
        0.00143585948,
        0.0040623514799999995,
        0.0025441634799999993,
        0.0028427654799999995,
        0.002624698479999999,
        0.00126083348,
        0.00306105648,
        0.0023955354799999997,
        0.0028515914799999995,
        0.000990744479999999,
        0.00426304948,
        0.0008558754799999997,
        0.0034515084799999996,
        0.0002038994799999994,
        0.0025690954799999994,
        0.00324926248,
        0.0003372664799999991,
        0.0021418554799999988,
        0.00082935748,
        0.00371947948,
        0.0004855994799999987,
        0.00211332548,
        0.0,
        0.00182525948,
        0.0017981334799999993,
        0.0038616744799999997,
        0.0027655024800000002,
        0.003425803479999999,
        0.0025648074799999995,
        0.004694053479999999,
        0.002908888479999999,
        0.00237535848,
        0.00407834148,
        0.004794817479999999,
        0.0050312084799999995,
        0.00425376248,
        0.00036677747999999937,
        0.0034202044800000003,
        0.00220909248,
        0.001980173479999999,
        0.0,
        0.0017109494799999988,
        0.0,
        0.0016568204799999988,
        0.0,
        0.00233040448,
        0.002637192479999999,
        0.00438653748,
        0.003318065479999999,
        0.0024699074799999993,
        0.0026070834799999986,
        0.004916406479999999,
        0.00397965348,
        0.00016908347999999938,
        0.00191258948,
        0.0012352944799999986,
        0.0013054814799999996,
        0.0036528844799999993,
        0.0013131874799999993,
        0.0015530774799999989,
        0.0,
        0.000620700479999999,
        0.00303310548,
        0.0,
        0.0,
        0.0013603424799999994,
        0.0010904174799999987,
        0.0019230624799999986,
        8.570479999999228e-6,
        0.00010831147999999964,
        0.003651609479999999,
        0.00005105947999999895,
        0.0024265514799999997,
        0.0020481364799999997,
        0.00127232248,
        0.0,
        0.0023079744799999998,
        0.0031086694799999986,
        0.0011497054799999998,
        0.000019592479999999517,
        0.00315628348,
        0.00099403148,
        0.0012958554799999992,
        0.002773398479999999,
        0.005777825479999999,
        0.00242773748,
        0.003360755479999999,
        0.0035222104800000003,
        0.002349014479999999,
        0.0025607074799999996,
        0.004965832479999999,
        0.001930068479999999,
        0.0030025504799999986,
        0.0036339254800000003,
        0.00217130348,
        0.00264549248,
        0.00380650648,
        0.002107342479999999,
        0.0023889144799999996,
        0.00278006648,
        0.0,
        0.0004631294799999986,
        0.0032204964799999987,
        0.0015169564799999988,
        0.0023009614799999996,
        0.0034179974799999997,
        0.0016093634799999998,
        0.0014303914799999986,
        0.002947023479999999,
        0.002793498479999999,
        0.0000984994799999991,
        0.0015480704799999993,
        0.0,
        0.00129065348,
        0.0,
        0.0032991834799999996,
        0.00216635048,
        0.0019389764799999992,
        0.0036126364799999996,
        0.00337373548,
        0.002522853479999999,
        0.0021575744799999996,
        0.001228662479999999,
        0.0019531724800000002,
        0.0031218074799999997,
        0.0026601894799999993,
        0.0007683514799999994,
        0.0006010924799999999,
        0.0030744974799999996,
        0.0027992304799999987,
        0.0004960714799999997,
        0.0012503594800000002,
        0.00159706348,
        0.0,
        0.003928984479999999,
        0.0009266284799999995,
        0.00261906048,
        0.00349160048,
        0.0020365554799999996,
        0.0025769854799999993,
        0.00266368848,
        0.0018268434799999988,
        0.002788149479999999,
        0.0008166334799999996,
        0.0005664774799999999,
        0.003105597479999999,
        0.001103316479999999,
        0.0025132394799999994,
        0.0027445164799999996,
        0.001971403479999999,
        0.0,
        0.0029788904799999986,
        0.0011767644799999992,
        0.0005713134799999993,
        0.0009617734799999998,
        0.0022708434799999988,
        0.0033649314799999988,
        0.0023627284799999987,
        0.0,
        0.0005284614799999999,
        0.0003945504799999994,
        0.002179070479999999,
        0.0017469784799999987,
        0.000952184479999999,
        0.003125529479999999,
        0.0017393504799999996,
        0.0032373234799999992,
        0.0005571184799999995,
        0.00199001548,
        0.0028869944799999993,
        0.0014497304799999987,
        0.00232698048,
        0.001977444479999999,
        0.0034858204799999995,
        0.0020195294799999998,
        0.00440843048,
        0.000054468479999999174,
        0.0,
        0.0037452464799999996,
        0.00111498148,
        0.0010630844799999995,
        0.0015350744799999998,
        0.002448772479999999,
        0.00013754047999999918,
        0.0015346264799999997,
        0.001708447479999999,
        0.00290851748,
        0.00061239348,
        0.002750743479999999,
        0.0028308334800000003,
        0.0005557174799999997,
        0.0009392874799999994,
        0.003219754479999999,
        0.0015149824799999987,
        0.0006392344799999996,
        0.004261796479999999,
        0.0015913234799999993,
        0.0005689414799999988,
        0.0016241914799999995,
        0.00294676448,
        0.0026280704799999987,
        0.0022417624800000003,
        0.0014184774799999985,
        0.00035139247999999967,
        0.0014735704799999994,
        0.003053702479999999,
        0.00375495848,
        0.0007049314799999996,
        0.00380433148,
        0.00012437747999999912,
        0.0015857634799999994,
        0.0005045514799999996,
        0.0022497754799999997,
        0.0014548854800000002,
        0.0016702094799999996,
        0.0008523474799999988,
        0.0028830324799999996,
        0.0015641294799999999,
        0.00023653547999999934,
        0.0018822154799999985,
        0.00171132948,
        0.00015945647999999948,
        0.0011102854799999997,
        0.0002470104799999996,
        0.00146292748,
        0.0003122024799999991,
        0.0019963904799999996,
        0.0027078004799999987,
        0.0012485344799999997,
        0.0009922294799999997,
        0.00284863748,
        0.0023328184799999993,
        0.00138091648,
        0.0013212974799999997,
        0.003679178479999999,
        0.0005444834799999991,
        0.0011342964799999989,
        0.00300910948,
        0.0008276384799999993,
        0.0014505524799999997,
        0.0005034984799999987,
        0.0013321554799999987,
        0.001392720479999999,
        0.00037374647999999927,
        0.0026025864799999994,
        0.0034804744799999997,
        0.0007167424800000001,
        0.0030018234799999996,
        0.004029236479999999,
        0.0008123634799999989,
        0.004268658479999999,
        0.0019110154799999992,
        0.0024798784800000003,
        0.0007585934799999991,
        0.00234641248,
        0.0005109994799999988,
        0.0,
        0.0004242844799999994,
        0.0032874344799999995,
        0.0011123604799999987,
        0.00016542147999999961,
        0.00020098247999999954,
        0.00058048748,
        0.0008028214799999994,
        0.0008541284799999998,
        0.0013940134800000002,
        0.00331497248,
        0.0008407644799999997,
        0.00047309347999999977,
        0.0037867054800000003,
        0.00163901148,
        0.0012360864799999998,
        0.0003629144799999996,
        0.00222418648,
        0.0004346724799999995,
        0.0008860214799999997,
        0.0014779074799999995,
        0.00231500048,
        0.0022735364799999986,
        0.0012936704799999992,
        0.0029899194799999996,
        0.00347845048,
        0.0022159644799999998,
        0.002802100479999999,
        0.0017013704799999996,
        0.0021910874800000002,
        0.004219874479999999,
        0.0017596834799999987,
        0.0019017144799999995,
        0.0034234484799999998,
        0.0020568854799999986,
        0.0016348794799999995,
        0.0022260204799999994,
        0.00288864448,
        0.00454363748,
        0.0026795214799999996,
        0.0025408164800000002,
        0.0005021724799999993,
        0.002991561479999999,
        0.001442423479999999,
        0.00014144847999999956,
        0.0018140814799999993,
        0.0017391464799999994,
        0.002196610479999999,
        0.001835138479999999,
        0.00212194048,
        0.00308385348,
        0.00254152248,
        0.00187757548,
        0.002872091479999999,
        0.00367955848,
        0.0034455694799999997,
        0.00312982248,
        0.0033721774799999995,
        0.0023488664799999988,
        0.003072511479999999,
        0.00336502148,
        0.00243702448,
        0.0033677284799999993,
        0.001920972479999999,
        0.0022336974799999987,
        0.003032580479999999,
        0.0016046174799999998,
        0.002435375479999999,
        0.0025974004799999987,
        0.00460486948,
        0.004080132479999999,
        0.0013160174799999999,
        0.0036721744799999992,
        0.0021711164799999997,
        0.0028648714799999987,
        0.002429538479999999,
        0.0006056284799999994,
        0.00396122848,
        0.001641524479999999,
        0.00416197048,
        0.0006199374799999999,
        0.00456287148,
        0.002220711479999999,
        0.002484076479999999,
        0.0,
        0.0016220564799999991,
        0.00004473147999999906,
        0.002553431479999999,
        0.001042658479999999,
        0.0008900064799999994,
        0.00123272448,
        0.00507188748,
        0.002878455479999999,
        0.0014786054799999998,
        0.0012070174800000001,
        0.0026415484799999995,
        0.00020951547999999934,
        0.001964630479999999,
        0.0037712814800000003,
        0.0012261334799999997,
        0.0019692914799999987,
        0.0037572294799999998,
        0.002391407479999999,
        0.002207604479999999,
        0.0016300274799999999,
        0.00011600447999999923,
        0.001414607479999999,
        0.002331474479999999,
        0.00569143248,
        0.00217629048,
        0.004019544479999999,
        0.0,
        0.0028922604799999996,
        0.0047911544799999995,
        0.002574708479999999,
        0.0021108954799999987,
        0.0023644994799999998,
        0.0018056994799999998,
        0.002279428479999999,
        0.0014723744799999992,
        0.003546271479999999,
        0.004667552479999999,
        0.0019629164799999993,
        0.00287353348,
        0.001749792479999999,
        0.00237219748,
        0.00284932648,
        0.004043609479999999,
        0.0026313444799999997,
        0.00368081148,
        0.002714912479999999,
        0.0020949294799999995,
        0.003197267479999999,
        0.0022205724799999995,
        0.002214835479999999,
        0.002044423479999999,
        0.0018399804799999987,
        0.0023990624799999994
      ],
      "exit_codes": [
        0,
        0,
        0,
        0,
        0,
        0,
        0,
        0,
        0,
        0,
        0,
        0,
        0,
        0,
        0,
        0,
        0,
        0,
        0,
        0,
        0,
        0,
        0,
        0,
        0,
        0,
        0,
        0,
        0,
        0,
        0,
        0,
        0,
        0,
        0,
        0,
        0,
        0,
        0,
        0,
        0,
        0,
        0,
        0,
        0,
        0,
        0,
        0,
        0,
        0,
        0,
        0,
        0,
        0,
        0,
        0,
        0,
        0,
        0,
        0,
        0,
        0,
        0,
        0,
        0,
        0,
        0,
        0,
        0,
        0,
        0,
        0,
        0,
        0,
        0,
        0,
        0,
        0,
        0,
        0,
        0,
        0,
        0,
        0,
        0,
        0,
        0,
        0,
        0,
        0,
        0,
        0,
        0,
        0,
        0,
        0,
        0,
        0,
        0,
        0,
        0,
        0,
        0,
        0,
        0,
        0,
        0,
        0,
        0,
        0,
        0,
        0,
        0,
        0,
        0,
        0,
        0,
        0,
        0,
        0,
        0,
        0,
        0,
        0,
        0,
        0,
        0,
        0,
        0,
        0,
        0,
        0,
        0,
        0,
        0,
        0,
        0,
        0,
        0,
        0,
        0,
        0,
        0,
        0,
        0,
        0,
        0,
        0,
        0,
        0,
        0,
        0,
        0,
        0,
        0,
        0,
        0,
        0,
        0,
        0,
        0,
        0,
        0,
        0,
        0,
        0,
        0,
        0,
        0,
        0,
        0,
        0,
        0,
        0,
        0,
        0,
        0,
        0,
        0,
        0,
        0,
        0,
        0,
        0,
        0,
        0,
        0,
        0,
        0,
        0,
        0,
        0,
        0,
        0,
        0,
        0,
        0,
        0,
        0,
        0,
        0,
        0,
        0,
        0,
        0,
        0,
        0,
        0,
        0,
        0,
        0,
        0,
        0,
        0,
        0,
        0,
        0,
        0,
        0,
        0,
        0,
        0,
        0,
        0,
        0,
        0,
        0,
        0,
        0,
        0,
        0,
        0,
        0,
        0,
        0,
        0,
        0,
        0,
        0,
        0,
        0,
        0,
        0,
        0,
        0,
        0,
        0,
        0,
        0,
        0,
        0,
        0,
        0,
        0,
        0,
        0,
        0,
        0,
        0,
        0,
        0,
        0,
        0,
        0,
        0,
        0,
        0,
        0,
        0,
        0,
        0,
        0,
        0,
        0,
        0,
        0,
        0,
        0,
        0,
        0,
        0,
        0,
        0,
        0,
        0,
        0,
        0,
        0,
        0,
        0,
        0,
        0,
        0,
        0,
        0,
        0,
        0,
        0,
        0,
        0,
        0,
        0,
        0,
        0,
        0,
        0,
        0,
        0,
        0,
        0,
        0,
        0,
        0,
        0,
        0,
        0,
        0,
        0,
        0,
        0,
        0,
        0,
        0,
        0,
        0,
        0,
        0,
        0,
        0,
        0,
        0,
        0,
        0,
        0,
        0,
        0,
        0,
        0,
        0,
        0,
        0,
        0,
        0,
        0,
        0,
        0,
        0,
        0,
        0,
        0,
        0,
        0,
        0,
        0,
        0,
        0,
        0,
        0,
        0,
        0,
        0,
        0,
        0,
        0,
        0,
        0,
        0,
        0,
        0,
        0,
        0,
        0,
        0,
        0,
        0,
        0,
        0,
        0,
        0,
        0,
        0,
        0,
        0,
        0,
        0,
        0,
        0,
        0,
        0,
        0,
        0,
        0,
        0,
        0,
        0,
        0,
        0,
        0,
        0,
        0,
        0,
        0,
        0,
        0
      ]
    },
    {
      "command": "OCaml/fib_binet_opt",
      "mean": 0.0023548914356923078,
      "stddev": 0.001173966220718216,
      "median": 0.0022045354799999995,
      "user": 0.0015544951384615388,
      "system": 0.0014254127999999994,
      "min": 0.0,
      "max": 0.00596895248,
      "times": [
        0.001800200479999999,
        0.0031247344799999995,
        0.0038215824799999994,
        0.0016033034799999993,
        0.001315742479999999,
        0.0035950854800000003,
        0.0010882194799999986,
        0.0012073644799999996,
        0.0024343364799999994,
        0.00183032148,
        0.00443756148,
        0.0021831394799999996,
        0.00242923348,
        0.003328556479999999,
        0.002651802479999999,
        0.001910831479999999,
        0.0035280094799999993,
        0.00273104648,
        0.00357680448,
        0.00526337448,
        0.0021181804799999997,
        0.0021924664799999995,
        0.0027378494799999995,
        0.0007749134799999993,
        0.00438039748,
        0.0035698564799999987,
        0.002523107479999999,
        0.001932441479999999,
        0.0,
        0.00190535848,
        0.0023691664799999996,
        0.003849870479999999,
        0.0025411294799999986,
        0.0035791404799999987,
        0.0018554484799999998,
        0.0024786604799999995,
        0.002020298479999999,
        0.0029891944799999995,
        0.0025869974799999996,
        0.0018211304799999996,
        0.00505890448,
        0.002951976479999999,
        0.00515933548,
        0.0031468504799999986,
        0.0025200844799999995,
        0.0013067734799999996,
        0.00310597748,
        0.0025574334800000003,
        0.00146658548,
        0.002728704479999999,
        0.002776463479999999,
        0.001500609479999999,
        0.0017650394800000002,
        0.0016531834799999997,
        0.0016351264799999996,
        0.0017202864799999986,
        0.0034348074799999987,
        0.0028445354799999994,
        0.0020286014799999986,
        0.00297509748,
        0.0034047094799999995,
        0.00209906448,
        0.00387067748,
        0.0019912014799999987,
        0.00018999347999999923,
        0.002652082479999999,
        0.0020499594799999995,
        0.0021071364799999997,
        0.000014740479999999015,
        0.00152666348,
        0.0,
        0.0016585834799999989,
        0.0010417704799999998,
        0.0043889774799999995,
        0.003510536479999999,
        0.003775667479999999,
        0.0031019614799999993,
        0.002604337479999999,
        0.00394662748,
        0.0024962864799999993,
        0.00215279148,
        0.0031790084799999995,
        0.0025758354799999992,
        0.0027752444799999986,
        0.00564790748,
        0.002957688479999999,
        0.0024462804799999993,
        0.00596895248,
        0.00186955048,
        0.00226001448,
        0.003688188479999999,
        0.001861583479999999,
        0.0020175774800000002,
        0.00276440548,
        0.00474146748,
        0.0016020674799999994,
        0.0020079854799999993,
        0.0012113264799999994,
        0.00156745448,
        0.00139385548,
        0.0022577054799999994,
        0.0015378414799999988,
        0.0016705264799999993,
        0.00404598348,
        0.0018549674799999997,
        0.002075858479999999,
        0.00275548748,
        0.00282042648,
        0.00039867647999999953,
        0.00436292748,
        0.002304396479999999,
        0.0021347964800000003,
        0.0023459204799999986,
        0.0013400194799999985,
        0.0016495684799999995,
        0.002873917479999999,
        0.00384824348,
        0.0031891674799999986,
        0.0020589594799999998,
        0.004118973479999999,
        0.0014365004799999992,
        0.0022400204799999995,
        0.004740605479999999,
        0.0020994974799999995,
        0.0019752884799999993,
        0.00502825748,
        0.0022592264799999985,
        0.0019253724799999988,
        0.00499042648,
        0.0025316044799999987,
        0.0032679134799999997,
        0.00315831048,
        0.0019107044799999999,
        0.002216124479999999,
        0.004212222479999999,
        0.0006176394799999986,
        0.001451740479999999,
        0.00349983648,
        0.000742454479999999,
        0.0010047904799999991,
        0.0027589784799999994,
        0.0016700084799999996,
        0.0024896384799999996,
        0.0022660234799999996,
        0.00310787548,
        0.0029154894799999992,
        0.0020943364799999994,
        0.004831857479999999,
        0.00234419048,
        0.0033900814800000003,
        0.004314082479999999,
        0.0022045354799999995,
        0.0020188284799999992,
        0.003970523479999999,
        0.002432989479999999,
        0.0008366544799999999,
        0.00324301348,
        0.0027414084799999997,
        0.001903010479999999,
        0.003510822479999999,
        0.0009643034799999986,
        0.0024717954799999995,
        0.0026721264799999993,
        0.0013393044800000002,
        0.00230483348,
        0.00317365548,
        0.003961341479999999,
        0.0037862834800000003,
        0.0025448424799999992,
        0.0034950974799999998,
        0.0016983354799999994,
        0.0018921734799999994,
        0.00406202048,
        0.0015850914799999992,
        0.002255791479999999,
        0.0034181724799999995,
        0.00268451348,
        0.0022552334799999995,
        0.00499258748,
        0.00281263148,
        0.0018611884799999987,
        0.00217277648,
        0.0018066474799999987,
        0.0017146134799999992,
        0.00207387248,
        0.0025475294799999987,
        0.0012797284799999998,
        0.0017715444799999988,
        0.002215379479999999,
        0.00360311748,
        0.0017706284799999987,
        0.0032203734799999993,
        0.0030631204799999997,
        0.0021767114800000003,
        0.0009185914799999988,
        0.005508430479999999,
        0.0019428074800000002,
        0.0009619804800000001,
        0.00193949248,
        0.00111456948,
        0.0014576074799999986,
        0.00044314148,
        0.00139942548,
        0.0002426624799999992,
        0.0014702054799999994,
        0.00039330348000000005,
        0.00262836748,
        0.0033197144800000003,
        0.0007769954799999998,
        0.0022151624799999986,
        0.0028851104799999987,
        0.00138851648,
        0.0017649124799999994,
        0.0015628664799999985,
        0.002890168479999999,
        0.0005617674800000002,
        0.0024654464799999986,
        0.002162983479999999,
        0.0016406224799999985,
        0.0010403434799999998,
        0.002912599479999999,
        0.0015486734799999994,
        0.001366743479999999,
        0.00124497448,
        0.00424475848,
        0.0005280844799999988,
        0.002327555479999999,
        0.0029728544799999994,
        0.0027246514799999988,
        0.0008027374799999985,
        0.0015311284799999986,
        0.0003245404799999997,
        0.0021472444800000002,
        0.0003940284800000001,
        0.0022369384799999998,
        0.0016495394799999992,
        0.0019441944799999987,
        0.0005159534799999985,
        0.00282870848,
        0.0020858074799999992,
        0.0017603964799999998,
        0.0016106234799999992,
        0.003408741479999999,
        0.0007362164799999986,
        0.00201564348,
        0.00239295448,
        0.0025996154800000002,
        0.0007425204799999989,
        0.0029354974799999994,
        0.00171253248,
        0.0016857354799999997,
        0.0017143294799999995,
        0.003625916479999999,
        0.0017525734799999993,
        0.00130765948,
        0.00331972848,
        0.0011204814799999985,
        0.0015030444799999992,
        0.00318267248,
        0.00288862148,
        0.0006434744799999987,
        0.0022327614799999987,
        0.0041918074799999995,
        0.003747014479999999,
        0.0030280344799999996,
        0.00471538748,
        0.002043784479999999,
        0.002860210479999999,
        0.00295391948,
        0.00345071648,
        0.00314425048,
        0.003843410479999999,
        0.00009719847999999955,
        0.00302638948,
        0.0018883104799999996,
        0.002104069479999999,
        0.00484192348,
        0.00397094648,
        0.0021670384799999986,
        0.001485020479999999,
        0.005023925479999999,
        0.00200979048,
        0.0009528104799999991,
        0.00426375848,
        0.0019342694799999996,
        0.0012272854799999988,
        0.0008590204799999992,
        0.00328547548,
        0.0037154844799999988,
        0.0018371814799999992,
        0.00116356048,
        0.00010486447999999947,
        0.003645222479999999,
        0.0017539014799999994,
        0.0006722764800000001,
        0.00042637647999999983,
        0.0,
        0.0002644504799999992,
        0.00252758448,
        0.00027476347999999887,
        0.0,
        0.00144227648,
        0.002123359479999999,
        0.00060526148,
        0.0022179014800000002,
        0.0013903504799999992,
        0.0015140124799999993,
        0.003674607479999999,
        0.00212442548,
        0.00206937048,
        0.00249100548,
        0.0010658104799999993,
        0.004171510479999999,
        0.0,
        0.0021780544799999994,
        0.004618324479999999,
        0.00215804148,
        0.00206904048,
        0.0010760934799999991,
        0.00316125648,
        0.003955561479999999,
        0.0014066644799999991,
        0.002497364479999999,
        0.00275203348,
        0.0015692894799999987
      ],
      "exit_codes": [
        0,
        0,
        0,
        0,
        0,
        0,
        0,
        0,
        0,
        0,
        0,
        0,
        0,
        0,
        0,
        0,
        0,
        0,
        0,
        0,
        0,
        0,
        0,
        0,
        0,
        0,
        0,
        0,
        0,
        0,
        0,
        0,
        0,
        0,
        0,
        0,
        0,
        0,
        0,
        0,
        0,
        0,
        0,
        0,
        0,
        0,
        0,
        0,
        0,
        0,
        0,
        0,
        0,
        0,
        0,
        0,
        0,
        0,
        0,
        0,
        0,
        0,
        0,
        0,
        0,
        0,
        0,
        0,
        0,
        0,
        0,
        0,
        0,
        0,
        0,
        0,
        0,
        0,
        0,
        0,
        0,
        0,
        0,
        0,
        0,
        0,
        0,
        0,
        0,
        0,
        0,
        0,
        0,
        0,
        0,
        0,
        0,
        0,
        0,
        0,
        0,
        0,
        0,
        0,
        0,
        0,
        0,
        0,
        0,
        0,
        0,
        0,
        0,
        0,
        0,
        0,
        0,
        0,
        0,
        0,
        0,
        0,
        0,
        0,
        0,
        0,
        0,
        0,
        0,
        0,
        0,
        0,
        0,
        0,
        0,
        0,
        0,
        0,
        0,
        0,
        0,
        0,
        0,
        0,
        0,
        0,
        0,
        0,
        0,
        0,
        0,
        0,
        0,
        0,
        0,
        0,
        0,
        0,
        0,
        0,
        0,
        0,
        0,
        0,
        0,
        0,
        0,
        0,
        0,
        0,
        0,
        0,
        0,
        0,
        0,
        0,
        0,
        0,
        0,
        0,
        0,
        0,
        0,
        0,
        0,
        0,
        0,
        0,
        0,
        0,
        0,
        0,
        0,
        0,
        0,
        0,
        0,
        0,
        0,
        0,
        0,
        0,
        0,
        0,
        0,
        0,
        0,
        0,
        0,
        0,
        0,
        0,
        0,
        0,
        0,
        0,
        0,
        0,
        0,
        0,
        0,
        0,
        0,
        0,
        0,
        0,
        0,
        0,
        0,
        0,
        0,
        0,
        0,
        0,
        0,
        0,
        0,
        0,
        0,
        0,
        0,
        0,
        0,
        0,
        0,
        0,
        0,
        0,
        0,
        0,
        0,
        0,
        0,
        0,
        0,
        0,
        0,
        0,
        0,
        0,
        0,
        0,
        0,
        0,
        0,
        0,
        0,
        0,
        0,
        0,
        0,
        0,
        0,
        0,
        0,
        0,
        0,
        0,
        0,
        0,
        0,
        0,
        0,
        0,
        0,
        0,
        0,
        0,
        0,
        0,
        0,
        0,
        0,
        0,
        0,
        0,
        0,
        0,
        0,
        0,
        0,
        0,
        0,
        0,
        0,
        0,
        0,
        0,
        0,
        0,
        0,
        0,
        0,
        0,
        0,
        0,
        0,
        0,
        0,
        0,
        0,
        0,
        0,
        0,
        0
      ]
    },
    {
      "command": "OCaml/fib_shift",
      "mean": 0.001923002146896552,
      "stddev": 0.001410445168637996,
      "median": 0.0017393049799999992,
      "user": 0.0016431203448275865,
      "system": 0.0012782346551724136,
      "min": 0.0,
      "max": 0.00762071748,
      "times": [
        0.0011978044799999992,
        0.00166247048,
        0.005410257479999999,
        0.0013644514799999998,
        0.0001822514799999994,
        0.0005602794799999993,
        0.0010508824800000002,
        0.0005768034799999997,
        0.0,
        0.0010785814799999993,
        0.00119144548,
        0.00490022848,
        0.0009034954799999996,
        0.00150011648,
        0.00274070548,
        0.0002184394799999989,
        0.0013996124799999987,
        0.001739229479999999,
        0.0002045884799999993,
        0.00032370147999999897,
        0.002168441479999999,
        0.000998535479999999,
        0.0,
        0.0,
        0.00531569448,
        0.00448262148,
        0.0009952714799999996,
        0.0011807814799999995,
        0.0008686334799999995,
        0.00001345147999999921,
        0.0007921504799999991,
        0.0021392124799999987,
        0.0008186884799999987,
        0.0,
        0.0,
        0.0,
        0.0,
        0.0,
        0.0017740334800000002,
        0.0013459544799999988,
        0.001302335479999999,
        0.00008925647999999918,
        0.0,
        0.0,
        0.0,
        0.0026683114800000003,
        0.0011144214799999998,
        0.0015896074799999988,
        0.00040129147999999875,
        0.0001394634799999992,
        0.0013388614799999992,
        0.0022727024799999987,
        0.0010788184799999994,
        0.0006912904799999996,
        0.0016907234799999988,
        0.00099936748,
        0.0021234314799999992,
        0.0,
        0.0020127834799999996,
        0.0,
        0.0016673674800000001,
        0.00109418848,
        0.00438852548,
        0.0,
        0.0017512154799999994,
        0.0013410814799999999,
        0.001775301479999999,
        0.00003498247999999919,
        0.0010910504799999986,
        0.00441237548,
        0.0032886344799999993,
        0.00105386548,
        0.0025565354799999994,
        0.0002493414799999991,
        0.0,
        0.00106015048,
        0.0016842144799999988,
        0.000043044479999998844,
        0.00019168047999999945,
        0.00122624848,
        0.001783484479999999,
        0.003195794479999999,
        0.0010849894799999987,
        0.0010093804799999996,
        0.001990202479999999,
        0.0035098624799999997,
        0.00396136348,
        0.0024858764799999987,
        0.00019464147999999955,
        0.0020114294799999993,
        0.0015029694799999988,
        0.00206261048,
        0.0,
        0.0018985964799999996,
        0.0,
        0.0021627144799999986,
        0.0,
        0.0025306654799999986,
        0.00243544248,
        0.0024698924800000003,
        0.0004371864799999998,
        0.00308963048,
        0.002403383479999999,
        0.0011932254799999998,
        0.0028201604799999993,
        0.0016129764799999993,
        0.0012363124799999988,
        0.0014563144799999992,
        0.0010834764799999988,
        0.0024115794799999994,
        0.00004050847999999968,
        0.0020989994799999996,
        0.0009049134799999992,
        0.0028005534799999997,
        0.000020858479999999284,
        0.0013228474799999992,
        0.00012252247999999886,
        0.0011043594799999999,
        0.00171421648,
        0.004988592479999999,
        0.000017922479999999026,
        0.0011461694799999997,
        0.00308125948,
        0.004110660479999999,
        0.0005258124799999995,
        0.0012615424799999999,
        0.0010562134799999992,
        0.00005150947999999888,
        0.0010783684799999986,
        0.0,
        0.00083003648,
        0.0030782774799999997,
        0.0011918694799999989,
        0.00218767348,
        0.0016441094800000002,
        0.0008745564799999992,
        0.0011390184799999993,
        0.001762754479999999,
        0.00150249248,
        0.0030890514799999996,
        0.0023319844799999994,
        0.0,
        0.0014048064799999987,
        0.0026953544799999994,
        0.00249400448,
        0.0028012824799999994,
        0.001838539479999999,
        0.0005964474799999989,
        0.00003953947999999884,
        0.0012242574800000001,
        0.0,
        0.0010893744799999995,
        0.0,
        0.00054274148,
        0.00182566448,
        0.0023755554799999986,
        0.00023427647999999923,
        0.0023835824799999994,
        0.0015738364799999993,
        0.0014899924799999997,
        0.0010143194799999986,
        0.0035673154799999987,
        0.0006395144799999997,
        0.004286045479999999,
        0.00195593448,
        0.00259716048,
        0.00058583648,
        0.0025602984799999997,
        0.00490806348,
        0.00043950447999999923,
        0.0014252174800000001,
        0.0021321054799999994,
        0.00031573647999999944,
        0.0005666754799999998,
        0.0025645784799999986,
        0.0020126634799999986,
        0.004264611479999999,
        0.00452227548,
        0.0019128654799999987,
        0.0015460404799999992,
        0.00367175448,
        0.0032985754799999987,
        0.0003001034799999993,
        0.0031265014799999992,
        0.00114049048,
        0.0020373534799999994,
        0.0012353494799999991,
        0.003169662479999999,
        0.000393216479999999,
        0.0015107114799999986,
        0.0,
        0.0,
        5.622479999999215e-6,
        0.0,
        0.0004520934799999996,
        0.0016102424799999985,
        0.0015414124799999996,
        0.00019350447999999954,
        0.0012637414799999995,
        0.0017393804799999994,
        0.0008303764799999997,
        0.0,
        0.003137723479999999,
        0.0,
        0.000029223479999999045,
        0.003915897479999999,
        0.0013978644799999993,
        0.00209989548,
        0.0025994554799999995,
        0.0028996134799999995,
        0.0022553324799999995,
        0.0005972314799999991,
        0.003093587479999999,
        0.0034310854799999993,
        0.00437728248,
        0.00018146047999999942,
        0.0023741154800000002,
        0.00006164047999999891,
        0.0017565394799999986,
        0.0012806974799999997,
        0.0029454404799999995,
        0.004251988479999999,
        0.00243015948,
        0.00551054148,
        0.0025426964799999995,
        0.0020899524799999998,
        0.003391484479999999,
        0.0036499414799999992,
        0.0031787444799999997,
        0.00426927948,
        0.00272769748,
        0.0029607454799999997,
        0.00456708648,
        0.0020738034799999997,
        0.00294991848,
        0.0024806744799999994,
        0.003247837479999999,
        0.00280438948,
        0.00239063048,
        0.005703170479999999,
        0.003906569479999999,
        0.00762071748,
        0.003484809479999999,
        0.0013071524799999996,
        0.00422128348,
        0.00379906848,
        0.0026515544799999994,
        0.0027047114799999992,
        0.0032747454799999997,
        0.00286839548,
        0.00232258748,
        0.003328358479999999,
        0.0030661974799999986,
        0.00222135948,
        0.003475433479999999,
        0.0027633664799999987,
        0.0038459974799999993,
        0.0029451634799999996,
        0.0010001494799999995,
        0.004680942479999999,
        0.00446446148,
        0.0034744934799999993,
        0.00130099548,
        0.00530473548,
        0.001373605479999999,
        0.00448579748,
        0.0006913134799999996,
        0.003233576479999999,
        0.0014843444799999992,
        0.0027879194799999988,
        0.00467822248,
        0.00519797148,
        0.0007495554799999997,
        0.003554540479999999,
        0.00374280048,
        0.00138158548,
        0.003385608479999999,
        0.00505285048,
        0.0033502174799999998,
        0.0016289154799999988,
        0.0030250154799999996,
        0.0018610514799999997,
        0.002800001479999999,
        0.0014261494799999988,
        0.0035431414800000003,
        0.002312744479999999,
        0.0028703344799999994,
        0.004686558479999999,
        0.00540955648,
        0.0016199874799999988,
        0.0024779784799999994,
        0.001722780479999999,
        0.00198652548,
        0.00127998848,
        0.0017659134799999998,
        0.00352078748,
        0.0019464574799999993,
        0.0023764554800000002,
        0.0020069484799999987,
        0.0025029054799999987,
        0.0041082244799999995,
        0.0011285784799999988,
        0.0031425674799999996,
        0.0007446034799999989,
        0.002025364479999999,
        0.0010143024799999989,
        0.002545248479999999,
        0.00381759348,
        0.00102744348,
        0.0025605234799999993,
        0.0007117864799999997,
        0.002430385479999999,
        0.0009961094799999992,
        0.0031297404799999996,
        0.0,
        0.0029147214799999993,
        0.00294413448,
        0.001029284479999999,
        0.00261732348,
        0.0029250664799999994,
        0.0030742324799999986,
        0.0011431594800000002,
        0.00272858448,
        0.0019006954799999998,
        0.002246991479999999,
        0.00286066348,
        0.0012009774799999996,
        0.0027968414800000002,
        0.0006900084799999996,
        0.0018632704799999992,
        0.00006425447999999952,
        0.003943577479999999,
        0.004655091479999999,
        0.00222839248,
        0.0016615054799999996,
        0.0021515274799999992,
        0.0001814524799999993,
        0.0017998604799999993,
        0.00261755748,
        0.0016025534799999986,
        0.0037111784799999997,
        0.0009923214799999998,
        0.0015383464800000001,
        0.0007411224799999993,
        0.00091164848,
        0.0015107924799999993,
        0.0003857404799999997,
        0.0
      ],
      "exit_codes": [
        0,
        0,
        0,
        0,
        0,
        0,
        0,
        0,
        0,
        0,
        0,
        0,
        0,
        0,
        0,
        0,
        0,
        0,
        0,
        0,
        0,
        0,
        0,
        0,
        0,
        0,
        0,
        0,
        0,
        0,
        0,
        0,
        0,
        0,
        0,
        0,
        0,
        0,
        0,
        0,
        0,
        0,
        0,
        0,
        0,
        0,
        0,
        0,
        0,
        0,
        0,
        0,
        0,
        0,
        0,
        0,
        0,
        0,
        0,
        0,
        0,
        0,
        0,
        0,
        0,
        0,
        0,
        0,
        0,
        0,
        0,
        0,
        0,
        0,
        0,
        0,
        0,
        0,
        0,
        0,
        0,
        0,
        0,
        0,
        0,
        0,
        0,
        0,
        0,
        0,
        0,
        0,
        0,
        0,
        0,
        0,
        0,
        0,
        0,
        0,
        0,
        0,
        0,
        0,
        0,
        0,
        0,
        0,
        0,
        0,
        0,
        0,
        0,
        0,
        0,
        0,
        0,
        0,
        0,
        0,
        0,
        0,
        0,
        0,
        0,
        0,
        0,
        0,
        0,
        0,
        0,
        0,
        0,
        0,
        0,
        0,
        0,
        0,
        0,
        0,
        0,
        0,
        0,
        0,
        0,
        0,
        0,
        0,
        0,
        0,
        0,
        0,
        0,
        0,
        0,
        0,
        0,
        0,
        0,
        0,
        0,
        0,
        0,
        0,
        0,
        0,
        0,
        0,
        0,
        0,
        0,
        0,
        0,
        0,
        0,
        0,
        0,
        0,
        0,
        0,
        0,
        0,
        0,
        0,
        0,
        0,
        0,
        0,
        0,
        0,
        0,
        0,
        0,
        0,
        0,
        0,
        0,
        0,
        0,
        0,
        0,
        0,
        0,
        0,
        0,
        0,
        0,
        0,
        0,
        0,
        0,
        0,
        0,
        0,
        0,
        0,
        0,
        0,
        0,
        0,
        0,
        0,
        0,
        0,
        0,
        0,
        0,
        0,
        0,
        0,
        0,
        0,
        0,
        0,
        0,
        0,
        0,
        0,
        0,
        0,
        0,
        0,
        0,
        0,
        0,
        0,
        0,
        0,
        0,
        0,
        0,
        0,
        0,
        0,
        0,
        0,
        0,
        0,
        0,
        0,
        0,
        0,
        0,
        0,
        0,
        0,
        0,
        0,
        0,
        0,
        0,
        0,
        0,
        0,
        0,
        0,
        0,
        0,
        0,
        0,
        0,
        0,
        0,
        0,
        0,
        0,
        0,
        0,
        0,
        0,
        0,
        0,
        0,
        0,
        0,
        0,
        0,
        0,
        0,
        0,
        0,
        0,
        0,
        0,
        0,
        0,
        0,
        0,
        0,
        0,
        0,
        0,
        0,
        0,
        0,
        0,
        0,
        0,
        0,
        0,
        0,
        0,
        0,
        0,
        0,
        0,
        0,
        0,
        0,
        0,
        0,
        0,
        0,
        0,
        0,
        0,
        0,
        0,
        0,
        0,
        0,
        0,
        0,
        0,
        0,
        0,
        0,
        0
      ]
    },
    {
      "command": "OCaml/fib_binet+flambda",
      "mean": 0.002079346902120342,
      "stddev": 0.001271782770372205,
      "median": 0.0020090644799999986,
      "user": 0.0015364209742120348,
      "system": 0.0014486167908309448,
      "min": 0.0,
      "max": 0.0062368944800000005,
      "times": [
        0.0011525934799999993,
        0.0015923474799999998,
        0.0016595844799999994,
        0.001010983479999999,
        0.0014815474799999987,
        0.0015481544800000002,
        0.0026386354799999992,
        0.0010077434799999991,
        0.0019828104799999987,
        0.0009341444799999985,
        0.0038401934799999994,
        0.000050004479999999144,
        0.002113943479999999,
        0.0008736484800000001,
        0.0025353104799999996,
        0.0003811724799999989,
        0.0029421334800000002,
        0.0017803874799999985,
        0.0010296004799999993,
        0.0016961034799999998,
        0.0015593674799999997,
        0.0028493244799999993,
        0.000977327479999999,
        0.00156808748,
        0.0006348004799999986,
        0.002995978479999999,
        0.004718029479999999,
        0.0012720434799999994,
        0.0024573024799999987,
        0.0014540994799999993,
        0.003056530479999999,
        0.0020083324799999988,
        0.0021245684799999992,
        0.0014416754799999989,
        0.0007751344799999992,
        0.00151606748,
        0.001723927479999999,
        0.003702805479999999,
        0.0004214534799999994,
        0.00257362248,
        0.0011121214799999996,
        0.003196974479999999,
        0.0015494194799999987,
        0.002125106479999999,
        0.0017660934799999988,
        0.00242049648,
        0.00145791448,
        0.0021693304799999995,
        0.0011716884799999995,
        0.002287895479999999,
        0.0012518504799999995,
        0.0028259064800000002,
        0.0007556104799999993,
        0.0023487314799999987,
        0.004216601479999999,
        0.003012710479999999,
        0.0015801174799999996,
        0.00496851548,
        0.0029672314799999997,
        0.0031632364799999988,
        0.0026920454799999995,
        0.005216794479999999,
        0.0031764954799999986,
        0.0034259584799999987,
        0.004439666479999999,
        0.003235722479999999,
        0.00528064048,
        0.0014323754799999986,
        0.002762446479999999,
        0.0019407924799999992,
        0.0005937044799999994,
        0.0018567804799999995,
        0.0011915184799999997,
        0.002810735479999999,
        0.002663617479999999,
        0.0022543144799999993,
        0.0,
        0.00393465448,
        0.0013554014799999998,
        0.00246204548,
        0.0029594304799999997,
        0.0009047864800000001,
        0.00317178948,
        0.0012416374799999992,
        0.0037929914799999997,
        0.0003655724799999996,
        0.0012339294799999989,
        0.0034736094799999997,
        0.0014235384799999992,
        0.0033506264799999996,
        0.0014899404799999993,
        0.0046091284799999995,
        0.0005374694799999994,
        0.0035408194799999996,
        0.00202439048,
        0.0027709564799999987,
        0.00488574448,
        0.00341088448,
        0.00012384847999999914,
        0.0024983114800000003,
        0.0024172804799999998,
        0.003037204479999999,
        0.00024977147999999914,
        0.00243518248,
        0.0010098024799999996,
        0.0021119284799999997,
        0.005391125479999999,
        0.0027958274799999997,
        0.0023019784799999986,
        0.00321670748,
        0.001135492479999999,
        0.002794194479999999,
        0.00140942148,
        0.00249800848,
        0.00014460547999999886,
        0.0034837734799999997,
        0.0011777924799999994,
        0.0019361064799999989,
        0.0014997124799999992,
        0.0025210074799999994,
        0.0021324184799999995,
        0.0004809594799999985,
        0.0035093614799999997,
        0.0009150544799999992,
        0.00009547147999999957,
        0.0020067444800000002,
        0.0,
        0.0016179224799999998,
        0.0,
        0.0027256514799999998,
        0.00198925148,
        0.002697649479999999,
        0.00050157148,
        0.00356283048,
        0.003994176479999999,
        0.004207275479999999,
        0.0012675574799999997,
        0.00241656848,
        0.0,
        0.002663426479999999,
        0.0018815084799999994,
        0.0020613924799999994,
        0.0008515044800000001,
        0.00331008848,
        0.0018925594799999992,
        0.0,
        0.0014735934799999994,
        0.0,
        0.0015813014799999992,
        0.0033524244799999986,
        0.0018407594799999998,
        0.00147721448,
        0.0027521664799999993,
        0.00016312647999999937,
        0.00233690048,
        0.0015315864799999987,
        0.00210830948,
        0.0001600214799999996,
        0.00563926148,
        0.0009153224799999986,
        0.000023877479999999222,
        0.0017056174800000002,
        0.0,
        0.00154436148,
        0.0010680904799999997,
        0.0028483944799999996,
        0.0001655384799999996,
        0.0039038734799999994,
        0.00437784748,
        0.0008043274799999995,
        0.00426287848,
        0.0012436574799999994,
        0.00320789148,
        0.0,
        0.00336476748,
        0.0015692614799999996,
        0.0024982434799999996,
        0.0,
        0.0,
        0.0020335584800000002,
        0.0,
        0.0028742674799999987,
        0.002472669479999999,
        0.00456570248,
        0.0012869334799999995,
        0.00414415048,
        0.0024269174799999996,
        0.0006974384799999988,
        0.003993317479999999,
        0.0001388504799999992,
        0.002077186479999999,
        0.0013530094799999995,
        0.003464672479999999,
        0.00015455147999999912,
        0.00288954048,
        0.002535054479999999,
        0.0020565444799999994,
        6.248479999999314e-6,
        0.0016489294799999993,
        0.0,
        0.001764135479999999,
        0.00416907948,
        0.0036609684799999995,
        0.001530633479999999,
        0.002059705479999999,
        0.00342267348,
        0.003079244479999999,
        0.00005281847999999943,
        0.0023309364799999994,
        0.0016591504799999988,
        0.0027311934799999988,
        0.00023471347999999906,
        0.0019355664799999986,
        0.0012210834799999985,
        0.0028434574799999996,
        0.0006698914799999995,
        0.0024210394799999988,
        0.0011324954799999997,
        0.00386985048,
        0.001023533479999999,
        0.003462649479999999,
        0.00046718048,
        0.0022205364799999993,
        0.00014233747999999914,
        0.0024769104799999995,
        0.004932251479999999,
        0.00389322048,
        0.0007747004799999986,
        0.0025731724799999993,
        0.0033944514799999987,
        0.00336742748,
        0.0,
        0.003011260479999999,
        0.0014120154799999998,
        0.002769561479999999,
        0.0013603724799999993,
        0.0049720634799999995,
        0.0009925984799999997,
        0.00198226448,
        0.0013246864799999992,
        0.00348268848,
        0.004221209479999999,
        0.0031246984799999994,
        0.00110239848,
        0.00286050848,
        0.0011126924799999991,
        0.0029841714799999997,
        0.001564846479999999,
        0.0022871444799999986,
        0.00182156148,
        0.0029987884799999994,
        0.001033964479999999,
        0.00364619648,
        0.00014731647999999958,
        0.003432229479999999,
        0.00428124548,
        0.0035287784799999987,
        0.0014707314800000001,
        0.0023500464799999987,
        0.0034099854799999997,
        0.002972548479999999,
        0.00021490847999999958,
        0.0021517524799999988,
        0.0000936424799999995,
        0.0002917074799999994,
        0.0010033994799999993,
        0.0013856614799999988,
        0.0005667074799999986,
        0.0010852214799999997,
        0.0010725484799999985,
        0.0030361434799999988,
        0.0032903954799999987,
        0.002075640479999999,
        0.0011419924799999986,
        0.0023848934799999997,
        0.00220777448,
        0.00039355447999999977,
        0.00284779748,
        0.00018415247999999888,
        0.0027217874799999988,
        0.0013563364799999986,
        0.003608903479999999,
        0.0013447074799999995,
        0.00247008048,
        0.0011232714799999993,
        0.0036356774799999993,
        0.00282767048,
        0.0034999164799999994,
        0.0038409944799999993,
        0.0023222554799999994,
        0.00160318348,
        0.00421560548,
        0.001333163479999999,
        0.0025350274799999994,
        0.00187965848,
        0.0007901414800000001,
        0.00268472148,
        0.0004806364799999985,
        0.0028159214799999997,
        0.0010140534799999998,
        0.002412964479999999,
        0.004664095479999999,
        0.0016364994799999985,
        0.0023529184799999997,
        0.0016739364799999998,
        0.0015829944799999997,
        0.0018745324799999989,
        0.00045206247999999855,
        0.0022361364799999986,
        0.0025644994800000003,
        0.0026112834799999997,
        0.0004410874799999987,
        0.002797160479999999,
        0.0008009164799999994,
        0.0019089334799999988,
        0.002760066479999999,
        0.0023811504799999992,
        0.0062368944800000005,
        0.004124489479999999,
        0.0020090644799999986,
        0.00260154048,
        0.0025259644799999993,
        0.0,
        0.0003454304799999997,
        0.00323648848,
        0.0019624284799999994,
        0.0013845694799999994,
        0.00271076748,
        0.003329498479999999,
        0.0018969724799999992,
        0.002310556479999999,
        0.0035008174799999988,
        0.0014832334799999994,
        0.0019563474799999996,
        0.0042852774799999995,
        0.0020345744799999997,
        0.0,
        0.0015179464799999999,
        0.0,
        0.0016039044799999987,
        0.0009915634799999998,
        0.0015030734799999996,
        0.0026286654799999995,
        0.0034566694799999997,
        0.00197123048,
        0.0022411044799999997,
        0.001357558479999999,
        0.0019391044799999995,
        0.0006356864799999988
      ],
      "exit_codes": [
        0,
        0,
        0,
        0,
        0,
        0,
        0,
        0,
        0,
        0,
        0,
        0,
        0,
        0,
        0,
        0,
        0,
        0,
        0,
        0,
        0,
        0,
        0,
        0,
        0,
        0,
        0,
        0,
        0,
        0,
        0,
        0,
        0,
        0,
        0,
        0,
        0,
        0,
        0,
        0,
        0,
        0,
        0,
        0,
        0,
        0,
        0,
        0,
        0,
        0,
        0,
        0,
        0,
        0,
        0,
        0,
        0,
        0,
        0,
        0,
        0,
        0,
        0,
        0,
        0,
        0,
        0,
        0,
        0,
        0,
        0,
        0,
        0,
        0,
        0,
        0,
        0,
        0,
        0,
        0,
        0,
        0,
        0,
        0,
        0,
        0,
        0,
        0,
        0,
        0,
        0,
        0,
        0,
        0,
        0,
        0,
        0,
        0,
        0,
        0,
        0,
        0,
        0,
        0,
        0,
        0,
        0,
        0,
        0,
        0,
        0,
        0,
        0,
        0,
        0,
        0,
        0,
        0,
        0,
        0,
        0,
        0,
        0,
        0,
        0,
        0,
        0,
        0,
        0,
        0,
        0,
        0,
        0,
        0,
        0,
        0,
        0,
        0,
        0,
        0,
        0,
        0,
        0,
        0,
        0,
        0,
        0,
        0,
        0,
        0,
        0,
        0,
        0,
        0,
        0,
        0,
        0,
        0,
        0,
        0,
        0,
        0,
        0,
        0,
        0,
        0,
        0,
        0,
        0,
        0,
        0,
        0,
        0,
        0,
        0,
        0,
        0,
        0,
        0,
        0,
        0,
        0,
        0,
        0,
        0,
        0,
        0,
        0,
        0,
        0,
        0,
        0,
        0,
        0,
        0,
        0,
        0,
        0,
        0,
        0,
        0,
        0,
        0,
        0,
        0,
        0,
        0,
        0,
        0,
        0,
        0,
        0,
        0,
        0,
        0,
        0,
        0,
        0,
        0,
        0,
        0,
        0,
        0,
        0,
        0,
        0,
        0,
        0,
        0,
        0,
        0,
        0,
        0,
        0,
        0,
        0,
        0,
        0,
        0,
        0,
        0,
        0,
        0,
        0,
        0,
        0,
        0,
        0,
        0,
        0,
        0,
        0,
        0,
        0,
        0,
        0,
        0,
        0,
        0,
        0,
        0,
        0,
        0,
        0,
        0,
        0,
        0,
        0,
        0,
        0,
        0,
        0,
        0,
        0,
        0,
        0,
        0,
        0,
        0,
        0,
        0,
        0,
        0,
        0,
        0,
        0,
        0,
        0,
        0,
        0,
        0,
        0,
        0,
        0,
        0,
        0,
        0,
        0,
        0,
        0,
        0,
        0,
        0,
        0,
        0,
        0,
        0,
        0,
        0,
        0,
        0,
        0,
        0,
        0,
        0,
        0,
        0,
        0,
        0,
        0,
        0,
        0,
        0,
        0,
        0,
        0,
        0,
        0,
        0,
        0,
        0,
        0,
        0,
        0,
        0,
        0,
        0,
        0,
        0,
        0,
        0,
        0,
        0,
        0,
        0,
        0,
        0,
        0,
        0
      ]
    },
    {
      "command": "OCaml/fib_binet_opt+flambda",
      "mean": 0.0021469052164935043,
      "stddev": 0.0013553077935001185,
      "median": 0.002191196979999999,
      "user": 0.0016011740259740269,
      "system": 0.0014032176623376613,
      "min": 0.0,
      "max": 0.005875029479999999,
      "times": [
        0.0023062084799999995,
        0.0014732244799999994,
        0.0012475234799999993,
        0.0024565744800000002,
        0.0013078904799999997,
        0.00385670348,
        0.000027119479999998877,
        0.00331203648,
        0.0019009064799999998,
        0.00380860648,
        0.0012393624799999997,
        0.0023374434799999988,
        0.00180986148,
        0.00525592248,
        0.0024588264799999997,
        0.0013055674799999995,
        0.00213565048,
        0.0016747924799999985,
        0.00261323348,
        0.0009857964799999995,
        0.002222425479999999,
        0.0013706114799999997,
        0.003252329479999999,
        0.0005452754799999985,
        0.0029721914799999997,
        0.004878538479999999,
        0.0033170284800000003,
        0.002975343479999999,
        0.0009990474800000001,
        0.0026782104799999993,
        0.003341557479999999,
        0.0023005294799999998,
        0.0015523364799999986,
        0.00199379248,
        0.00174476448,
        0.0024626494799999997,
        0.0012127364799999997,
        0.002577895479999999,
        0.00108269648,
        0.0027282724799999993,
        0.00041473247999999994,
        0.002752180479999999,
        0.002591691479999999,
        0.0011627374799999994,
        0.002186897479999999,
        0.00023189647999999948,
        0.00182401348,
        0.003707986479999999,
        0.001821820479999999,
        0.00441189548,
        0.002722719479999999,
        0.0027433594799999997,
        0.0007802584799999996,
        0.0038897194799999988,
        0.002632861479999999,
        0.002394040479999999,
        0.0007521444799999987,
        0.00187407548,
        0.0009679704799999992,
        0.0,
        0.00038391747999999906,
        0.0011991814799999995,
        0.002033178479999999,
        0.00428072448,
        0.001381195479999999,
        0.00424151948,
        0.0037132634800000003,
        0.0015822584799999985,
        0.0008938254799999998,
        0.0029736094799999993,
        0.00011290147999999927,
        0.0004165174799999989,
        0.0003482204799999996,
        0.0005248954799999999,
        0.0,
        0.0002797384799999997,
        0.0,
        0.0024302894799999994,
        0.0030942814799999998,
        0.003932513479999999,
        0.0006780524799999991,
        0.0025693224799999996,
        0.002656610479999999,
        0.0,
        0.0008007774799999997,
        0.0006272634800000001,
        0.0013393374800000002,
        0.0025048794799999987,
        0.0007077204799999992,
        0.0037958654799999996,
        0.00040971948000000005,
        0.0026943884799999996,
        0.001175545479999999,
        0.0011532684799999996,
        0.0012705554799999986,
        0.0036406224800000003,
        0.0012182314799999991,
        0.003524351479999999,
        0.00465660848,
        0.0029980284799999988,
        0.0021727894799999986,
        0.0030092244800000003,
        0.0014821584799999997,
        0.00430716048,
        0.00041745347999999887,
        0.0032938904799999997,
        0.00117724748,
        0.00499463748,
        0.0012428484800000002,
        0.00312601248,
        0.0006440514799999986,
        0.005875029479999999,
        0.00236331248,
        0.00543040548,
        0.002975488479999999,
        0.00003965247999999921,
        0.00015768047999999927,
        0.0018908484799999995,
        0.0011010674799999997,
        0.0024705744799999986,
        0.0017938734799999986,
        0.004612236479999999,
        0.001987064479999999,
        0.00117498648,
        0.0038418524799999987,
        0.0002896904799999994,
        0.0015662834799999989,
        0.00478174748,
        0.00371562348,
        0.0021601584799999995,
        0.002354610479999999,
        0.00444560748,
        0.0016071264799999993,
        0.00313261048,
        0.0009079324799999991,
        0.001780498479999999,
        0.0014397844800000002,
        0.002345682479999999,
        0.0008326304799999998,
        0.0006319114799999996,
        0.0,
        0.0002260864799999993,
        0.0,
        0.0006536104799999996,
        0.0012553674799999992,
        0.0006259234799999994,
        0.001326578479999999,
        0.0011506104799999988,
        0.004402843479999999,
        0.000023755479999999253,
        0.002143562479999999,
        0.0,
        0.00220825548,
        0.0,
        0.00316352748,
        0.002195496479999999,
        0.002729663479999999,
        0.0029107064799999997,
        0.0017460494800000002,
        0.0032708834799999994,
        0.00101633048,
        0.00343311148,
        0.0011366334799999987,
        0.0019437004799999985,
        0.0,
        0.0017638604799999997,
        0.0,
        0.0015058424799999992,
        0.00074313148,
        0.004062464479999999,
        0.00034442447999999924,
        0.0018686644799999997,
        0.0014786724799999993,
        0.002985052479999999,
        5.2224799999989885e-6,
        0.0018538934799999995,
        0.005644711479999999,
        0.0007925654799999992,
        0.002835697479999999,
        0.004569557479999999,
        0.00379230548,
        0.0005069364799999984,
        0.00043229647999999937,
        0.0023208464799999986,
        0.0018517244799999997,
        0.00185598848,
        0.0022145384799999992,
        0.0,
        0.00071488048,
        0.0014387874799999993,
        0.00364919548,
        0.000052491479999998945,
        0.0011074404800000002,
        0.002891605479999999,
        0.00010068047999999951,
        0.00012155147999999907,
        0.00144275448,
        0.0012366584799999988,
        0.0,
        0.0020160134799999995,
        0.0032582084799999992,
        0.0013450124799999985,
        0.0,
        0.003659466479999999,
        0.0,
        0.0016519334800000002,
        0.0011610744799999987,
        0.0027702724799999997,
        0.0,
        0.002664952479999999,
        0.004072990479999999,
        0.0028561794799999993,
        0.002253036479999999,
        0.001976989479999999,
        0.004312853479999999,
        0.002982791479999999,
        0.00495651048,
        0.0015140654799999992,
        0.0032370194799999997,
        0.0,
        0.003012473479999999,
        0.002572645479999999,
        0.002120202479999999,
        0.00003958647999999926,
        0.0018231414799999993,
        0.00293025248,
        0.00398021048,
        0.0037548784799999986,
        0.00334705948,
        0.002655394479999999,
        0.00144666948,
        0.0030595694799999988,
        0.0034280974799999987,
        0.00227885648,
        0.000246899479999999,
        0.002002571479999999,
        0.0000812714799999989,
        0.002344713479999999,
        0.0031393494800000003,
        0.005717547479999999,
        0.00138891548,
        0.0012093204799999988,
        0.002986753479999999,
        0.0,
        0.003133248479999999,
        0.0020398584799999992,
        0.00441692048,
        0.00325653948,
        0.00006759747999999892,
        0.0035453384799999993,
        0.00296819348,
        0.00276865048,
        0.0017911414799999985,
        0.003810015479999999,
        0.004022563479999999,
        0.0032142134799999994,
        0.00140248048,
        0.0033924004799999992,
        0.003037135479999999,
        0.0030272664799999996,
        0.0009999864799999985,
        0.002527817479999999,
        0.00339138048,
        0.003037537479999999,
        0.0033622444799999993,
        0.00349499448,
        0.001352456479999999,
        0.0013512034799999994,
        0.0025186064799999986,
        0.0006376274799999989,
        0.0023058774800000003,
        0.00023169147999999896,
        0.0025262554799999988,
        0.00502001448,
        0.0033482354799999987,
        0.00339601448,
        0.00303759448,
        0.00378227648,
        0.0031119074799999995,
        0.00353423348,
        0.003586001479999999,
        0.0031059964799999987,
        0.0022851614799999998,
        0.0027749114799999986,
        0.00008518347999999891,
        0.00135100148,
        0.0009104364799999995,
        0.0036004344800000003,
        0.002774040479999999,
        0.001864147479999999,
        0.003491579479999999,
        0.0027802124799999996,
        0.0032253214799999987,
        0.0038700064799999994,
        0.0026643024799999993,
        0.0030645314799999995,
        0.003157580479999999,
        0.002512175479999999,
        0.003772216479999999,
        0.0031546414799999986,
        0.0009694074799999992,
        0.002678698479999999,
        0.0022863764799999986,
        0.0009055814799999997,
        0.0019757984799999998,
        0.0012115994799999997,
        0.00368595548,
        0.00323798748
      ],
      "exit_codes": [
        0,
        0,
        0,
        0,
        0,
        0,
        0,
        0,
        0,
        0,
        0,
        0,
        0,
        0,
        0,
        0,
        0,
        0,
        0,
        0,
        0,
        0,
        0,
        0,
        0,
        0,
        0,
        0,
        0,
        0,
        0,
        0,
        0,
        0,
        0,
        0,
        0,
        0,
        0,
        0,
        0,
        0,
        0,
        0,
        0,
        0,
        0,
        0,
        0,
        0,
        0,
        0,
        0,
        0,
        0,
        0,
        0,
        0,
        0,
        0,
        0,
        0,
        0,
        0,
        0,
        0,
        0,
        0,
        0,
        0,
        0,
        0,
        0,
        0,
        0,
        0,
        0,
        0,
        0,
        0,
        0,
        0,
        0,
        0,
        0,
        0,
        0,
        0,
        0,
        0,
        0,
        0,
        0,
        0,
        0,
        0,
        0,
        0,
        0,
        0,
        0,
        0,
        0,
        0,
        0,
        0,
        0,
        0,
        0,
        0,
        0,
        0,
        0,
        0,
        0,
        0,
        0,
        0,
        0,
        0,
        0,
        0,
        0,
        0,
        0,
        0,
        0,
        0,
        0,
        0,
        0,
        0,
        0,
        0,
        0,
        0,
        0,
        0,
        0,
        0,
        0,
        0,
        0,
        0,
        0,
        0,
        0,
        0,
        0,
        0,
        0,
        0,
        0,
        0,
        0,
        0,
        0,
        0,
        0,
        0,
        0,
        0,
        0,
        0,
        0,
        0,
        0,
        0,
        0,
        0,
        0,
        0,
        0,
        0,
        0,
        0,
        0,
        0,
        0,
        0,
        0,
        0,
        0,
        0,
        0,
        0,
        0,
        0,
        0,
        0,
        0,
        0,
        0,
        0,
        0,
        0,
        0,
        0,
        0,
        0,
        0,
        0,
        0,
        0,
        0,
        0,
        0,
        0,
        0,
        0,
        0,
        0,
        0,
        0,
        0,
        0,
        0,
        0,
        0,
        0,
        0,
        0,
        0,
        0,
        0,
        0,
        0,
        0,
        0,
        0,
        0,
        0,
        0,
        0,
        0,
        0,
        0,
        0,
        0,
        0,
        0,
        0,
        0,
        0,
        0,
        0,
        0,
        0,
        0,
        0,
        0,
        0,
        0,
        0,
        0,
        0,
        0,
        0,
        0,
        0,
        0,
        0,
        0,
        0,
        0,
        0,
        0,
        0,
        0,
        0,
        0,
        0,
        0,
        0,
        0,
        0,
        0,
        0,
        0,
        0,
        0,
        0,
        0,
        0,
        0,
        0,
        0,
        0,
        0,
        0,
        0,
        0,
        0,
        0,
        0,
        0,
        0,
        0,
        0,
        0,
        0,
        0,
        0,
        0,
        0,
        0,
        0,
        0
      ]
    },
    {
      "command": "OCaml/fib_shift+flambda",
      "mean": 0.002317743406586345,
      "stddev": 0.0013850428299453043,
      "median": 0.0023324884799999996,
      "user": 0.001619411164658634,
      "system": 0.001570127871485943,
      "min": 0.0,
      "max": 0.0062039224799999996,
      "times": [
        0.004622223479999999,
        0.0017161724799999991,
        0.00413251648,
        0.0015482774799999996,
        0.0020241654799999986,
        0.00248011948,
        1.206479999999073e-6,
        0.00261153648,
        0.0011787484799999992,
        0.00309328248,
        0.005344352479999999,
        0.0032468604799999997,
        0.0021707804799999996,
        0.0029881924799999996,
        0.0009203404799999993,
        0.002533021479999999,
        0.002482395479999999,
        0.0022029864799999995,
        0.0062039224799999996,
        0.0015265394799999993,
        0.0026414444799999987,
        0.0012520744799999995,
        0.002634203479999999,
        0.0014945424799999987,
        0.000053377479999999235,
        0.0028035524799999998,
        0.002824521479999999,
        0.00317462048,
        0.0036540294800000003,
        0.001165447479999999,
        0.003803028479999999,
        0.0024522224799999994,
        0.003538460479999999,
        0.0014177224799999987,
        0.00302690948,
        0.0030806424799999987,
        0.00316791748,
        0.00243901548,
        0.0029260864800000003,
        0.0027399684799999996,
        0.00339679848,
        0.0028923494799999996,
        0.004129209479999999,
        0.0026034594799999996,
        0.00386510148,
        0.00329502048,
        0.0018818374799999997,
        0.00526327248,
        0.0010572474799999997,
        0.0054699614799999996,
        0.0034466424799999987,
        0.0037389654799999993,
        0.001516003479999999,
        0.000018064479999998877,
        0.0023516814800000002,
        0.0018891464800000002,
        0.0029360724799999986,
        0.00278119348,
        0.0002812334799999995,
        0.002594232479999999,
        0.0018455754799999993,
        0.002467423479999999,
        0.00019786347999999933,
        0.003891261479999999,
        0.0014239614799999986,
        0.0026091924799999987,
        0.0016839864799999991,
        0.002304021479999999,
        0.000991113479999999,
        0.0001724864799999993,
        0.0021444414799999994,
        0.002153851479999999,
        0.00569044748,
        0.00571738348,
        0.0010350234800000002,
        0.0011459204799999989,
        0.0,
        0.000045345479999999404,
        0.0006665184799999986,
        0.004200307479999999,
        0.004553191479999999,
        0.0007414584799999993,
        0.0017879514800000001,
        0.00019344347999999956,
        0.001206113479999999,
        0.000363571479999999,
        0.005412465479999999,
        0.0007875654799999994,
        0.0008940114799999991,
        0.00345388048,
        0.0020794974799999985,
        0.0011994004799999987,
        0.0005858494800000001,
        0.0030092374799999986,
        0.00251664948,
        0.00223542548,
        0.002217343479999999,
        0.002352306479999999,
        0.00123635948,
        0.0011454694799999986,
        0.001366305479999999,
        0.0030136704800000002,
        0.002455337479999999,
        0.0025339644799999986,
        0.0018619464799999987,
        0.0023691404799999994,
        0.0004033104799999994,
        0.0017032354799999998,
        0.004444448479999999,
        0.0010067734799999997,
        0.0016723194799999992,
        0.003396883479999999,
        0.0027490024799999993,
        0.0013409884799999985,
        0.00516968048,
        0.0018996354799999992,
        0.002788874479999999,
        0.00409575548,
        0.00259411248,
        0.00272260248,
        0.00453470748,
        0.004098578479999999,
        0.0015985954800000002,
        0.002040481479999999,
        0.0036494614799999986,
        0.00224251148,
        0.0012982974799999993,
        0.002003652479999999,
        0.0038718554799999994,
        0.0002142084799999994,
        0.0021254414799999994,
        0.0030690824799999997,
        0.00217584548,
        0.0035020834800000003,
        0.00302436548,
        0.00341323748,
        0.00406307948,
        0.0021535224799999987,
        0.00306126748,
        0.0017807214799999997,
        0.0028758264799999987,
        0.0013915074799999991,
        0.0018671624799999993,
        0.002526538479999999,
        0.0035777674799999997,
        0.00190833448,
        0.00357003548,
        0.0024589634799999987,
        0.003209115479999999,
        0.0006319144799999997,
        0.0017374754799999994,
        0.0025897654799999998,
        0.0,
        0.0,
        0.0,
        0.0,
        0.0003110654799999991,
        0.0012671064799999994,
        0.0028794944799999988,
        0.0033123764799999995,
        0.0010178354799999989,
        0.005765545479999999,
        0.003430163479999999,
        0.00159089048,
        0.0,
        0.0011772694799999988,
        0.0,
        0.0017511424799999996,
        0.00112135848,
        0.0028659444799999994,
        0.0030625444799999993,
        0.0038563474800000002,
        0.00242191048,
        0.0028329734799999997,
        0.0033979694799999996,
        0.0025217914799999996,
        0.00199176948,
        0.0034208714799999996,
        0.0007100154799999986,
        0.0016769934799999988,
        0.0024225984799999987,
        0.003172955479999999,
        0.0008767014799999995,
        0.002236412479999999,
        0.004765561479999999,
        0.0024719684799999987,
        0.001275333479999999,
        0.0025393794800000003,
        0.0013420054799999992,
        0.00416707848,
        0.003325220479999999,
        0.00285160348,
        0.001360343479999999,
        0.0031432594799999996,
        0.00170037448,
        0.0014239254800000002,
        0.00196204848,
        0.00304167148,
        0.0012419744799999988,
        0.0022311714799999995,
        0.0033342604799999993,
        0.0,
        0.00161992248,
        0.0006902034799999993,
        0.0053170234799999995,
        0.000165994479999999,
        0.0016496304799999998,
        0.0038967694800000003,
        0.00273637848,
        0.00524576548,
        0.0037781824799999987,
        0.004375791479999999,
        0.0030034224799999993,
        0.0036577634800000003,
        0.00162594048,
        0.002577836479999999,
        0.001938716479999999,
        0.00539100448,
        0.0016042534799999989,
        0.0023324884799999996,
        0.002927021479999999,
        0.0015289134799999987,
        0.002939980479999999,
        0.004166994479999999,
        0.00529611848,
        0.0031282034800000002,
        0.0030455824799999988,
        0.0,
        0.0029345034799999987,
        0.004137083479999999,
        0.0015045894799999996,
        0.0006841294799999993,
        0.0,
        0.0015334054799999988,
        0.0,
        0.001760022479999999,
        0.0006956074799999998,
        0.004510916479999999,
        0.00242516348,
        0.001853637479999999,
        0.0018645104799999987,
        0.0001688664799999991,
        0.0001362424799999989,
        0.0015860224800000001,
        0.0000998314799999997,
        0.0014861174799999993,
        0.0003751514799999996,
        0.0020774984799999995,
        0.0004400494799999986
      ],
      "exit_codes": [
        0,
        0,
        0,
        0,
        0,
        0,
        0,
        0,
        0,
        0,
        0,
        0,
        0,
        0,
        0,
        0,
        0,
        0,
        0,
        0,
        0,
        0,
        0,
        0,
        0,
        0,
        0,
        0,
        0,
        0,
        0,
        0,
        0,
        0,
        0,
        0,
        0,
        0,
        0,
        0,
        0,
        0,
        0,
        0,
        0,
        0,
        0,
        0,
        0,
        0,
        0,
        0,
        0,
        0,
        0,
        0,
        0,
        0,
        0,
        0,
        0,
        0,
        0,
        0,
        0,
        0,
        0,
        0,
        0,
        0,
        0,
        0,
        0,
        0,
        0,
        0,
        0,
        0,
        0,
        0,
        0,
        0,
        0,
        0,
        0,
        0,
        0,
        0,
        0,
        0,
        0,
        0,
        0,
        0,
        0,
        0,
        0,
        0,
        0,
        0,
        0,
        0,
        0,
        0,
        0,
        0,
        0,
        0,
        0,
        0,
        0,
        0,
        0,
        0,
        0,
        0,
        0,
        0,
        0,
        0,
        0,
        0,
        0,
        0,
        0,
        0,
        0,
        0,
        0,
        0,
        0,
        0,
        0,
        0,
        0,
        0,
        0,
        0,
        0,
        0,
        0,
        0,
        0,
        0,
        0,
        0,
        0,
        0,
        0,
        0,
        0,
        0,
        0,
        0,
        0,
        0,
        0,
        0,
        0,
        0,
        0,
        0,
        0,
        0,
        0,
        0,
        0,
        0,
        0,
        0,
        0,
        0,
        0,
        0,
        0,
        0,
        0,
        0,
        0,
        0,
        0,
        0,
        0,
        0,
        0,
        0,
        0,
        0,
        0,
        0,
        0,
        0,
        0,
        0,
        0,
        0,
        0,
        0,
        0,
        0,
        0,
        0,
        0,
        0,
        0,
        0,
        0,
        0,
        0,
        0,
        0,
        0,
        0,
        0,
        0,
        0,
        0,
        0,
        0,
        0,
        0,
        0,
        0,
        0,
        0,
        0,
        0,
        0,
        0,
        0,
        0,
        0,
        0,
        0,
        0,
        0,
        0,
        0,
        0,
        0,
        0,
        0,
        0,
        0,
        0,
        0,
        0,
        0,
        0
      ]
    },
    {
      "command": "MLton/fib",
      "mean": 12.27254150288,
      "stddev": 0.03290882252701717,
      "median": 12.266315842480001,
      "user": 12.24098394,
      "system": 0.004804941999999999,
      "min": 12.23123510048,
      "max": 12.33090569648,
      "times": [
        12.322042783479999,
        12.23609088548,
        12.27148098548,
        12.33090569648,
        12.28731796848,
        12.26991821348,
        12.252370682479999,
        12.26271347148,
        12.23123510048,
        12.26133924148
      ],
      "exit_codes": [
        0,
        0,
        0,
        0,
        0,
        0,
        0,
        0,
        0,
        0
      ]
    },
    {
      "command": "MLton/fib+native+O3",
      "mean": 11.60797761868,
      "stddev": 0.027896074210739814,
      "median": 11.61530001948,
      "user": 11.578879539999999,
      "system": 0.003640679999999998,
      "min": 11.56777504148,
      "max": 11.65509320548,
      "times": [
        11.62335100748,
        11.61552104648,
        11.56777504148,
        11.628849170479999,
        11.586137171479999,
        11.65509320548,
        11.572797442479999,
        11.62593514448,
        11.589237964479999,
        11.615078992479999
      ],
      "exit_codes": [
        0,
        0,
        0,
        0,
        0,
        0,
        0,
        0,
        0,
        0
      ]
    },
    {
      "command": "MLton/fib-mlkit",
      "mean": 21.51874749908,
      "stddev": 0.0782975542976519,
      "median": 21.51293324448,
      "user": 21.478551039999996,
      "system": 0.0034834799999999984,
      "min": 21.41256176748,
      "max": 21.65593613148,
      "times": [
        21.41256176748,
        21.486238271479998,
        21.65593613148,
        21.52193830048,
        21.551887652479998,
        21.42660788948,
        21.452747294479998,
        21.60020860748,
        21.50392818848,
        21.57542088748
      ],
      "exit_codes": [
        0,
        0,
        0,
        0,
        0,
        0,
        0,
        0,
        0,
        0
      ]
    },
    {
      "command": "MLton/fib-mlkit-ngc",
      "mean": 4.62498637028,
      "stddev": 0.03332402947286737,
      "median": 4.611148010980001,
      "user": 4.615535239999999,
      "system": 0.0016317039999999994,
      "min": 4.59622048048,
      "max": 4.691181392480001,
      "times": [
        4.691181392480001,
        4.672309519480001,
        4.64421829948,
        4.620081505480001,
        4.606339960480001,
        4.60346157848,
        4.61595606148,
        4.6028137544800005,
        4.597281150480001,
        4.59622048048
      ],
      "exit_codes": [
        0,
        0,
        0,
        0,
        0,
        0,
        0,
        0,
        0,
        0
      ]
    },
    {
      "command": "PolyML/fib",
      "mean": 6.0563000138800005,
      "stddev": 0.040548595383762986,
      "median": 6.04672589198,
      "user": 6.037708139999998,
      "system": 0.005286204,
      "min": 6.01225553248,
      "max": 6.11907977148,
      "times": [
        6.01225553248,
        6.02268921248,
        6.11620655948,
        6.02043963048,
        6.08826654848,
        6.11907977148,
        6.03071348048,
        6.062738303480001,
        6.067126384480001,
        6.02348471548
      ],
      "exit_codes": [
        0,
        0,
        0,
        0,
        0,
        0,
        0,
        0,
        0,
        0
      ]
    },
    {
      "command": "Rust/fib",
      "mean": 2.6592437588799998,
      "stddev": 0.013230728639060219,
      "median": 2.65466486398,
      "user": 2.65278364,
      "system": 0.0017307039999999991,
      "min": 2.64566151648,
      "max": 2.68006422048,
      "times": [
        2.67539169048,
        2.64720925648,
        2.66654542348,
        2.64816297348,
        2.65356873248,
        2.65576099548,
        2.64566151648,
        2.67288601148,
        2.64718676848,
        2.68006422048
      ],
      "exit_codes": [
        0,
        0,
        0,
        0,
        0,
        0,
        0,
        0,
        0,
        0
      ]
    },
    {
      "command": "Dylan/_build/bin/fib",
      "mean": 5.678316790279999,
      "stddev": 0.016441170105476445,
      "median": 5.67509779798,
      "user": 5.6623182399999985,
      "system": 0.004317679999999999,
      "min": 5.66660333248,
      "max": 5.723193435480001,
      "times": [
        5.671497132480001,
        5.6692940504800005,
        5.678690656480001,
        5.66660333248,
        5.67902828648,
        5.677830170480001,
        5.6746853894800005,
        5.723193435480001,
        5.67551020648,
        5.66683524248
      ],
      "exit_codes": [
        0,
        0,
        0,
        0,
        0,
        0,
        0,
        0,
        0,
        0
      ]
    },
    {
      "command": "Go/fib",
      "mean": 4.277626666480002,
      "stddev": 0.04824683012903683,
      "median": 4.27259876898,
      "user": 4.267649239999999,
      "system": 0.006965479999999999,
      "min": 4.1812077184800005,
      "max": 4.35259481948,
      "times": [
        4.261871135480001,
        4.28187214248,
        4.263325395480001,
        4.25655015548,
        4.29836080248,
        4.35259481948,
        4.336707474480001,
        4.295675759480001,
        4.2481012614800004,
        4.1812077184800005
      ],
      "exit_codes": [
        0,
        0,
        0,
        0,
        0,
        0,
        0,
        0,
        0,
        0
      ]
    },
    {
      "command": "ATS/fib",
      "mean": 1.6213548965800002,
      "stddev": 0.004401816786156907,
      "median": 1.62310822898,
      "user": 1.61893794,
      "system": 0.0017463039999999993,
      "min": 1.61286327748,
      "max": 1.6248251794800002,
      "times": [
        1.61286327748,
        1.6248182874800001,
        1.6223046184799998,
        1.6248251794800002,
        1.62111320048,
        1.62119770048,
        1.62448466548,
        1.62401362648,
        1.61401657048,
        1.62391183948
      ],
      "exit_codes": [
        0,
        0,
        0,
        0,
        0,
        0,
        0,
        0,
        0,
        0
      ]
    },
    {
      "command": "Swift/fib",
      "mean": 2.59625241908,
      "stddev": 0.0029656038835313594,
      "median": 2.59634622998,
      "user": 2.59186064,
      "system": 0.002670879999999999,
      "min": 2.59044808748,
      "max": 2.59992344948,
      "times": [
        2.59799471648,
        2.5960027234800003,
        2.5982282794800002,
        2.59992344948,
        2.59044808748,
        2.59934968048,
        2.59240921648,
        2.59633533648,
        2.5963571234800003,
        2.59547557748
      ],
      "exit_codes": [
        0,
        0,
        0,
        0,
        0,
        0,
        0,
        0,
        0,
        0
      ]
    },
    {
      "command": "Ada/fib",
      "mean": 1.64730028928,
      "stddev": 0.0034744486353655555,
      "median": 1.64794905748,
      "user": 1.6455366400000002,
      "system": 0.0012693659999999992,
      "min": 1.64175659648,
      "max": 1.65222425348,
      "times": [
        1.64604692048,
        1.64581310348,
        1.65222425348,
        1.64985868648,
        1.64853811448,
        1.64196890548,
        1.64175659648,
        1.64879931248,
        1.65063699948,
        1.64736000048
      ],
      "exit_codes": [
        0,
        0,
        0,
        0,
        0,
        0,
        0,
        0,
        0,
        0
      ]
    },
    {
      "command": "Mercury/fib",
      "mean": 7.097855163880001,
      "stddev": 0.008108993817201674,
      "median": 7.09890104748,
      "user": 7.087353339999998,
      "system": 0.00670578,
      "min": 7.08490992848,
      "max": 7.115976105480001,
      "times": [
        7.096220978480001,
        7.091657677480001,
        7.099369800480001,
        7.0990087204800005,
        7.10023570748,
        7.0917706674800005,
        7.10060867848,
        7.08490992848,
        7.115976105480001,
        7.0987933744800005
      ],
      "exit_codes": [
        0,
        0,
        0,
        0,
        0,
        0,
        0,
        0,
        0,
        0
      ]
    },
    {
      "command": "C/fib",
      "mean": 6.45310566678,
      "stddev": 0.003335507049683832,
      "median": 6.45489211148,
      "user": 6.44799984,
      "system": 0.001870241999999999,
      "min": 6.44805703148,
      "max": 6.45629400648,
      "times": [
        6.45629400648,
        6.4556785344800005,
        6.44908391848,
        6.4556840414800005,
        6.4517107964800005,
        6.45410568848,
        6.44805703148,
        6.45582417648,
        6.4488865544800005,
        6.455731919480001
      ],
      "exit_codes": [
        0,
        0,
        0,
        0,
        0,
        0,
        0,
        0,
        0,
        0
      ]
    },
    {
      "command": "C/fib-clang",
      "mean": 6.090315370680001,
      "stddev": 0.055530467388665294,
      "median": 6.06570539698,
      "user": 6.084927339999999,
      "system": 0.0018743419999999993,
      "min": 6.041381583480001,
      "max": 6.194147028480001,
      "times": [
        6.140808763480001,
        6.043069265480001,
        6.078194513480001,
        6.136792439480001,
        6.042507486480001,
        6.13009329548,
        6.041381583480001,
        6.05321628048,
        6.042943050480001,
        6.194147028480001
      ],
      "exit_codes": [
        0,
        0,
        0,
        0,
        0,
        0,
        0,
        0,
        0,
        0
      ]
    },
    {
      "command": "Kotlin/fib",
      "mean": 3.9982962237799997,
      "stddev": 0.004999188477497108,
      "median": 3.99870349198,
      "user": 3.9930470399999995,
      "system": 0.0032073419999999993,
      "min": 3.98843273448,
      "max": 4.008322516480001,
      "times": [
        3.98843273448,
        4.00136893348,
        3.9954049914799996,
        3.99921544048,
        3.99892948348,
        4.008322516480001,
        3.99878208848,
        3.9955183234800002,
        3.9986248954800003,
        3.99836283048
      ],
      "exit_codes": [
        0,
        0,
        0,
        0,
        0,
        0,
        0,
        0,
        0,
        0
      ]
    },
    {
      "command": "CLisp/fib",
      "mean": 27.41310219698,
      "stddev": 0.017779555087669808,
      "median": 27.41175565248,
      "user": 27.386964340000002,
      "system": 0.010320679999999995,
      "min": 27.38863013548,
      "max": 27.44157912248,
      "times": [
        27.41966073148,
        27.44157912248,
        27.432337316479998,
        27.38863013548,
        27.39106611748,
        27.40932459648,
        27.40438918148,
        27.42973284348,
        27.40011521648,
        27.41418670848
      ],
      "exit_codes": [
        0,
        0,
        0,
        0,
        0,
        0,
        0,
        0,
        0,
        0
      ]
    },
    {
      "command": "Clean/bin/fib",
      "mean": 3.82074235878,
      "stddev": 0.0031474290690019944,
      "median": 3.81956535448,
      "user": 3.81608814,
      "system": 0.002531379999999999,
      "min": 3.81724384248,
      "max": 3.82730217348,
      "times": [
        3.81962403048,
        3.81769636948,
        3.82115321048,
        3.81864324848,
        3.81724384248,
        3.82730217348,
        3.82324799848,
        3.8195066784800003,
        3.82371885748,
        3.81928717848
      ],
      "exit_codes": [
        0,
        0,
        0,
        0,
        0,
        0,
        0,
        0,
        0,
        0
      ]
    },
    {
      "command": "Koka/fib",
      "mean": 5.70348706958,
      "stddev": 0.006823489053445325,
      "median": 5.702474828980001,
      "user": 5.697064239999999,
      "system": 0.003333479999999999,
      "min": 5.6970890584800005,
      "max": 5.72074702048,
      "times": [
        5.699405764480001,
        5.72074702048,
        5.69846811748,
        5.707499089480001,
        5.702972866480001,
        5.7044601124800005,
        5.6970890584800005,
        5.70307712848,
        5.699174746480001,
        5.701976791480001
      ],
      "exit_codes": [
        0,
        0,
        0,
        0,
        0,
        0,
        0,
        0,
        0,
        0
      ]
    },
    {
      "command": "Terra/fib",
      "mean": 2.63292677668,
      "stddev": 0.04531057222298389,
      "median": 2.60613263198,
      "user": 2.63073214,
      "system": 0.0010667039999999993,
      "min": 2.59778712948,
      "max": 2.70341517048,
      "times": [
        2.61612381948,
        2.70341517048,
        2.6954648254799998,
        2.60561001348,
        2.69559106548,
        2.60515953748,
        2.60184610748,
        2.60161484748,
        2.60665525048,
        2.59778712948
      ],
      "exit_codes": [
        0,
        0,
        0,
        0,
        0,
        0,
        0,
        0,
        0,
        0
      ]
    },
    {
      "command": "Lean/build/bin/fib naive",
      "mean": 13.92789799038,
      "stddev": 0.02001526985546549,
      "median": 13.92471567098,
      "user": 13.91747844,
      "system": 0.003329279999999999,
      "min": 13.90686314648,
      "max": 13.96271312448,
      "times": [
        13.90832401348,
        13.96014666548,
        13.91670495048,
        13.96271312448,
        13.924940530479999,
        13.90686314648,
        13.92449081148,
        13.90953109748,
        13.932680592479999,
        13.932584971479999
      ],
      "exit_codes": [
        0,
        0,
        0,
        0,
        0,
        0,
        0,
        0,
        0,
        0
      ]
    }
  ]
}
