{
  "version": "1.0",
  "defaultProvider": "cdnjs",
  "libraries": [
    {
      "library": "OwlCarousel2@2.3.4",
      "destination": "wwwroot/lib/OwlCarousel2/"
    },
    {
      "provider": "cdnjs",
      "library": "aos@2.3.4",
      "destination": "wwwroot/lib/aos/"
    },
    {
      "provider": "cdnjs",
      "library": "font-awesome@4.7.0",
      "destination": "wwwroot/lib/font-awesome/"
    },
    {
      "library": "lodash.js@4.17.11",
      "destination": "wwwroot/lib/lodash.js/"
    }
  ]
}