amqp==5.1.1
asgiref==3.5.2
async-timeout==4.0.2
attrs==22.1.0
billiard==3.6.4.0
celery==5.2.7
certifi==2022.9.24
charset-normalizer==2.1.1
click==8.1.3
click-didyoumean==0.3.0
click-plugins==1.1.1
click-repl==0.2.0
contourpy==1.0.5
cycler==0.11.0
Deprecated==1.2.13
Django==4.1.1
djangorestframework==3.14.0
exceptiongroup==1.0.0
fonttools==4.37.3
gunicorn==20.1.0
idna==3.4
iniconfig==1.1.1
kiwisolver==1.4.4
kombu==5.2.4
matplotlib==3.6.0
numpy==1.23.3
packaging==21.3
Pillow==9.2.0
pluggy==1.0.0
prompt-toolkit==3.0.31
psycopg2==2.9.5
pyparsing==3.0.9
pytest==7.2.0
pytest-django==4.5.2
python-dateutil==2.8.2
python-dotenv==0.21.0
pytz==2022.2.1
redis==4.3.4
requests==2.28.1
six==1.16.0
sqlparse==0.4.3
tomli==2.0.1
urllib3==1.26.12
vine==5.0.0
wcwidth==0.2.5
wrapt==1.14.1
