{
    "structure_version": 1.0,
    "protocol_version": 1.1,
    "configuration": {
        "name": "Kionix IoT node with KX122 and add-on board",
        "doc": "Kionix IoT node with KX122 and additional sensor on add-on board",
        "bus1": {
            "connections": [{
                "connection": "i2c",
                "part_list": [{
                    "name": "KMX62",
                    "SAD": 14,
                    "int1_gpio": 0
                },
                {
                    "name": "KXG03",
                    "SAD": 79,
                    "int1_gpio": 16,
                    "int2_gpio": 13
                },
                {
                    "name": "KX122",
                    "SAD": 31,
                    "int1_gpio": 16,
                    "int2_gpio": 13
                },
                {
                    "name": "BM1383AGLV",
                    "SAD": 93,
                    "int1_gpio": 16
                },
                {
                    "name": "KXG08",
                    "SAD": 78,
                    "int1_gpio": 16,
                    "int2_gpio": 13
                },
                {
                    "name": "KXTJ3",
                    "SAD": 15,
                    "int1_gpio": 16
                },
                {
                    "name": "KX224",
                    "SAD": 30,
                    "int1_gpio": 16
                }
                ]
            }]
        },
        "bus2": {
            "connections": [{
                "connection": "USB",
                "packet_per_second": 400,
                "baud_rate": 460800,
                "start_up_delay_ms": 0,
                "com_port_name": ["USB Serial Port"]
            },
            {
                "connection": "BLE",
                "packet_per_second": 200
            }]
        },
        "stream_config": {
            "directory": "stream_config/board_kx_iot_k1_build2-add-on"
        },
        "board_init": {
            "reg_write": [["KX122",
            25,
            128],
            ["KXG03",
            68,
            128],
            ["KMX62",
            57,
            8],
            ["BM1383AGLV",
            17,
            128],
            ["BM1383AGLV",
            19,
            0],
            ["BM1383AGLV",
            18,
            0],
            ["KX122",
            28,
            32],
            ["KX122",
            32,
            32],
            ["KX122",
            24,
            128],
            ["KXG03",
            69,
            136],
            ["KMX62",
            42,
            16],
            ["KMX62",
            44,
            0],
            [
                "KXG08",
                107,
                128],
            [
                "KXG08",
                64,
                136],
            [
                "KX224",
                25,
                128],
            [
                "KX224",
                28,
                32],
            [
                "KX224",
                32,
                0],
            [
                "KXTJ3",
                29,
                128],
            [
                "KXTJ3",
                30,
                32]
            ]
        }
    }
}