<?xml version="1.0"?>
<robot xmlns:xacro="http://www.ros.org/wiki/xacro" name="11">

    
<!--materials-->
    
 <material name="green">
    <color rgba="0.3 0.69 0.49 1"/>
  </material>

  <material name="white">
    <color rgba="1 1 1 1"/>
  </material>
  
   <material name="collision_material_wheels">
    <color rgba="1 0.25 0.67 1"/>
  </material>
  <material name="collision_material_body">
    <color rgba="0.22 0.25 0.67 1"/>
  </material>

    
    <!--main_body-->
<!-- HERE_constant_main_body -->
<xacro:property name="height_val" value="0.2" />
<xacro:property name="radius_val" value="0.2" />
<xacro:property name="inertia_val" value="0.02" />

  
  <link name="base_link">
    <visual>
      <geometry>
        <cylinder length="${height_val}" radius="${radius_val}"/>
      </geometry>
        <origin rpy="0 0 0" xyz="0 0 0.1"/>
        <material name="green"/>
    </visual>

    <!--collision_moment-->
    <collision>
      <geometry>
        <cylinder length="${height_val}" radius="${radius_val}"/>
      </geometry>
      <origin rpy="0 0 0" xyz="0 0 0.1"/>
      <material name="collision_material_body"/>
    </collision>
    <inertial>
      <mass value="2"/>
      <inertia ixx="${inertia_val}" ixy="0.0" ixz="0.0" iyy="${inertia_val}" iyz="0.0" izz="${inertia_val}"/>
    </inertial>
  </link>
  <!-- gazebo_1_macros-->
    <gazebo reference="base_link">
      <mu1 value="200.0"/>
      <mu2 value="100.0"/>
      <kp value="10000000.0" />
      <kd value="1.0" />
      <material>Gazebo/Grey</material>
    </gazebo>
  
    <!-- lidar here -->
<xacro:property name="pi" value="3.141592" />
     
  <link name="lidar_link">
    <collision>
      <origin xyz="0 0 0" rpy="0 0 0"/>
      <geometry>
    <cylinder length="0.01" radius="0.01"/>
      </geometry>
    </collision>
    <visual>
      <origin xyz="0 0 0" rpy="0 0 0"/>
      <geometry>
        <cylinder length="0.01" radius="0.01"/>
      </geometry>
    </visual>
    <inertial>
      <mass value="1e-5" />
      <inertia ixx="1e-6" ixy="0" ixz="0" iyy="1e-6" iyz="0" izz="1e-6" />
    </inertial>
  </link>
  
  <joint name="lidar_joint" type="fixed">
    
     <origin xyz="0 0 0.2" rpy="0 0 ${pi/2}"/>
    
    <parent link="base_link"/>
    <child link="lidar_link"/>
  </joint>

  <!-- depth cam     -->

<link name="depth_camera_link">
    <inertial>
      <mass value="1e-5"/>
      <origin xyz="0 0 0" rpy="0 0 0"/>
      <inertia ixx="1e-6" ixy="0.0" ixz="0.0" iyy="1e-6" iyz="0.0" izz="1e-6"/>
    </inertial>
  </link>

  <joint name="depth_camera_joint" type="fixed">
    <axis xyz ="1 0 0" />
    <origin xyz="0 0.0 0.2" rpy="0 0 1.57"/>
    <parent link="base_link"/>
    <child link="depth_camera_link"/>
  </joint>
  
  <link name="depth_camera_optical"></link>
  <joint name="depth_camera_optical_joint" type="fixed">
      <axis xyz ="1 0 0" />
    <origin xyz="0.2 0.0 0.2" rpy="-1.57 0 -1.57"/>
    <parent link="depth_camera_link"/>
    <child link="depth_camera_optical"/>
  </joint>
  


    
  <!-- gazebo_1_macros-->
    <gazebo reference="lidar_link">
      <material>Gazebo/Blue</material>
    </gazebo>
    


  
    <!--Shpere here-->
  
  <xacro:property name="sphere_mass" value="1" />
 <xacro:property name="sphere_radius" value="0.1" />
  
  <link name="front_sphere">
    <visual>
      <geometry>
        <sphere radius="${sphere_radius}"/>
      </geometry>
      <origin rpy="0 0 0" xyz="0 0 0"/>
      <material name="Purple"/>
    </visual>
    
    

    <!--collision_moment-->
    <collision>
      <geometry>
        <sphere  radius="${sphere_radius}"/>
      </geometry>
       <origin rpy="0 0 0" xyz="0 0 0"/>
       <material name="collision_material_wheels"/>
    </collision>
    <inertial>
      <mass value="${sphere_mass}"/>
      <inertia ixx="${inertia_val}" ixy="0.0" ixz="0.0" iyy="${inertia_val}" iyz="0.0" izz="${inertia_val}"/>
    </inertial>
  </link>
  
  <!--joit_sphere_here_just_for_check -->
  <joint name="base_to_front_sphere" type="continuous">
   <axis xyz="-1 0 0"/>
   <limit effort="1000.0" velocity="0.5"/>
    <parent link="base_link"/>
    <child link="front_sphere"/>
     <origin  xyz= "0 0.2 0" /> 
<!--      <limit effort="30" velocity="1.0"/> -->
   </joint> 
  
  
  <!-- gazebo_1_sphere -->
    <gazebo reference="front_sphere">
      <material>Gazebo/Yellow</material>
    </gazebo>
   
   

  

  <!--LETS MAKE MAKROS FOR WHEELS-->
  
  <!-- HERE_constant_wheels -->
  <xacro:property name="height_wheel" value="0.05" />
  <xacro:property name="radius_wheel" value="0.1" />
  <xacro:property name="mass_wheel" value="0.2" />
  <xacro:property name="inertia_wheel" value="0.2" />
  
  <xacro:macro name="wheel" params="prefix reflect">
   <link name="${prefix}_wheel">
    <visual>
        <geometry>
           <cylinder length="${height_wheel}" radius="${radius_wheel}"/>
        </geometry>
      <origin rpy="0 ${pi/2} 0" xyz="0 0 0"/>
      <material name="white"/>
    </visual>
      <collision>
      <geometry>
        <cylinder length="${height_wheel}" radius="${radius_wheel}"/>
      </geometry>
       <origin rpy="0 ${pi/2} 0" xyz="0 0 0"/>
       <material name="collision_material_wheels"/>
    </collision>
    <inertial>
      <mass value="${mass_wheel}"/>
      <inertia ixx="${inertia_wheel}" ixy="0.0" ixz="0.0" iyy="${inertia_wheel}" iyz="0.0" izz="${inertia_wheel}"/>
    </inertial>
   </link>
    
  
   <joint name="base_to_${prefix}_wheel" type="continuous">
   <axis xyz="-1 0 0"/>
   <limit effort="1000.0" velocity="0.5"/>
   <parent link="base_link"/>
   <child link="${prefix}_wheel"/>
   <origin  xyz= "${reflect*(radius_val+.025)} 0 0" /> 
   </joint> 

<!-- gazebo_1_macros-->
    <gazebo reference="${prefix}_wheel">
      <mu1 value="200.0"/>
      <mu2 value="100.0"/>
      <kp value="10000000.0" />
      <kd value="1.0" />
      <material>Gazebo/Green</material>
    </gazebo>
   


</xacro:macro>
<xacro:wheel prefix="right" reflect ="1" />
<xacro:wheel prefix="left"  reflect ="-1"/>
<!--end_of_macros-->

<!-- gazebo_plugin -->
 <gazebo>
  <plugin name="differential_drive_controller" filename="libgazebo_ros_diff_drive.so">

    <!-- Plugin update rate in Hz -->
    <updateRate>40</updateRate>

    <!-- Name of left joint, defaults to `left_joint` -->
    <leftJoint>base_to_left_wheel</leftJoint>
  

    <!-- Name of right joint, defaults to `right_joint` -->
    <rightJoint>base_to_right_wheel</rightJoint>
  

    <!-- The distance from the center of one wheel to the other, in meters, defaults to 0.34 m -->
    <wheelSeparation>0.4</wheelSeparation>

    <!-- Diameter of the wheels, in meters, defaults to 0.15 m -->
    <wheelDiameter>0.2</wheelDiameter>

    <!-- Wheel acceleration, in rad/s^2, defaults to 0.0 rad/s^2 -->
    <wheelAcceleration>1.0</wheelAcceleration>

    <!-- Maximum torque which the wheels can produce, in Nm, defaults to 5 Nm -->
    <wheelTorque>20</wheelTorque>

    <!-- Topic to receive geometry_msgs/Twist message commands, defaults to `cmd_vel` -->
    <commandTopic>cmd_vel</commandTopic>

    <!-- Topic to publish nav_msgs/Odometry messages, defaults to `odom` -->
    <odometryTopic>odom</odometryTopic>

    <!-- Odometry frame, defaults to `odom` -->
    <odometryFrame>odom</odometryFrame>

    <!-- Robot frame to calculate odometry from, defaults to `base_footprint` -->
    <robotBaseFrame>base_footprint</robotBaseFrame>

    <!-- Odometry source, 0 for ENCODER, 1 for WORLD, defaults to WORLD -->
    <odometrySource>1</odometrySource>

    <!-- Set to true to publish transforms for the wheel links, defaults to false -->
    <publishWheelTF>true</publishWheelTF>

    <!-- Set to true to publish transforms for the odometry, defaults to true -->
    <publishOdom>true</publishOdom>

    <!-- Set to true to publish sensor_msgs/JointState on /joint_states for the wheel joints, defaults to false -->
    <publishWheelJointState>true</publishWheelJointState>

    <!-- Set to true to swap right and left wheels, defaults to true -->
    <legacyMode>false</legacyMode>
        <odometrySource>world</odometrySource>
        <publishTf>1</publishTf>
  </plugin>
    
</gazebo>


 <!-- lidar here, hope its works-->
 <!-- <gazebo reference="lidar_link">
    <sensor type="gpu_ray" name="head_hokuyo_sensor">
      <pose>0 0 0 0 0 0</pose>
      <visualize>True</visualize>
      <update_rate>40</update_rate>
      <ray>
        <scan>
          <horizontal>
            <samples>720</samples>
            <resolution>1</resolution>
            <min_angle>-1.570796</min_angle>
            <max_angle>1.570796</max_angle>
          </horizontal>
        </scan>
        <range>
          <min>0.10</min>
          <max>30.0</max>
          <resolution>0.01</resolution>
        </range>
        <noise>
          <type>gaussian</type>
          <mean>0.0</mean>
          <stddev>0.01</stddev>
        </noise>
      </ray>
      <plugin name="gazebo_ros_head_hokuyo_controller" filename="libgazebo_ros_gpu_laser.so">
        <topicName>/rrbot/laser/scan</topicName>
        <frameName>lidar_link</frameName>
      </plugin>
    </sensor>
    
    
  </gazebo> -->
  
  
  
  <!--depth cam-->
 <gazebo reference="depth_camera_link">
    <sensor type="depth" name="cam_depth_frame_sensor">
      <always_on>true</always_on>
      <update_rate>20.0</update_rate>
      <camera>
        <horizontal_fov>1.047198</horizontal_fov>
        <image>
          <format>R8G8B8</format>
          <width>640</width>
          <height>480</height>
        </image>
        <clip>
          <near>0.01</near>
          <far>12</far>
        </clip>
      </camera>
      <plugin name="cam_depth_frame_controller" filename="libgazebo_ros_openni_kinect.so">
        <alwaysOn>true</alwaysOn>
        <updateRate>10.0</updateRate>
        <cameraName>cam_depth</cameraName>
        <imageTopicName>cam_depth/ir/image_raw</imageTopicName>
        <cameraInfoTopicName>cam_depth/ir/camera_info</cameraInfoTopicName>
        <depthImageTopicName>cam_depth/depth/image_raw</depthImageTopicName>
        <depthImageCameraInfoTopicName>cam_depth/depth/camera_info</depthImageCameraInfoTopicName>
        <pointCloudTopicName>cam_depth/depth/points</pointCloudTopicName>
        <frameName>depth_camera_optical</frameName>
        <pointCloudCutoff>0.5</pointCloudCutoff>
        <pointCloudCutoffMax>10.0</pointCloudCutoffMax>
        <distortionK1>0.00000001</distortionK1>
        <distortionK2>0.00000001</distortionK2>
        <distortionK3>0.00000001</distortionK3>
        <distortionT1>0.00000001</distortionT1>
        <distortionT2>0.00000001</distortionT2>
        <CxPrime>0</CxPrime>
        <Cx>0</Cx>
        <Cy>0</Cy>
        <focalLength>0</focalLength>
        <hackBaseline>0</hackBaseline>
      </plugin>
    </sensor>
  </gazebo>

<!--<gazebo reference="lidar_link">
    <gravity>true</gravity>
    <sensor name="imu_sensor" type="imu">
      <always_on>true</always_on>
      <update_rate>100</update_rate>
      <visualize>true</visualize>
      <topic>__default_topic__</topic>
      <plugin filename="libgazebo_ros_imu_sensor.so" name="imu_plugin">
        <topicName>imu</topicName>
        <bodyName>lidar_link</bodyName>
        <updateRateHZ>10.0</updateRateHZ>
        <gaussianNoise>0.0</gaussianNoise>
        <xyzOffset>0 0 0</xyzOffset>
        <rpyOffset>0 0 0</rpyOffset>
        <frameName>lidar_link</frameName>
        <initialOrientationAsReference>false</initialOrientationAsReference>
      </plugin>
      <pose>0 0 0 0 0 0</pose>
    </sensor>
  </gazebo>-->
  
   
</robot>
