rosnode: node is [/zakharov_turtle]
pinging /zakharov_turtle with a timeout of 3.0s
xmlrpc reply from http://localhost:33463/	time=0.338078ms
xmlrpc reply from http://localhost:33463/	time=1.454115ms
xmlrpc reply from http://localhost:33463/	time=1.477003ms
xmlrpc reply from http://localhost:33463/	time=1.466990ms
xmlrpc reply from http://localhost:33463/	time=1.560926ms
xmlrpc reply from http://localhost:33463/	time=1.405001ms
xmlrpc reply from http://localhost:33463/	time=1.656055ms
xmlrpc reply from http://localhost:33463/	time=1.798868ms
xmlrpc reply from http://localhost:33463/	time=1.250029ms
xmlrpc reply from http://localhost:33463/	time=1.464128ms
xmlrpc reply from http://localhost:33463/	time=1.498938ms
xmlrpc reply from http://localhost:33463/	time=1.645088ms
xmlrpc reply from http://localhost:33463/	time=1.299858ms
xmlrpc reply from http://localhost:33463/	time=1.433849ms
xmlrpc reply from http://localhost:33463/	time=1.337051ms
xmlrpc reply from http://localhost:33463/	time=1.223087ms
xmlrpc reply from http://localhost:33463/	time=1.657963ms
xmlrpc reply from http://localhost:33463/	time=1.250029ms
xmlrpc reply from http://localhost:33463/	time=1.297951ms
xmlrpc reply from http://localhost:33463/	time=1.708984ms
xmlrpc reply from http://localhost:33463/	time=1.494169ms
xmlrpc reply from http://localhost:33463/	time=0.336885ms
xmlrpc reply from http://localhost:33463/	time=1.500845ms
xmlrpc reply from http://localhost:33463/	time=1.286030ms
xmlrpc reply from http://localhost:33463/	time=1.307011ms
xmlrpc reply from http://localhost:33463/	time=0.624180ms
xmlrpc reply from http://localhost:33463/	time=1.471996ms
xmlrpc reply from http://localhost:33463/	time=1.375914ms
xmlrpc reply from http://localhost:33463/	time=1.258850ms
xmlrpc reply from http://localhost:33463/	time=1.438141ms
xmlrpc reply from http://localhost:33463/	time=1.250982ms
xmlrpc reply from http://localhost:33463/	time=1.317978ms
xmlrpc reply from http://localhost:33463/	time=0.373125ms
xmlrpc reply from http://localhost:33463/	time=1.300812ms
xmlrpc reply from http://localhost:33463/	time=1.307964ms
xmlrpc reply from http://localhost:33463/	time=1.235008ms
xmlrpc reply from http://localhost:33463/	time=1.300812ms
xmlrpc reply from http://localhost:33463/	time=1.308918ms
xmlrpc reply from http://localhost:33463/	time=0.971079ms
xmlrpc reply from http://localhost:33463/	time=1.592875ms
xmlrpc reply from http://localhost:33463/	time=1.537085ms
xmlrpc reply from http://localhost:33463/	time=1.322985ms
xmlrpc reply from http://localhost:33463/	time=1.349926ms
xmlrpc reply from http://localhost:33463/	time=1.393080ms
xmlrpc reply from http://localhost:33463/	time=1.358986ms
xmlrpc reply from http://localhost:33463/	time=1.448870ms
xmlrpc reply from http://localhost:33463/	time=1.534939ms
xmlrpc reply from http://localhost:33463/	time=1.275063ms
xmlrpc reply from http://localhost:33463/	time=1.257181ms
xmlrpc reply from http://localhost:33463/	time=1.598120ms
xmlrpc reply from http://localhost:33463/	time=1.233101ms
xmlrpc reply from http://localhost:33463/	time=1.345873ms
xmlrpc reply from http://localhost:33463/	time=0.355005ms
xmlrpc reply from http://localhost:33463/	time=0.307083ms
xmlrpc reply from http://localhost:33463/	time=1.371145ms
xmlrpc reply from http://localhost:33463/	time=1.230955ms
xmlrpc reply from http://localhost:33463/	time=1.667976ms
xmlrpc reply from http://localhost:33463/	time=1.413822ms
xmlrpc reply from http://localhost:33463/	time=1.311064ms
xmlrpc reply from http://localhost:33463/	time=1.339912ms
xmlrpc reply from http://localhost:33463/	time=1.245975ms
xmlrpc reply from http://localhost:33463/	time=1.341820ms
xmlrpc reply from http://localhost:33463/	time=0.339031ms
xmlrpc reply from http://localhost:33463/	time=1.250029ms
xmlrpc reply from http://localhost:33463/	time=1.390934ms
xmlrpc reply from http://localhost:33463/	time=0.319958ms
xmlrpc reply from http://localhost:33463/	time=1.280069ms
xmlrpc reply from http://localhost:33463/	time=0.610828ms
xmlrpc reply from http://localhost:33463/	time=1.335859ms
xmlrpc reply from http://localhost:33463/	time=1.246929ms
xmlrpc reply from http://localhost:33463/	time=0.319004ms
xmlrpc reply from http://localhost:33463/	time=1.740932ms
xmlrpc reply from http://localhost:33463/	time=1.399040ms
xmlrpc reply from http://localhost:33463/	time=0.723124ms
xmlrpc reply from http://localhost:33463/	time=1.276016ms
xmlrpc reply from http://localhost:33463/	time=1.304150ms
xmlrpc reply from http://localhost:33463/	time=0.394106ms
xmlrpc reply from http://localhost:33463/	time=0.386953ms
xmlrpc reply from http://localhost:33463/	time=1.410961ms
xmlrpc reply from http://localhost:33463/	time=1.130104ms
xmlrpc reply from http://localhost:33463/	time=1.524925ms
xmlrpc reply from http://localhost:33463/	time=1.318932ms
xmlrpc reply from http://localhost:33463/	time=1.332045ms
xmlrpc reply from http://localhost:33463/	time=1.252174ms
xmlrpc reply from http://localhost:33463/	time=1.351118ms
xmlrpc reply from http://localhost:33463/	time=1.385927ms
xmlrpc reply from http://localhost:33463/	time=1.368046ms
xmlrpc reply from http://localhost:33463/	time=1.337051ms
xmlrpc reply from http://localhost:33463/	time=1.226902ms
xmlrpc reply from http://localhost:33463/	time=1.231194ms
xmlrpc reply from http://localhost:33463/	time=1.232147ms
xmlrpc reply from http://localhost:33463/	time=1.398087ms
xmlrpc reply from http://localhost:33463/	time=0.562906ms
xmlrpc reply from http://localhost:33463/	time=1.298904ms
xmlrpc reply from http://localhost:33463/	time=1.334906ms
xmlrpc reply from http://localhost:33463/	time=1.307011ms
xmlrpc reply from http://localhost:33463/	time=1.446962ms
xmlrpc reply from http://localhost:33463/	time=1.425982ms
xmlrpc reply from http://localhost:33463/	time=1.409054ms
xmlrpc reply from http://localhost:33463/	time=1.276016ms
xmlrpc reply from http://localhost:33463/	time=1.682043ms
xmlrpc reply from http://localhost:33463/	time=1.332045ms
xmlrpc reply from http://localhost:33463/	time=1.400948ms
xmlrpc reply from http://localhost:33463/	time=1.385927ms
xmlrpc reply from http://localhost:33463/	time=1.341105ms
xmlrpc reply from http://localhost:33463/	time=1.216173ms
xmlrpc reply from http://localhost:33463/	time=0.733852ms
xmlrpc reply from http://localhost:33463/	time=1.497984ms
xmlrpc reply from http://localhost:33463/	time=1.255035ms
xmlrpc reply from http://localhost:33463/	time=1.692057ms
xmlrpc reply from http://localhost:33463/	time=0.683069ms
xmlrpc reply from http://localhost:33463/	time=0.370979ms
xmlrpc reply from http://localhost:33463/	time=1.365900ms
xmlrpc reply from http://localhost:33463/	time=1.458883ms
xmlrpc reply from http://localhost:33463/	time=1.401186ms
xmlrpc reply from http://localhost:33463/	time=1.279116ms
xmlrpc reply from http://localhost:33463/	time=0.613928ms
xmlrpc reply from http://localhost:33463/	time=1.222849ms
xmlrpc reply from http://localhost:33463/	time=1.399994ms
xmlrpc reply from http://localhost:33463/	time=1.338005ms
xmlrpc reply from http://localhost:33463/	time=1.266003ms
xmlrpc reply from http://localhost:33463/	time=1.332045ms
xmlrpc reply from http://localhost:33463/	time=1.342058ms
xmlrpc reply from http://localhost:33463/	time=1.432896ms
xmlrpc reply from http://localhost:33463/	time=1.282930ms
xmlrpc reply from http://localhost:33463/	time=1.603127ms
xmlrpc reply from http://localhost:33463/	time=1.389027ms
xmlrpc reply from http://localhost:33463/	time=1.267910ms
xmlrpc reply from http://localhost:33463/	time=0.738144ms
xmlrpc reply from http://localhost:33463/	time=1.322031ms
xmlrpc reply from http://localhost:33463/	time=1.237869ms
xmlrpc reply from http://localhost:33463/	time=1.353025ms
xmlrpc reply from http://localhost:33463/	time=1.973867ms
xmlrpc reply from http://localhost:33463/	time=1.302958ms
xmlrpc reply from http://localhost:33463/	time=1.256943ms
xmlrpc reply from http://localhost:33463/	time=1.271963ms
xmlrpc reply from http://localhost:33463/	time=1.348019ms
xmlrpc reply from http://localhost:33463/	time=1.305103ms
xmlrpc reply from http://localhost:33463/	time=1.384020ms
xmlrpc reply from http://localhost:33463/	time=1.380920ms
xmlrpc reply from http://localhost:33463/	time=1.307011ms
xmlrpc reply from http://localhost:33463/	time=0.421047ms
xmlrpc reply from http://localhost:33463/	time=1.343012ms
xmlrpc reply from http://localhost:33463/	time=1.353979ms
xmlrpc reply from http://localhost:33463/	time=1.300097ms
xmlrpc reply from http://localhost:33463/	time=1.266956ms
xmlrpc reply from http://localhost:33463/	time=1.492023ms
xmlrpc reply from http://localhost:33463/	time=1.340151ms
xmlrpc reply from http://localhost:33463/	time=1.362085ms
xmlrpc reply from http://localhost:33463/	time=1.262903ms
xmlrpc reply from http://localhost:33463/	time=1.409054ms
xmlrpc reply from http://localhost:33463/	time=1.382828ms
xmlrpc reply from http://localhost:33463/	time=1.351118ms
xmlrpc reply from http://localhost:33463/	time=1.252890ms
xmlrpc reply from http://localhost:33463/	time=1.389980ms
xmlrpc reply from http://localhost:33463/	time=1.437902ms
xmlrpc reply from http://localhost:33463/	time=1.271963ms
xmlrpc reply from http://localhost:33463/	time=1.302004ms
xmlrpc reply from http://localhost:33463/	time=0.409842ms
xmlrpc reply from http://localhost:33463/	time=1.133919ms
xmlrpc reply from http://localhost:33463/	time=0.664949ms
xmlrpc reply from http://localhost:33463/	time=1.135111ms
xmlrpc reply from http://localhost:33463/	time=1.276970ms
xmlrpc reply from http://localhost:33463/	time=1.350164ms
xmlrpc reply from http://localhost:33463/	time=0.674009ms
xmlrpc reply from http://localhost:33463/	time=1.626968ms
xmlrpc reply from http://localhost:33463/	time=1.232862ms
xmlrpc reply from http://localhost:33463/	time=1.358032ms
xmlrpc reply from http://localhost:33463/	time=0.417948ms
xmlrpc reply from http://localhost:33463/	time=1.230955ms
xmlrpc reply from http://localhost:33463/	time=1.302004ms
xmlrpc reply from http://localhost:33463/	time=1.283884ms
xmlrpc reply from http://localhost:33463/	time=1.397848ms
xmlrpc reply from http://localhost:33463/	time=0.428915ms
xmlrpc reply from http://localhost:33463/	time=1.554966ms
xmlrpc reply from http://localhost:33463/	time=1.397133ms
xmlrpc reply from http://localhost:33463/	time=1.276970ms
xmlrpc reply from http://localhost:33463/	time=0.362873ms
xmlrpc reply from http://localhost:33463/	time=1.368046ms
xmlrpc reply from http://localhost:33463/	time=1.230001ms
xmlrpc reply from http://localhost:33463/	time=1.244068ms
xmlrpc reply from http://localhost:33463/	time=1.339912ms
xmlrpc reply from http://localhost:33463/	time=1.393080ms
xmlrpc reply from http://localhost:33463/	time=0.862122ms
xmlrpc reply from http://localhost:33463/	time=1.405954ms
xmlrpc reply from http://localhost:33463/	time=1.216888ms
xmlrpc reply from http://localhost:33463/	time=1.101017ms
xmlrpc reply from http://localhost:33463/	time=1.291990ms
xmlrpc reply from http://localhost:33463/	time=1.260996ms
xmlrpc reply from http://localhost:33463/	time=1.240969ms
xmlrpc reply from http://localhost:33463/	time=1.585960ms
xmlrpc reply from http://localhost:33463/	time=1.816988ms
xmlrpc reply from http://localhost:33463/	time=0.406027ms
xmlrpc reply from http://localhost:33463/	time=1.271963ms
xmlrpc reply from http://localhost:33463/	time=0.355959ms
xmlrpc reply from http://localhost:33463/	time=1.239061ms
xmlrpc reply from http://localhost:33463/	time=1.433849ms
xmlrpc reply from http://localhost:33463/	time=1.235008ms
xmlrpc reply from http://localhost:33463/	time=0.309944ms
xmlrpc reply from http://localhost:33463/	time=0.304937ms
xmlrpc reply from http://localhost:33463/	time=1.228094ms
xmlrpc reply from http://localhost:33463/	time=1.300812ms
xmlrpc reply from http://localhost:33463/	time=1.214981ms
xmlrpc reply from http://localhost:33463/	time=1.369953ms
xmlrpc reply from http://localhost:33463/	time=1.214981ms
xmlrpc reply from http://localhost:33463/	time=1.371145ms
xmlrpc reply from http://localhost:33463/	time=1.610041ms
xmlrpc reply from http://localhost:33463/	time=1.247883ms
xmlrpc reply from http://localhost:33463/	time=0.329971ms
xmlrpc reply from http://localhost:33463/	time=0.300169ms
xmlrpc reply from http://localhost:33463/	time=1.515865ms
xmlrpc reply from http://localhost:33463/	time=0.446081ms
xmlrpc reply from http://localhost:33463/	time=1.724005ms
xmlrpc reply from http://localhost:33463/	time=1.268148ms
xmlrpc reply from http://localhost:33463/	time=1.227856ms
xmlrpc reply from http://localhost:33463/	time=1.236916ms
xmlrpc reply from http://localhost:33463/	time=1.415968ms
xmlrpc reply from http://localhost:33463/	time=1.339912ms
xmlrpc reply from http://localhost:33463/	time=0.477076ms
xmlrpc reply from http://localhost:33463/	time=1.250029ms
xmlrpc reply from http://localhost:33463/	time=1.251936ms
xmlrpc reply from http://localhost:33463/	time=1.309872ms
xmlrpc reply from http://localhost:33463/	time=1.549006ms
xmlrpc reply from http://localhost:33463/	time=1.247883ms
xmlrpc reply from http://localhost:33463/	time=1.467228ms
xmlrpc reply from http://localhost:33463/	time=1.407862ms
xmlrpc reply from http://localhost:33463/	time=1.811028ms
xmlrpc reply from http://localhost:33463/	time=1.266003ms
xmlrpc reply from http://localhost:33463/	time=1.433134ms
xmlrpc reply from http://localhost:33463/	time=1.260996ms
xmlrpc reply from http://localhost:33463/	time=1.245022ms
xmlrpc reply from http://localhost:33463/	time=1.420975ms
xmlrpc reply from http://localhost:33463/	time=0.401020ms
xmlrpc reply from http://localhost:33463/	time=0.375986ms
xmlrpc reply from http://localhost:33463/	time=0.309944ms
xmlrpc reply from http://localhost:33463/	time=1.361847ms
xmlrpc reply from http://localhost:33463/	time=0.476837ms
xmlrpc reply from http://localhost:33463/	time=1.124144ms
xmlrpc reply from http://localhost:33463/	time=0.896931ms
xmlrpc reply from http://localhost:33463/	time=0.941038ms
xmlrpc reply from http://localhost:33463/	time=0.940800ms
xmlrpc reply from http://localhost:33463/	time=1.310110ms
xmlrpc reply from http://localhost:33463/	time=0.665903ms
xmlrpc reply from http://localhost:33463/	time=0.524998ms
xmlrpc reply from http://localhost:33463/	time=1.267910ms
xmlrpc reply from http://localhost:33463/	time=1.290083ms
xmlrpc reply from http://localhost:33463/	time=1.348972ms
xmlrpc reply from http://localhost:33463/	time=0.316858ms
xmlrpc reply from http://localhost:33463/	time=0.884056ms
xmlrpc reply from http://localhost:33463/	time=1.268864ms
xmlrpc reply from http://localhost:33463/	time=1.646996ms
xmlrpc reply from http://localhost:33463/	time=1.168013ms
xmlrpc reply from http://localhost:33463/	time=1.440048ms
xmlrpc reply from http://localhost:33463/	time=1.281023ms
xmlrpc reply from http://localhost:33463/	time=1.260042ms
xmlrpc reply from http://localhost:33463/	time=1.406908ms
xmlrpc reply from http://localhost:33463/	time=1.307964ms
xmlrpc reply from http://localhost:33463/	time=1.244068ms
xmlrpc reply from http://localhost:33463/	time=1.384020ms
xmlrpc reply from http://localhost:33463/	time=1.171827ms
xmlrpc reply from http://localhost:33463/	time=1.435041ms
xmlrpc reply from http://localhost:33463/	time=0.572920ms
xmlrpc reply from http://localhost:33463/	time=1.288891ms
xmlrpc reply from http://localhost:33463/	time=0.478983ms
xmlrpc reply from http://localhost:33463/	time=1.219034ms
xmlrpc reply from http://localhost:33463/	time=1.350164ms
xmlrpc reply from http://localhost:33463/	time=1.427174ms
xmlrpc reply from http://localhost:33463/	time=1.163960ms
xmlrpc reply from http://localhost:33463/	time=1.388073ms
xmlrpc reply from http://localhost:33463/	time=1.284838ms
xmlrpc reply from http://localhost:33463/	time=0.403881ms
xmlrpc reply from http://localhost:33463/	time=0.349045ms
xmlrpc reply from http://localhost:33463/	time=1.240015ms
xmlrpc reply from http://localhost:33463/	time=1.569986ms
xmlrpc reply from http://localhost:33463/	time=1.358986ms
xmlrpc reply from http://localhost:33463/	time=1.235008ms
xmlrpc reply from http://localhost:33463/	time=4.233122ms
xmlrpc reply from http://localhost:33463/	time=1.332045ms
xmlrpc reply from http://localhost:33463/	time=1.546860ms
xmlrpc reply from http://localhost:33463/	time=1.339912ms
xmlrpc reply from http://localhost:33463/	time=1.253128ms
xmlrpc reply from http://localhost:33463/	time=1.406908ms
xmlrpc reply from http://localhost:33463/	time=1.394987ms
xmlrpc reply from http://localhost:33463/	time=1.508951ms
xmlrpc reply from http://localhost:33463/	time=0.478983ms
xmlrpc reply from http://localhost:33463/	time=0.367880ms
xmlrpc reply from http://localhost:33463/	time=0.381947ms
xmlrpc reply from http://localhost:33463/	time=0.969887ms
xmlrpc reply from http://localhost:33463/	time=1.255035ms
xmlrpc reply from http://localhost:33463/	time=0.519991ms
xmlrpc reply from http://localhost:33463/	time=1.349211ms
xmlrpc reply from http://localhost:33463/	time=0.342131ms
xmlrpc reply from http://localhost:33463/	time=1.114130ms
xmlrpc reply from http://localhost:33463/	time=0.327110ms
xmlrpc reply from http://localhost:33463/	time=0.315905ms
xmlrpc reply from http://localhost:33463/	time=0.987053ms
xmlrpc reply from http://localhost:33463/	time=0.681162ms
xmlrpc reply from http://localhost:33463/	time=0.853062ms
xmlrpc reply from http://localhost:33463/	time=0.997066ms
xmlrpc reply from http://localhost:33463/	time=0.311136ms
xmlrpc reply from http://localhost:33463/	time=0.966072ms
xmlrpc reply from http://localhost:33463/	time=0.667095ms
xmlrpc reply from http://localhost:33463/	time=0.664949ms
xmlrpc reply from http://localhost:33463/	time=0.303030ms
xmlrpc reply from http://localhost:33463/	time=0.303984ms
xmlrpc reply from http://localhost:33463/	time=0.916004ms
xmlrpc reply from http://localhost:33463/	time=1.013994ms
xmlrpc reply from http://localhost:33463/	time=0.458956ms
xmlrpc reply from http://localhost:33463/	time=0.934124ms
xmlrpc reply from http://localhost:33463/	time=1.290083ms
xmlrpc reply from http://localhost:33463/	time=0.964880ms
xmlrpc reply from http://localhost:33463/	time=0.463963ms
xmlrpc reply from http://localhost:33463/	time=0.429153ms
xmlrpc reply from http://localhost:33463/	time=0.594854ms
xmlrpc reply from http://localhost:33463/	time=0.310898ms
xmlrpc reply from http://localhost:33463/	time=0.440121ms
xmlrpc reply from http://localhost:33463/	time=1.354933ms
xmlrpc reply from http://localhost:33463/	time=1.029968ms
xmlrpc reply from http://localhost:33463/	time=0.653028ms
xmlrpc reply from http://localhost:33463/	time=0.427008ms
xmlrpc reply from http://localhost:33463/	time=0.619173ms
xmlrpc reply from http://localhost:33463/	time=0.311136ms
xmlrpc reply from http://localhost:33463/	time=0.665188ms
xmlrpc reply from http://localhost:33463/	time=1.004219ms
xmlrpc reply from http://localhost:33463/	time=0.675917ms
xmlrpc reply from http://localhost:33463/	time=0.659943ms
xmlrpc reply from http://localhost:33463/	time=0.668049ms
xmlrpc reply from http://localhost:33463/	time=0.572920ms
xmlrpc reply from http://localhost:33463/	time=0.676155ms
xmlrpc reply from http://localhost:33463/	time=0.774145ms
xmlrpc reply from http://localhost:33463/	time=0.674963ms
xmlrpc reply from http://localhost:33463/	time=0.311852ms
xmlrpc reply from http://localhost:33463/	time=0.664949ms
xmlrpc reply from http://localhost:33463/	time=1.044989ms
xmlrpc reply from http://localhost:33463/	time=0.961065ms
xmlrpc reply from http://localhost:33463/	time=0.679016ms
xmlrpc reply from http://localhost:33463/	time=1.020193ms
xmlrpc reply from http://localhost:33463/	time=0.930786ms
xmlrpc reply from http://localhost:33463/	time=0.660896ms
xmlrpc reply from http://localhost:33463/	time=0.963926ms
xmlrpc reply from http://localhost:33463/	time=0.539064ms
xmlrpc reply from http://localhost:33463/	time=1.329899ms
xmlrpc reply from http://localhost:33463/	time=0.910997ms
xmlrpc reply from http://localhost:33463/	time=0.962973ms
xmlrpc reply from http://localhost:33463/	time=0.701904ms
xmlrpc reply from http://localhost:33463/	time=0.317097ms
xmlrpc reply from http://localhost:33463/	time=0.931978ms
xmlrpc reply from http://localhost:33463/	time=0.661135ms
xmlrpc reply from http://localhost:33463/	time=0.674963ms
xmlrpc reply from http://localhost:33463/	time=0.308990ms
xmlrpc reply from http://localhost:33463/	time=1.350880ms
xmlrpc reply from http://localhost:33463/	time=1.322031ms
xmlrpc reply from http://localhost:33463/	time=0.807047ms
xmlrpc reply from http://localhost:33463/	time=1.039028ms
xmlrpc reply from http://localhost:33463/	time=1.338959ms
xmlrpc reply from http://localhost:33463/	time=1.108885ms
xmlrpc reply from http://localhost:33463/	time=0.303030ms
xmlrpc reply from http://localhost:33463/	time=0.576019ms
xmlrpc reply from http://localhost:33463/	time=0.937939ms
xmlrpc reply from http://localhost:33463/	time=0.345945ms
xmlrpc reply from http://localhost:33463/	time=1.242876ms
xmlrpc reply from http://localhost:33463/	time=0.678778ms
xmlrpc reply from http://localhost:33463/	time=1.230001ms
xmlrpc reply from http://localhost:33463/	time=0.787973ms
xmlrpc reply from http://localhost:33463/	time=0.621080ms
xmlrpc reply from http://localhost:33463/	time=0.950098ms
xmlrpc reply from http://localhost:33463/	time=0.649929ms
xmlrpc reply from http://localhost:33463/	time=0.659943ms
xmlrpc reply from http://localhost:33463/	time=0.672817ms
xmlrpc reply from http://localhost:33463/	time=0.806093ms
xmlrpc reply from http://localhost:33463/	time=0.921965ms
xmlrpc reply from http://localhost:33463/	time=0.665903ms
xmlrpc reply from http://localhost:33463/	time=1.008034ms
xmlrpc reply from http://localhost:33463/	time=0.714064ms
xmlrpc reply from http://localhost:33463/	time=0.514030ms
xmlrpc reply from http://localhost:33463/	time=1.040936ms
xmlrpc reply from http://localhost:33463/	time=0.305891ms
xmlrpc reply from http://localhost:33463/	time=1.089811ms
xmlrpc reply from http://localhost:33463/	time=1.357079ms
xmlrpc reply from http://localhost:33463/	time=0.723839ms
xmlrpc reply from http://localhost:33463/	time=0.913858ms
xmlrpc reply from http://localhost:33463/	time=0.911951ms
xmlrpc reply from http://localhost:33463/	time=1.085997ms
xmlrpc reply from http://localhost:33463/	time=0.625849ms
xmlrpc reply from http://localhost:33463/	time=0.691891ms
xmlrpc reply from http://localhost:33463/	time=1.185894ms
xmlrpc reply from http://localhost:33463/	time=0.388145ms
xmlrpc reply from http://localhost:33463/	time=0.308037ms
xmlrpc reply from http://localhost:33463/	time=0.905991ms
xmlrpc reply from http://localhost:33463/	time=1.026869ms
xmlrpc reply from http://localhost:33463/	time=0.599146ms
xmlrpc reply from http://localhost:33463/	time=0.757217ms
xmlrpc reply from http://localhost:33463/	time=0.667095ms
xmlrpc reply from http://localhost:33463/	time=0.571966ms
xmlrpc reply from http://localhost:33463/	time=0.970125ms
xmlrpc reply from http://localhost:33463/	time=0.657082ms
xmlrpc reply from http://localhost:33463/	time=0.324011ms
xmlrpc reply from http://localhost:33463/	time=0.550032ms
xmlrpc reply from http://localhost:33463/	time=1.244068ms
xmlrpc reply from http://localhost:33463/	time=0.786066ms
xmlrpc reply from http://localhost:33463/	time=0.331163ms
xmlrpc reply from http://localhost:33463/	time=0.916004ms
xmlrpc reply from http://localhost:33463/	time=0.306129ms
xmlrpc reply from http://localhost:33463/	time=0.324011ms
xmlrpc reply from http://localhost:33463/	time=0.986814ms
xmlrpc reply from http://localhost:33463/	time=0.302076ms
xmlrpc reply from http://localhost:33463/	time=0.370026ms
xmlrpc reply from http://localhost:33463/	time=0.303030ms
xmlrpc reply from http://localhost:33463/	time=0.946045ms
xmlrpc reply from http://localhost:33463/	time=1.384974ms
xmlrpc reply from http://localhost:33463/	time=0.914097ms
xmlrpc reply from http://localhost:33463/	time=0.657082ms
xmlrpc reply from http://localhost:33463/	time=0.648975ms
xmlrpc reply from http://localhost:33463/	time=0.297070ms
xmlrpc reply from http://localhost:33463/	time=0.658989ms
xmlrpc reply from http://localhost:33463/	time=1.122952ms
xmlrpc reply from http://localhost:33463/	time=0.653028ms
xmlrpc reply from http://localhost:33463/	time=0.565052ms
xmlrpc reply from http://localhost:33463/	time=0.926971ms
xmlrpc reply from http://localhost:33463/	time=0.323057ms
xmlrpc reply from http://localhost:33463/	time=0.565052ms
xmlrpc reply from http://localhost:33463/	time=1.070023ms
xmlrpc reply from http://localhost:33463/	time=0.333071ms
xmlrpc reply from http://localhost:33463/	time=0.303030ms
xmlrpc reply from http://localhost:33463/	time=0.365973ms
xmlrpc reply from http://localhost:33463/	time=0.617027ms
xmlrpc reply from http://localhost:33463/	time=1.034975ms
xmlrpc reply from http://localhost:33463/	time=1.216888ms
xmlrpc reply from http://localhost:33463/	time=0.931978ms
xmlrpc reply from http://localhost:33463/	time=0.910044ms
xmlrpc reply from http://localhost:33463/	time=0.946999ms
xmlrpc reply from http://localhost:33463/	time=0.539064ms
xmlrpc reply from http://localhost:33463/	time=1.406908ms
xmlrpc reply from http://localhost:33463/	time=0.773907ms
xmlrpc reply from http://localhost:33463/	time=0.710964ms
xmlrpc reply from http://localhost:33463/	time=0.468016ms
xmlrpc reply from http://localhost:33463/	time=0.313997ms
xmlrpc reply from http://localhost:33463/	time=0.939131ms
xmlrpc reply from http://localhost:33463/	time=0.972986ms
xmlrpc reply from http://localhost:33463/	time=0.660181ms
xmlrpc reply from http://localhost:33463/	time=1.560926ms
xmlrpc reply from http://localhost:33463/	time=1.455069ms
xmlrpc reply from http://localhost:33463/	time=0.582933ms
xmlrpc reply from http://localhost:33463/	time=1.004934ms
xmlrpc reply from http://localhost:33463/	time=0.689030ms
xmlrpc reply from http://localhost:33463/	time=0.401020ms
xmlrpc reply from http://localhost:33463/	time=0.935078ms
xmlrpc reply from http://localhost:33463/	time=0.913858ms
xmlrpc reply from http://localhost:33463/	time=0.760078ms
xmlrpc reply from http://localhost:33463/	time=0.847101ms
xmlrpc reply from http://localhost:33463/	time=0.459194ms
xmlrpc reply from http://localhost:33463/	time=0.972033ms
xmlrpc reply from http://localhost:33463/	time=0.343084ms
xmlrpc reply from http://localhost:33463/	time=0.885010ms
xmlrpc reply from http://localhost:33463/	time=0.574112ms
xmlrpc reply from http://localhost:33463/	time=0.764132ms
xmlrpc reply from http://localhost:33463/	time=0.721931ms
xmlrpc reply from http://localhost:33463/	time=0.297070ms
xmlrpc reply from http://localhost:33463/	time=1.330853ms
xmlrpc reply from http://localhost:33463/	time=1.345158ms
xmlrpc reply from http://localhost:33463/	time=1.011133ms
xmlrpc reply from http://localhost:33463/	time=0.309944ms
xmlrpc reply from http://localhost:33463/	time=0.952005ms
xmlrpc reply from http://localhost:33463/	time=1.226902ms
xmlrpc reply from http://localhost:33463/	time=0.336885ms
xmlrpc reply from http://localhost:33463/	time=0.869036ms
xmlrpc reply from http://localhost:33463/	time=0.779867ms
xmlrpc reply from http://localhost:33463/	time=0.311852ms
xmlrpc reply from http://localhost:33463/	time=0.455141ms
xmlrpc reply from http://localhost:33463/	time=0.487089ms
xmlrpc reply from http://localhost:33463/	time=1.359940ms
xmlrpc reply from http://localhost:33463/	time=0.506878ms
xmlrpc reply from http://localhost:33463/	time=0.482082ms
xmlrpc reply from http://localhost:33463/	time=1.147032ms
xmlrpc reply from http://localhost:33463/	time=0.627995ms
xmlrpc reply from http://localhost:33463/	time=0.800848ms
xmlrpc reply from http://localhost:33463/	time=0.375032ms
xmlrpc reply from http://localhost:33463/	time=0.953913ms
xmlrpc reply from http://localhost:33463/	time=0.712872ms
xmlrpc reply from http://localhost:33463/	time=0.837088ms
xmlrpc reply from http://localhost:33463/	time=1.084805ms
xmlrpc reply from http://localhost:33463/	time=0.934124ms
xmlrpc reply from http://localhost:33463/	time=0.401974ms
xmlrpc reply from http://localhost:33463/	time=0.346899ms
xmlrpc reply from http://localhost:33463/	time=0.939846ms
xmlrpc reply from http://localhost:33463/	time=0.308990ms
xmlrpc reply from http://localhost:33463/	time=0.866890ms
xmlrpc reply from http://localhost:33463/	time=0.308990ms
xmlrpc reply from http://localhost:33463/	time=1.277924ms
xmlrpc reply from http://localhost:33463/	time=0.394106ms
xmlrpc reply from http://localhost:33463/	time=0.741005ms
xmlrpc reply from http://localhost:33463/	time=0.912905ms
xmlrpc reply from http://localhost:33463/	time=1.255989ms
xmlrpc reply from http://localhost:33463/	time=0.917912ms
xmlrpc reply from http://localhost:33463/	time=0.473976ms
xmlrpc reply from http://localhost:33463/	time=0.777006ms
xmlrpc reply from http://localhost:33463/	time=0.394106ms
xmlrpc reply from http://localhost:33463/	time=0.738859ms
xmlrpc reply from http://localhost:33463/	time=0.342131ms
xmlrpc reply from http://localhost:33463/	time=0.658989ms
xmlrpc reply from http://localhost:33463/	time=0.966072ms
xmlrpc reply from http://localhost:33463/	time=0.348091ms
xmlrpc reply from http://localhost:33463/	time=0.662088ms
xmlrpc reply from http://localhost:33463/	time=1.311064ms
xmlrpc reply from http://localhost:33463/	time=0.696182ms
xmlrpc reply from http://localhost:33463/	time=0.300169ms
xmlrpc reply from http://localhost:33463/	time=1.035213ms
xmlrpc reply from http://localhost:33463/	time=1.296997ms
xmlrpc reply from http://localhost:33463/	time=0.471830ms
xmlrpc reply from http://localhost:33463/	time=0.686169ms
xmlrpc reply from http://localhost:33463/	time=1.307011ms
xmlrpc reply from http://localhost:33463/	time=1.111031ms
xmlrpc reply from http://localhost:33463/	time=1.251936ms
xmlrpc reply from http://localhost:33463/	time=1.071930ms
xmlrpc reply from http://localhost:33463/	time=0.581980ms
xmlrpc reply from http://localhost:33463/	time=0.459194ms
xmlrpc reply from http://localhost:33463/	time=0.360966ms
xmlrpc reply from http://localhost:33463/	time=0.952959ms
xmlrpc reply from http://localhost:33463/	time=0.990868ms
xmlrpc reply from http://localhost:33463/	time=0.315905ms
xmlrpc reply from http://localhost:33463/	time=0.705004ms
xmlrpc reply from http://localhost:33463/	time=1.033068ms
xmlrpc reply from http://localhost:33463/	time=0.952959ms
xmlrpc reply from http://localhost:33463/	time=0.969172ms
xmlrpc reply from http://localhost:33463/	time=0.311136ms
xmlrpc reply from http://localhost:33463/	time=0.577927ms
xmlrpc reply from http://localhost:33463/	time=0.976086ms
xmlrpc reply from http://localhost:33463/	time=1.012087ms
xmlrpc reply from http://localhost:33463/	time=1.397848ms
xmlrpc reply from http://localhost:33463/	time=0.313997ms
xmlrpc reply from http://localhost:33463/	time=0.725031ms
xmlrpc reply from http://localhost:33463/	time=0.324965ms
xmlrpc reply from http://localhost:33463/	time=0.312805ms
xmlrpc reply from http://localhost:33463/	time=0.391006ms
xmlrpc reply from http://localhost:33463/	time=0.990152ms
xmlrpc reply from http://localhost:33463/	time=1.064062ms
xmlrpc reply from http://localhost:33463/	time=0.566006ms
xmlrpc reply from http://localhost:33463/	time=0.343084ms
xmlrpc reply from http://localhost:33463/	time=0.370979ms
xmlrpc reply from http://localhost:33463/	time=0.591993ms
xmlrpc reply from http://localhost:33463/	time=0.947952ms
xmlrpc reply from http://localhost:33463/	time=1.365185ms
xmlrpc reply from http://localhost:33463/	time=1.044035ms
xmlrpc reply from http://localhost:33463/	time=1.014948ms
xmlrpc reply from http://localhost:33463/	time=0.735044ms
xmlrpc reply from http://localhost:33463/	time=0.766039ms
xmlrpc reply from http://localhost:33463/	time=0.915051ms
xmlrpc reply from http://localhost:33463/	time=0.867128ms
xmlrpc reply from http://localhost:33463/	time=1.345873ms
xmlrpc reply from http://localhost:33463/	time=0.911951ms
xmlrpc reply from http://localhost:33463/	time=0.684023ms
xmlrpc reply from http://localhost:33463/	time=0.380039ms
xmlrpc reply from http://localhost:33463/	time=1.059055ms
xmlrpc reply from http://localhost:33463/	time=0.828028ms
xmlrpc reply from http://localhost:33463/	time=1.358032ms
xmlrpc reply from http://localhost:33463/	time=0.910044ms
xmlrpc reply from http://localhost:33463/	time=0.692844ms
xmlrpc reply from http://localhost:33463/	time=0.360012ms
xmlrpc reply from http://localhost:33463/	time=0.377178ms
xmlrpc reply from http://localhost:33463/	time=0.298023ms
xmlrpc reply from http://localhost:33463/	time=0.298977ms
xmlrpc reply from http://localhost:33463/	time=0.647068ms
xmlrpc reply from http://localhost:33463/	time=1.024961ms
xmlrpc reply from http://localhost:33463/	time=0.897884ms
xmlrpc reply from http://localhost:33463/	time=1.240969ms
xmlrpc reply from http://localhost:33463/	time=0.699997ms
xmlrpc reply from http://localhost:33463/	time=0.759125ms
xmlrpc reply from http://localhost:33463/	time=0.659943ms
xmlrpc reply from http://localhost:33463/	time=0.849962ms
xmlrpc reply from http://localhost:33463/	time=0.418901ms
xmlrpc reply from http://localhost:33463/	time=1.195192ms
xmlrpc reply from http://localhost:33463/	time=1.104832ms
xmlrpc reply from http://localhost:33463/	time=1.281977ms
xmlrpc reply from http://localhost:33463/	time=0.286818ms
xmlrpc reply from http://localhost:33463/	time=1.405954ms
xmlrpc reply from http://localhost:33463/	time=0.318050ms
xmlrpc reply from http://localhost:33463/	time=1.029968ms
xmlrpc reply from http://localhost:33463/	time=0.403881ms
xmlrpc reply from http://localhost:33463/	time=1.060009ms
xmlrpc reply from http://localhost:33463/	time=0.742912ms
xmlrpc reply from http://localhost:33463/	time=0.415087ms
xmlrpc reply from http://localhost:33463/	time=0.911951ms
xmlrpc reply from http://localhost:33463/	time=0.368118ms
xmlrpc reply from http://localhost:33463/	time=1.108885ms
xmlrpc reply from http://localhost:33463/	time=1.012087ms
xmlrpc reply from http://localhost:33463/	time=0.655890ms
xmlrpc reply from http://localhost:33463/	time=0.906944ms
xmlrpc reply from http://localhost:33463/	time=0.975132ms
xmlrpc reply from http://localhost:33463/	time=0.668049ms
xmlrpc reply from http://localhost:33463/	time=1.103878ms
xmlrpc reply from http://localhost:33463/	time=1.209021ms
xmlrpc reply from http://localhost:33463/	time=1.332998ms
xmlrpc reply from http://localhost:33463/	time=0.619888ms
xmlrpc reply from http://localhost:33463/	time=0.568867ms
xmlrpc reply from http://localhost:33463/	time=0.958204ms
xmlrpc reply from http://localhost:33463/	time=1.361132ms
xmlrpc reply from http://localhost:33463/	time=0.451088ms
xmlrpc reply from http://localhost:33463/	time=0.474930ms
xmlrpc reply from http://localhost:33463/	time=0.644922ms
xmlrpc reply from http://localhost:33463/	time=0.421047ms
xmlrpc reply from http://localhost:33463/	time=0.633955ms
xmlrpc reply from http://localhost:33463/	time=0.711203ms
xmlrpc reply from http://localhost:33463/	time=0.311136ms
xmlrpc reply from http://localhost:33463/	time=0.659943ms
xmlrpc reply from http://localhost:33463/	time=1.473904ms
xmlrpc reply from http://localhost:33463/	time=0.996113ms
xmlrpc reply from http://localhost:33463/	time=0.981092ms
xmlrpc reply from http://localhost:33463/	time=1.070976ms
xmlrpc reply from http://localhost:33463/	time=0.300884ms
xmlrpc reply from http://localhost:33463/	time=0.297070ms
xmlrpc reply from http://localhost:33463/	time=0.848770ms
xmlrpc reply from http://localhost:33463/	time=1.430035ms
xmlrpc reply from http://localhost:33463/	time=0.914097ms
xmlrpc reply from http://localhost:33463/	time=1.360893ms
xmlrpc reply from http://localhost:33463/	time=0.547171ms
xmlrpc reply from http://localhost:33463/	time=1.336098ms
xmlrpc reply from http://localhost:33463/	time=0.308990ms
xmlrpc reply from http://localhost:33463/	time=0.615120ms
xmlrpc reply from http://localhost:33463/	time=0.783205ms
xmlrpc reply from http://localhost:33463/	time=0.740051ms
xmlrpc reply from http://localhost:33463/	time=1.258135ms
xmlrpc reply from http://localhost:33463/	time=0.937939ms
xmlrpc reply from http://localhost:33463/	time=1.619101ms
xmlrpc reply from http://localhost:33463/	time=1.123190ms
xmlrpc reply from http://localhost:33463/	time=0.645161ms
xmlrpc reply from http://localhost:33463/	time=1.327038ms
xmlrpc reply from http://localhost:33463/	time=0.828028ms
xmlrpc reply from http://localhost:33463/	time=0.925064ms
xmlrpc reply from http://localhost:33463/	time=1.027822ms
xmlrpc reply from http://localhost:33463/	time=0.990868ms
xmlrpc reply from http://localhost:33463/	time=0.488997ms
xmlrpc reply from http://localhost:33463/	time=1.002073ms
xmlrpc reply from http://localhost:33463/	time=0.308990ms
xmlrpc reply from http://localhost:33463/	time=0.345945ms
xmlrpc reply from http://localhost:33463/	time=0.957012ms
xmlrpc reply from http://localhost:33463/	time=0.565052ms
xmlrpc reply from http://localhost:33463/	time=0.997066ms
xmlrpc reply from http://localhost:33463/	time=1.116991ms
xmlrpc reply from http://localhost:33463/	time=0.306129ms
xmlrpc reply from http://localhost:33463/	time=0.991106ms
xmlrpc reply from http://localhost:33463/	time=0.460148ms
xmlrpc reply from http://localhost:33463/	time=0.926971ms
xmlrpc reply from http://localhost:33463/	time=1.445055ms
xmlrpc reply from http://localhost:33463/	time=0.773907ms
xmlrpc reply from http://localhost:33463/	time=0.479937ms
xmlrpc reply from http://localhost:33463/	time=1.213789ms
xmlrpc reply from http://localhost:33463/	time=0.902891ms
xmlrpc reply from http://localhost:33463/	time=0.338078ms
xmlrpc reply from http://localhost:33463/	time=0.899076ms
xmlrpc reply from http://localhost:33463/	time=0.658035ms
xmlrpc reply from http://localhost:33463/	time=0.967979ms
xmlrpc reply from http://localhost:33463/	time=0.756025ms
xmlrpc reply from http://localhost:33463/	time=0.300169ms
xmlrpc reply from http://localhost:33463/	time=1.049995ms
xmlrpc reply from http://localhost:33463/	time=0.428915ms
xmlrpc reply from http://localhost:33463/	time=1.063108ms
xmlrpc reply from http://localhost:33463/	time=0.551939ms
xmlrpc reply from http://localhost:33463/	time=0.710964ms
xmlrpc reply from http://localhost:33463/	time=0.297785ms
xmlrpc reply from http://localhost:33463/	time=0.586033ms
xmlrpc reply from http://localhost:33463/	time=0.708103ms
xmlrpc reply from http://localhost:33463/	time=0.960112ms
xmlrpc reply from http://localhost:33463/	time=0.931978ms
xmlrpc reply from http://localhost:33463/	time=0.293970ms
xmlrpc reply from http://localhost:33463/	time=0.690937ms
xmlrpc reply from http://localhost:33463/	time=0.919819ms
xmlrpc reply from http://localhost:33463/	time=1.235008ms
xmlrpc reply from http://localhost:33463/	time=0.550985ms
xmlrpc reply from http://localhost:33463/	time=0.929832ms
xmlrpc reply from http://localhost:33463/	time=0.297070ms
xmlrpc reply from http://localhost:33463/	time=1.087904ms
xmlrpc reply from http://localhost:33463/	time=0.959873ms
xmlrpc reply from http://localhost:33463/	time=0.308990ms
xmlrpc reply from http://localhost:33463/	time=0.713825ms
xmlrpc reply from http://localhost:33463/	time=0.411034ms
xmlrpc reply from http://localhost:33463/	time=1.183987ms
xmlrpc reply from http://localhost:33463/	time=0.365019ms
xmlrpc reply from http://localhost:33463/	time=1.052856ms
xmlrpc reply from http://localhost:33463/	time=0.972033ms
xmlrpc reply from http://localhost:33463/	time=0.452042ms
xmlrpc reply from http://localhost:33463/	time=0.566006ms
xmlrpc reply from http://localhost:33463/	time=0.334978ms
xmlrpc reply from http://localhost:33463/	time=0.653982ms
xmlrpc reply from http://localhost:33463/	time=0.851870ms
xmlrpc reply from http://localhost:33463/	time=0.498056ms
xmlrpc reply from http://localhost:33463/	time=0.885963ms
xmlrpc reply from http://localhost:33463/	time=1.075029ms
xmlrpc reply from http://localhost:33463/	time=0.901937ms
xmlrpc reply from http://localhost:33463/	time=0.647068ms
xmlrpc reply from http://localhost:33463/	time=0.373840ms
xmlrpc reply from http://localhost:33463/	time=0.384092ms
xmlrpc reply from http://localhost:33463/	time=0.632048ms
xmlrpc reply from http://localhost:33463/	time=1.041889ms
xmlrpc reply from http://localhost:33463/	time=0.598907ms
xmlrpc reply from http://localhost:33463/	time=0.658989ms
xmlrpc reply from http://localhost:33463/	time=0.355959ms
xmlrpc reply from http://localhost:33463/	time=0.557899ms
xmlrpc reply from http://localhost:33463/	time=0.952005ms
xmlrpc reply from http://localhost:33463/	time=0.947952ms
xmlrpc reply from http://localhost:33463/	time=0.298023ms
xmlrpc reply from http://localhost:33463/	time=0.941992ms
xmlrpc reply from http://localhost:33463/	time=0.302076ms
xmlrpc reply from http://localhost:33463/	time=0.721931ms
xmlrpc reply from http://localhost:33463/	time=0.457048ms
xmlrpc reply from http://localhost:33463/	time=0.299931ms
xmlrpc reply from http://localhost:33463/	time=1.002073ms
xmlrpc reply from http://localhost:33463/	time=1.030922ms
xmlrpc reply from http://localhost:33463/	time=0.310898ms
xmlrpc reply from http://localhost:33463/	time=0.332832ms
xmlrpc reply from http://localhost:33463/	time=0.314951ms
xmlrpc reply from http://localhost:33463/	time=1.090050ms
xmlrpc reply from http://localhost:33463/	time=1.384020ms
xmlrpc reply from http://localhost:33463/	time=0.344992ms
xmlrpc reply from http://localhost:33463/	time=0.386000ms
xmlrpc reply from http://localhost:33463/	time=0.964880ms
xmlrpc reply from http://localhost:33463/	time=0.770092ms
xmlrpc reply from http://localhost:33463/	time=0.491858ms
xmlrpc reply from http://localhost:33463/	time=0.324011ms
xmlrpc reply from http://localhost:33463/	time=0.851154ms
xmlrpc reply from http://localhost:33463/	time=1.111031ms
xmlrpc reply from http://localhost:33463/	time=0.982046ms
xmlrpc reply from http://localhost:33463/	time=1.580954ms
xmlrpc reply from http://localhost:33463/	time=0.692844ms
xmlrpc reply from http://localhost:33463/	time=0.717163ms
xmlrpc reply from http://localhost:33463/	time=0.794172ms
xmlrpc reply from http://localhost:33463/	time=0.894070ms
xmlrpc reply from http://localhost:33463/	time=0.400066ms
xmlrpc reply from http://localhost:33463/	time=0.946045ms
xmlrpc reply from http://localhost:33463/	time=1.031876ms
xmlrpc reply from http://localhost:33463/	time=1.224995ms
xmlrpc reply from http://localhost:33463/	time=1.000881ms
xmlrpc reply from http://localhost:33463/	time=0.290871ms
xmlrpc reply from http://localhost:33463/	time=0.460863ms
xmlrpc reply from http://localhost:33463/	time=0.291109ms
xmlrpc reply from http://localhost:33463/	time=0.905037ms
xmlrpc reply from http://localhost:33463/	time=0.573158ms
xmlrpc reply from http://localhost:33463/	time=0.349045ms
xmlrpc reply from http://localhost:33463/	time=1.269102ms
xmlrpc reply from http://localhost:33463/	time=0.304937ms
xmlrpc reply from http://localhost:33463/	time=0.674963ms
xmlrpc reply from http://localhost:33463/	time=0.401020ms
xmlrpc reply from http://localhost:33463/	time=0.566006ms
xmlrpc reply from http://localhost:33463/	time=0.795841ms
xmlrpc reply from http://localhost:33463/	time=1.338005ms
xmlrpc reply from http://localhost:33463/	time=0.319004ms
xmlrpc reply from http://localhost:33463/	time=1.021147ms
xmlrpc reply from http://localhost:33463/	time=0.308037ms
xmlrpc reply from http://localhost:33463/	time=1.317024ms
xmlrpc reply from http://localhost:33463/	time=1.379013ms
xmlrpc reply from http://localhost:33463/	time=0.365019ms
xmlrpc reply from http://localhost:33463/	time=1.019001ms
xmlrpc reply from http://localhost:33463/	time=0.388145ms
xmlrpc reply from http://localhost:33463/	time=0.306845ms
xmlrpc reply from http://localhost:33463/	time=0.295162ms
xmlrpc reply from http://localhost:33463/	time=1.286983ms
xmlrpc reply from http://localhost:33463/	time=0.650883ms
xmlrpc reply from http://localhost:33463/	time=0.912905ms
xmlrpc reply from http://localhost:33463/	time=1.227140ms
xmlrpc reply from http://localhost:33463/	time=0.322104ms
xmlrpc reply from http://localhost:33463/	time=0.367880ms
xmlrpc reply from http://localhost:33463/	time=0.996828ms
xmlrpc reply from http://localhost:33463/	time=0.651836ms
xmlrpc reply from http://localhost:33463/	time=1.366854ms
xmlrpc reply from http://localhost:33463/	time=0.925064ms
xmlrpc reply from http://localhost:33463/	time=0.355959ms
xmlrpc reply from http://localhost:33463/	time=0.927925ms
xmlrpc reply from http://localhost:33463/	time=1.229048ms
xmlrpc reply from http://localhost:33463/	time=0.653982ms
xmlrpc reply from http://localhost:33463/	time=1.224041ms
xmlrpc reply from http://localhost:33463/	time=0.308037ms
xmlrpc reply from http://localhost:33463/	time=0.658035ms
xmlrpc reply from http://localhost:33463/	time=0.924110ms
xmlrpc reply from http://localhost:33463/	time=0.296116ms
xmlrpc reply from http://localhost:33463/	time=0.603914ms
xmlrpc reply from http://localhost:33463/	time=0.446081ms
xmlrpc reply from http://localhost:33463/	time=0.900030ms
xmlrpc reply from http://localhost:33463/	time=1.091003ms
xmlrpc reply from http://localhost:33463/	time=0.969172ms
xmlrpc reply from http://localhost:33463/	time=0.946999ms
xmlrpc reply from http://localhost:33463/	time=1.239061ms
xmlrpc reply from http://localhost:33463/	time=0.306129ms
xmlrpc reply from http://localhost:33463/	time=0.488043ms
xmlrpc reply from http://localhost:33463/	time=0.606775ms
xmlrpc reply from http://localhost:33463/	time=0.306129ms
xmlrpc reply from http://localhost:33463/	time=0.844955ms
xmlrpc reply from http://localhost:33463/	time=1.024961ms
xmlrpc reply from http://localhost:33463/	time=1.395941ms
xmlrpc reply from http://localhost:33463/	time=1.263142ms
xmlrpc reply from http://localhost:33463/	time=1.448870ms
xmlrpc reply from http://localhost:33463/	time=0.653028ms
xmlrpc reply from http://localhost:33463/	time=0.663996ms
xmlrpc reply from http://localhost:33463/	time=0.567913ms
xmlrpc reply from http://localhost:33463/	time=1.095057ms
xmlrpc reply from http://localhost:33463/	time=1.279116ms
xmlrpc reply from http://localhost:33463/	time=0.668049ms
xmlrpc reply from http://localhost:33463/	time=0.408888ms
xmlrpc reply from http://localhost:33463/	time=0.663042ms
xmlrpc reply from http://localhost:33463/	time=0.926971ms
xmlrpc reply from http://localhost:33463/	time=0.708103ms
xmlrpc reply from http://localhost:33463/	time=0.298023ms
xmlrpc reply from http://localhost:33463/	time=1.126051ms
xmlrpc reply from http://localhost:33463/	time=0.916958ms
xmlrpc reply from http://localhost:33463/	time=0.656843ms
xmlrpc reply from http://localhost:33463/	time=0.987053ms
xmlrpc reply from http://localhost:33463/	time=0.514984ms
xmlrpc reply from http://localhost:33463/	time=1.408100ms
xmlrpc reply from http://localhost:33463/	time=0.308037ms
xmlrpc reply from http://localhost:33463/	time=1.296043ms
xmlrpc reply from http://localhost:33463/	time=1.397848ms
xmlrpc reply from http://localhost:33463/	time=0.309944ms
xmlrpc reply from http://localhost:33463/	time=0.921011ms
xmlrpc reply from http://localhost:33463/	time=0.664949ms
xmlrpc reply from http://localhost:33463/	time=0.528812ms
xmlrpc reply from http://localhost:33463/	time=0.932932ms
xmlrpc reply from http://localhost:33463/	time=1.347065ms
xmlrpc reply from http://localhost:33463/	time=0.843048ms
xmlrpc reply from http://localhost:33463/	time=1.121998ms
xmlrpc reply from http://localhost:33463/	time=0.814915ms
xmlrpc reply from http://localhost:33463/	time=0.328064ms
xmlrpc reply from http://localhost:33463/	time=0.843048ms
xmlrpc reply from http://localhost:33463/	time=0.350952ms
xmlrpc reply from http://localhost:33463/	time=0.421047ms
xmlrpc reply from http://localhost:33463/	time=0.354052ms
xmlrpc reply from http://localhost:33463/	time=0.895023ms
xmlrpc reply from http://localhost:33463/	time=1.253128ms
xmlrpc reply from http://localhost:33463/	time=0.370979ms
xmlrpc reply from http://localhost:33463/	time=0.658035ms
xmlrpc reply from http://localhost:33463/	time=0.410080ms
xmlrpc reply from http://localhost:33463/	time=1.231194ms
xmlrpc reply from http://localhost:33463/	time=0.918150ms
xmlrpc reply from http://localhost:33463/	time=0.705957ms
xmlrpc reply from http://localhost:33463/	time=0.304937ms
xmlrpc reply from http://localhost:33463/	time=0.377893ms
xmlrpc reply from http://localhost:33463/	time=0.949860ms
xmlrpc reply from http://localhost:33463/	time=1.444101ms
xmlrpc reply from http://localhost:33463/	time=0.653982ms
xmlrpc reply from http://localhost:33463/	time=1.269102ms
xmlrpc reply from http://localhost:33463/	time=0.920057ms
xmlrpc reply from http://localhost:33463/	time=0.663042ms
xmlrpc reply from http://localhost:33463/	time=0.993013ms
xmlrpc reply from http://localhost:33463/	time=0.947952ms
xmlrpc reply from http://localhost:33463/	time=0.599861ms
xmlrpc reply from http://localhost:33463/	time=0.411987ms
xmlrpc reply from http://localhost:33463/	time=0.375986ms
xmlrpc reply from http://localhost:33463/	time=0.643969ms
xmlrpc reply from http://localhost:33463/	time=1.271963ms
xmlrpc reply from http://localhost:33463/	time=0.913143ms
xmlrpc reply from http://localhost:33463/	time=0.946045ms
xmlrpc reply from http://localhost:33463/	time=0.409126ms
xmlrpc reply from http://localhost:33463/	time=0.711918ms
xmlrpc reply from http://localhost:33463/	time=1.433134ms
xmlrpc reply from http://localhost:33463/	time=0.293016ms
xmlrpc reply from http://localhost:33463/	time=0.698090ms
xmlrpc reply from http://localhost:33463/	time=0.689030ms
xmlrpc reply from http://localhost:33463/	time=0.352859ms
xmlrpc reply from http://localhost:33463/	time=1.205921ms
xmlrpc reply from http://localhost:33463/	time=0.995159ms
xmlrpc reply from http://localhost:33463/	time=0.663996ms
xmlrpc reply from http://localhost:33463/	time=0.653982ms
xmlrpc reply from http://localhost:33463/	time=0.649214ms
xmlrpc reply from http://localhost:33463/	time=0.296831ms
xmlrpc reply from http://localhost:33463/	time=0.520945ms
xmlrpc reply from http://localhost:33463/	time=0.654936ms
xmlrpc reply from http://localhost:33463/	time=1.098871ms
xmlrpc reply from http://localhost:33463/	time=0.380039ms
xmlrpc reply from http://localhost:33463/	time=1.042128ms
xmlrpc reply from http://localhost:33463/	time=1.019001ms
xmlrpc reply from http://localhost:33463/	time=0.304937ms
xmlrpc reply from http://localhost:33463/	time=0.305891ms
xmlrpc reply from http://localhost:33463/	time=0.931025ms
xmlrpc reply from http://localhost:33463/	time=0.323057ms
xmlrpc reply from http://localhost:33463/	time=0.967979ms
xmlrpc reply from http://localhost:33463/	time=1.152039ms
xmlrpc reply from http://localhost:33463/	time=0.308037ms
xmlrpc reply from http://localhost:33463/	time=0.468016ms
xmlrpc reply from http://localhost:33463/	time=1.347780ms
xmlrpc reply from http://localhost:33463/	time=0.499010ms
xmlrpc reply from http://localhost:33463/	time=1.060963ms
xmlrpc reply from http://localhost:33463/	time=0.317097ms
xmlrpc reply from http://localhost:33463/	time=0.930071ms
xmlrpc reply from http://localhost:33463/	time=1.003981ms
xmlrpc reply from http://localhost:33463/	time=1.063108ms
xmlrpc reply from http://localhost:33463/	time=0.739098ms
xmlrpc reply from http://localhost:33463/	time=0.358105ms
xmlrpc reply from http://localhost:33463/	time=0.313044ms
xmlrpc reply from http://localhost:33463/	time=1.553059ms
xmlrpc reply from http://localhost:33463/	time=0.705957ms
xmlrpc reply from http://localhost:33463/	time=0.645161ms
xmlrpc reply from http://localhost:33463/	time=0.391006ms
xmlrpc reply from http://localhost:33463/	time=1.230001ms
xmlrpc reply from http://localhost:33463/	time=0.324011ms
xmlrpc reply from http://localhost:33463/	time=1.229048ms
xmlrpc reply from http://localhost:33463/	time=0.429869ms
xmlrpc reply from http://localhost:33463/	time=1.426935ms
xmlrpc reply from http://localhost:33463/	time=1.433849ms
xmlrpc reply from http://localhost:33463/	time=0.649929ms
xmlrpc reply from http://localhost:33463/	time=1.514196ms
xmlrpc reply from http://localhost:33463/	time=1.311064ms
xmlrpc reply from http://localhost:33463/	time=1.247168ms
xmlrpc reply from http://localhost:33463/	time=1.224995ms
xmlrpc reply from http://localhost:33463/	time=0.304937ms
xmlrpc reply from http://localhost:33463/	time=0.365973ms
xmlrpc reply from http://localhost:33463/	time=1.220942ms
xmlrpc reply from http://localhost:33463/	time=1.237869ms
xmlrpc reply from http://localhost:33463/	time=1.240969ms
xmlrpc reply from http://localhost:33463/	time=1.237154ms
xmlrpc reply from http://localhost:33463/	time=1.528025ms
xmlrpc reply from http://localhost:33463/	time=1.268864ms
xmlrpc reply from http://localhost:33463/	time=1.231194ms
xmlrpc reply from http://localhost:33463/	time=1.605988ms
xmlrpc reply from http://localhost:33463/	time=1.291037ms
xmlrpc reply from http://localhost:33463/	time=1.690149ms
xmlrpc reply from http://localhost:33463/	time=1.262188ms
xmlrpc reply from http://localhost:33463/	time=1.487970ms
xmlrpc reply from http://localhost:33463/	time=1.725912ms
xmlrpc reply from http://localhost:33463/	time=1.436949ms
xmlrpc reply from http://localhost:33463/	time=1.524210ms
xmlrpc reply from http://localhost:33463/	time=1.372099ms
xmlrpc reply from http://localhost:33463/	time=1.238108ms
xmlrpc reply from http://localhost:33463/	time=1.796007ms
xmlrpc reply from http://localhost:33463/	time=1.172066ms
xmlrpc reply from http://localhost:33463/	time=1.246929ms
xmlrpc reply from http://localhost:33463/	time=1.806974ms
xmlrpc reply from http://localhost:33463/	time=0.308990ms
xmlrpc reply from http://localhost:33463/	time=1.243114ms
xmlrpc reply from http://localhost:33463/	time=1.373053ms
xmlrpc reply from http://localhost:33463/	time=1.836061ms
xmlrpc reply from http://localhost:33463/	time=1.713037ms
xmlrpc reply from http://localhost:33463/	time=0.663996ms
xmlrpc reply from http://localhost:33463/	time=1.082897ms
xmlrpc reply from http://localhost:33463/	time=1.357794ms
xmlrpc reply from http://localhost:33463/	time=1.358032ms
xmlrpc reply from http://localhost:33463/	time=1.255989ms
xmlrpc reply from http://localhost:33463/	time=0.314951ms
xmlrpc reply from http://localhost:33463/	time=1.235962ms
xmlrpc reply from http://localhost:33463/	time=0.936031ms
xmlrpc reply from http://localhost:33463/	time=1.329899ms
xmlrpc reply from http://localhost:33463/	time=1.410007ms
xmlrpc reply from http://localhost:33463/	time=1.406908ms
xmlrpc reply from http://localhost:33463/	time=1.401901ms
xmlrpc reply from http://localhost:33463/	time=1.574993ms
xmlrpc reply from http://localhost:33463/	time=1.256943ms
xmlrpc reply from http://localhost:33463/	time=1.406908ms
xmlrpc reply from http://localhost:33463/	time=1.371861ms
xmlrpc reply from http://localhost:33463/	time=1.354933ms
xmlrpc reply from http://localhost:33463/	time=1.255989ms
xmlrpc reply from http://localhost:33463/	time=1.345873ms
xmlrpc reply from http://localhost:33463/	time=0.966072ms
xmlrpc reply from http://localhost:33463/	time=0.292063ms
xmlrpc reply from http://localhost:33463/	time=0.303030ms
xmlrpc reply from http://localhost:33463/	time=0.571966ms
xmlrpc reply from http://localhost:33463/	time=0.599146ms
xmlrpc reply from http://localhost:33463/	time=0.659943ms
xmlrpc reply from http://localhost:33463/	time=1.325130ms
xmlrpc reply from http://localhost:33463/	time=0.663996ms
xmlrpc reply from http://localhost:33463/	time=0.894070ms
xmlrpc reply from http://localhost:33463/	time=0.607967ms
xmlrpc reply from http://localhost:33463/	time=1.220942ms
xmlrpc reply from http://localhost:33463/	time=1.353025ms
xmlrpc reply from http://localhost:33463/	time=1.250982ms
xmlrpc reply from http://localhost:33463/	time=0.386000ms
xmlrpc reply from http://localhost:33463/	time=1.235008ms
xmlrpc reply from http://localhost:33463/	time=1.260042ms
xmlrpc reply from http://localhost:33463/	time=1.255035ms
xmlrpc reply from http://localhost:33463/	time=1.226902ms
xmlrpc reply from http://localhost:33463/	time=1.296043ms
xmlrpc reply from http://localhost:33463/	time=1.303196ms
xmlrpc reply from http://localhost:33463/	time=1.351118ms
xmlrpc reply from http://localhost:33463/	time=1.436949ms
xmlrpc reply from http://localhost:33463/	time=1.532078ms
xmlrpc reply from http://localhost:33463/	time=1.319170ms
xmlrpc reply from http://localhost:33463/	time=1.230955ms
xmlrpc reply from http://localhost:33463/	time=1.234055ms
xmlrpc reply from http://localhost:33463/	time=0.419855ms
xmlrpc reply from http://localhost:33463/	time=1.228094ms
xmlrpc reply from http://localhost:33463/	time=1.119852ms
xmlrpc reply from http://localhost:33463/	time=1.221895ms
xmlrpc reply from http://localhost:33463/	time=1.232862ms
xmlrpc reply from http://localhost:33463/	time=1.372099ms
xmlrpc reply from http://localhost:33463/	time=1.226187ms
xmlrpc reply from http://localhost:33463/	time=1.360893ms
xmlrpc reply from http://localhost:33463/	time=1.394987ms
xmlrpc reply from http://localhost:33463/	time=0.400782ms
xmlrpc reply from http://localhost:33463/	time=1.326084ms
xmlrpc reply from http://localhost:33463/	time=1.250982ms
xmlrpc reply from http://localhost:33463/	time=1.193047ms
xmlrpc reply from http://localhost:33463/	time=1.422882ms
xmlrpc reply from http://localhost:33463/	time=1.245975ms
xmlrpc reply from http://localhost:33463/	time=1.412868ms
xmlrpc reply from http://localhost:33463/	time=1.199961ms
xmlrpc reply from http://localhost:33463/	time=0.299931ms
xmlrpc reply from http://localhost:33463/	time=0.543118ms
xmlrpc reply from http://localhost:33463/	time=1.335859ms
xmlrpc reply from http://localhost:33463/	time=1.592159ms
xmlrpc reply from http://localhost:33463/	time=1.330853ms
xmlrpc reply from http://localhost:33463/	time=1.370907ms
xmlrpc reply from http://localhost:33463/	time=1.250029ms
xmlrpc reply from http://localhost:33463/	time=1.278877ms
xmlrpc reply from http://localhost:33463/	time=1.348019ms
xmlrpc reply from http://localhost:33463/	time=1.264095ms
xmlrpc reply from http://localhost:33463/	time=0.312090ms
xmlrpc reply from http://localhost:33463/	time=1.451015ms
xmlrpc reply from http://localhost:33463/	time=1.384020ms
xmlrpc reply from http://localhost:33463/	time=1.543999ms
xmlrpc reply from http://localhost:33463/	time=1.237869ms
xmlrpc reply from http://localhost:33463/	time=1.321077ms
xmlrpc reply from http://localhost:33463/	time=1.276970ms
xmlrpc reply from http://localhost:33463/	time=1.278877ms
xmlrpc reply from http://localhost:33463/	time=1.359940ms
xmlrpc reply from http://localhost:33463/	time=1.303911ms
xmlrpc reply from http://localhost:33463/	time=1.244068ms
xmlrpc reply from http://localhost:33463/	time=1.253128ms
xmlrpc reply from http://localhost:33463/	time=1.355171ms
xmlrpc reply from http://localhost:33463/	time=0.363111ms
xmlrpc reply from http://localhost:33463/	time=1.343012ms
xmlrpc reply from http://localhost:33463/	time=1.255035ms
xmlrpc reply from http://localhost:33463/	time=1.326084ms
xmlrpc reply from http://localhost:33463/	time=1.266003ms
xmlrpc reply from http://localhost:33463/	time=1.271963ms
xmlrpc reply from http://localhost:33463/	time=0.496149ms
xmlrpc reply from http://localhost:33463/	time=0.448942ms
xmlrpc reply from http://localhost:33463/	time=0.545979ms
xmlrpc reply from http://localhost:33463/	time=0.705957ms
xmlrpc reply from http://localhost:33463/	time=1.692057ms
xmlrpc reply from http://localhost:33463/	time=1.687050ms
xmlrpc reply from http://localhost:33463/	time=1.197100ms
xmlrpc reply from http://localhost:33463/	time=1.267195ms
xmlrpc reply from http://localhost:33463/	time=0.316858ms
xmlrpc reply from http://localhost:33463/	time=1.238108ms
xmlrpc reply from http://localhost:33463/	time=0.869036ms
xmlrpc reply from http://localhost:33463/	time=1.384020ms
xmlrpc reply from http://localhost:33463/	time=1.429081ms
xmlrpc reply from http://localhost:33463/	time=1.216173ms
xmlrpc reply from http://localhost:33463/	time=1.231909ms
xmlrpc reply from http://localhost:33463/	time=1.317024ms
xmlrpc reply from http://localhost:33463/	time=1.372099ms
xmlrpc reply from http://localhost:33463/	time=0.475883ms
xmlrpc reply from http://localhost:33463/	time=1.239061ms
xmlrpc reply from http://localhost:33463/	time=1.534939ms
xmlrpc reply from http://localhost:33463/	time=1.313925ms
xmlrpc reply from http://localhost:33463/	time=1.569033ms
xmlrpc reply from http://localhost:33463/	time=1.255035ms
xmlrpc reply from http://localhost:33463/	time=1.283169ms
xmlrpc reply from http://localhost:33463/	time=1.496077ms
xmlrpc reply from http://localhost:33463/	time=1.355886ms
xmlrpc reply from http://localhost:33463/	time=1.420021ms
xmlrpc reply from http://localhost:33463/	time=1.342058ms
xmlrpc reply from http://localhost:33463/	time=1.322031ms
xmlrpc reply from http://localhost:33463/	time=1.255989ms
xmlrpc reply from http://localhost:33463/	time=1.257896ms
xmlrpc reply from http://localhost:33463/	time=1.482964ms
xmlrpc reply from http://localhost:33463/	time=1.254082ms
xmlrpc reply from http://localhost:33463/	time=1.276016ms
xmlrpc reply from http://localhost:33463/	time=1.420975ms
xmlrpc reply from http://localhost:33463/	time=0.663042ms
xmlrpc reply from http://localhost:33463/	time=1.322031ms
xmlrpc reply from http://localhost:33463/	time=1.528978ms
xmlrpc reply from http://localhost:33463/	time=1.590967ms
xmlrpc reply from http://localhost:33463/	time=1.336098ms
xmlrpc reply from http://localhost:33463/	time=1.269102ms
xmlrpc reply from http://localhost:33463/	time=1.374006ms
xmlrpc reply from http://localhost:33463/	time=1.340866ms
xmlrpc reply from http://localhost:33463/	time=1.605988ms
xmlrpc reply from http://localhost:33463/	time=1.260996ms
xmlrpc reply from http://localhost:33463/	time=1.922131ms
xmlrpc reply from http://localhost:33463/	time=1.319885ms
xmlrpc reply from http://localhost:33463/	time=1.300812ms
xmlrpc reply from http://localhost:33463/	time=1.399040ms
xmlrpc reply from http://localhost:33463/	time=1.619101ms
xmlrpc reply from http://localhost:33463/	time=1.399040ms
xmlrpc reply from http://localhost:33463/	time=1.490116ms
xmlrpc reply from http://localhost:33463/	time=1.700163ms
xmlrpc reply from http://localhost:33463/	time=1.344919ms
xmlrpc reply from http://localhost:33463/	time=1.335144ms
xmlrpc reply from http://localhost:33463/	time=1.366854ms
xmlrpc reply from http://localhost:33463/	time=1.349926ms
xmlrpc reply from http://localhost:33463/	time=1.446009ms
xmlrpc reply from http://localhost:33463/	time=1.242161ms
xmlrpc reply from http://localhost:33463/	time=1.245022ms
xmlrpc reply from http://localhost:33463/	time=1.383781ms
xmlrpc reply from http://localhost:33463/	time=1.461983ms
xmlrpc reply from http://localhost:33463/	time=1.249075ms
xmlrpc reply from http://localhost:33463/	time=1.236916ms
xmlrpc reply from http://localhost:33463/	time=1.396894ms
xmlrpc reply from http://localhost:33463/	time=1.241207ms
xmlrpc reply from http://localhost:33463/	time=0.335932ms
xmlrpc reply from http://localhost:33463/	time=1.365900ms
xmlrpc reply from http://localhost:33463/	time=1.260042ms
xmlrpc reply from http://localhost:33463/	time=1.436949ms
xmlrpc reply from http://localhost:33463/	time=1.257896ms
xmlrpc reply from http://localhost:33463/	time=1.332045ms
xmlrpc reply from http://localhost:33463/	time=1.230955ms
xmlrpc reply from http://localhost:33463/	time=1.490116ms
xmlrpc reply from http://localhost:33463/	time=1.379013ms
xmlrpc reply from http://localhost:33463/	time=1.475096ms
xmlrpc reply from http://localhost:33463/	time=1.393080ms
xmlrpc reply from http://localhost:33463/	time=1.459122ms
xmlrpc reply from http://localhost:33463/	time=1.368999ms
xmlrpc reply from http://localhost:33463/	time=1.453876ms
xmlrpc reply from http://localhost:33463/	time=1.245022ms
xmlrpc reply from http://localhost:33463/	time=0.290871ms
xmlrpc reply from http://localhost:33463/	time=0.938892ms
xmlrpc reply from http://localhost:33463/	time=0.319004ms
xmlrpc reply from http://localhost:33463/	time=0.319958ms
xmlrpc reply from http://localhost:33463/	time=0.310898ms
xmlrpc reply from http://localhost:33463/	time=0.304937ms
xmlrpc reply from http://localhost:33463/	time=1.284122ms
xmlrpc reply from http://localhost:33463/	time=0.375032ms
xmlrpc reply from http://localhost:33463/	time=0.318050ms
xmlrpc reply from http://localhost:33463/	time=0.330925ms
xmlrpc reply from http://localhost:33463/	time=0.328064ms
xmlrpc reply from http://localhost:33463/	time=0.361919ms
xmlrpc reply from http://localhost:33463/	time=0.321865ms
xmlrpc reply from http://localhost:33463/	time=1.323938ms
xmlrpc reply from http://localhost:33463/	time=1.506805ms
xmlrpc reply from http://localhost:33463/	time=0.315189ms
xmlrpc reply from http://localhost:33463/	time=1.230001ms
xmlrpc reply from http://localhost:33463/	time=0.318050ms
xmlrpc reply from http://localhost:33463/	time=0.312090ms
xmlrpc reply from http://localhost:33463/	time=0.319004ms
xmlrpc reply from http://localhost:33463/	time=0.312090ms
xmlrpc reply from http://localhost:33463/	time=0.342846ms
xmlrpc reply from http://localhost:33463/	time=0.332117ms
xmlrpc reply from http://localhost:33463/	time=0.455141ms
xmlrpc reply from http://localhost:33463/	time=0.339031ms
xmlrpc reply from http://localhost:33463/	time=0.324965ms
xmlrpc reply from http://localhost:33463/	time=1.386881ms
xmlrpc reply from http://localhost:33463/	time=1.289845ms
xmlrpc reply from http://localhost:33463/	time=0.360012ms
xmlrpc reply from http://localhost:33463/	time=0.573874ms
xmlrpc reply from http://localhost:33463/	time=1.883984ms
xmlrpc reply from http://localhost:33463/	time=0.314951ms
xmlrpc reply from http://localhost:33463/	time=0.435114ms
xmlrpc reply from http://localhost:33463/	time=0.830173ms
xmlrpc reply from http://localhost:33463/	time=0.704050ms
xmlrpc reply from http://localhost:33463/	time=1.405001ms
xmlrpc reply from http://localhost:33463/	time=1.391888ms
xmlrpc reply from http://localhost:33463/	time=0.321150ms
xmlrpc reply from http://localhost:33463/	time=0.354052ms
xmlrpc reply from http://localhost:33463/	time=1.348019ms
xmlrpc reply from http://localhost:33463/	time=1.342058ms
xmlrpc reply from http://localhost:33463/	time=0.327110ms
xmlrpc reply from http://localhost:33463/	time=0.453949ms
xmlrpc reply from http://localhost:33463/	time=0.652075ms
xmlrpc reply from http://localhost:33463/	time=0.807047ms
xmlrpc reply from http://localhost:33463/	time=0.312090ms
xmlrpc reply from http://localhost:33463/	time=1.361132ms
xmlrpc reply from http://localhost:33463/	time=0.328064ms
xmlrpc reply from http://localhost:33463/	time=0.653028ms
xmlrpc reply from http://localhost:33463/	time=1.273870ms
xmlrpc reply from http://localhost:33463/	time=0.344038ms
xmlrpc reply from http://localhost:33463/	time=1.243114ms
xmlrpc reply from http://localhost:33463/	time=1.381874ms
xmlrpc reply from http://localhost:33463/	time=0.314951ms
xmlrpc reply from http://localhost:33463/	time=0.746012ms
xmlrpc reply from http://localhost:33463/	time=1.250982ms
xmlrpc reply from http://localhost:33463/	time=0.327826ms
xmlrpc reply from http://localhost:33463/	time=1.514196ms
xmlrpc reply from http://localhost:33463/	time=1.189947ms
xmlrpc reply from http://localhost:33463/	time=1.500845ms
xmlrpc reply from http://localhost:33463/	time=1.337051ms
xmlrpc reply from http://localhost:33463/	time=1.363993ms
xmlrpc reply from http://localhost:33463/	time=1.684904ms
xmlrpc reply from http://localhost:33463/	time=1.976013ms
xmlrpc reply from http://localhost:33463/	time=1.312971ms
xmlrpc reply from http://localhost:33463/	time=1.273155ms
xmlrpc reply from http://localhost:33463/	time=1.366138ms
xmlrpc reply from http://localhost:33463/	time=1.495123ms
xmlrpc reply from http://localhost:33463/	time=1.312017ms
xmlrpc reply from http://localhost:33463/	time=1.243114ms
xmlrpc reply from http://localhost:33463/	time=1.248121ms
xmlrpc reply from http://localhost:33463/	time=0.319958ms
xmlrpc reply from http://localhost:33463/	time=0.344992ms
xmlrpc reply from http://localhost:33463/	time=0.298023ms
xmlrpc reply from http://localhost:33463/	time=1.232862ms
xmlrpc reply from http://localhost:33463/	time=0.303984ms
xmlrpc reply from http://localhost:33463/	time=1.241922ms
xmlrpc reply from http://localhost:33463/	time=1.167059ms
xmlrpc reply from http://localhost:33463/	time=0.333071ms
xmlrpc reply from http://localhost:33463/	time=0.326872ms
xmlrpc reply from http://localhost:33463/	time=0.301838ms
xmlrpc reply from http://localhost:33463/	time=1.368046ms
xmlrpc reply from http://localhost:33463/	time=0.407934ms
xmlrpc reply from http://localhost:33463/	time=0.318050ms
xmlrpc reply from http://localhost:33463/	time=0.317097ms
xmlrpc reply from http://localhost:33463/	time=0.317097ms
xmlrpc reply from http://localhost:33463/	time=0.573158ms
xmlrpc reply from http://localhost:33463/	time=0.313044ms
xmlrpc reply from http://localhost:33463/	time=0.632048ms
xmlrpc reply from http://localhost:33463/	time=0.316143ms
xmlrpc reply from http://localhost:33463/	time=0.363827ms
xmlrpc reply from http://localhost:33463/	time=0.440836ms
xmlrpc reply from http://localhost:33463/	time=0.339985ms
xmlrpc reply from http://localhost:33463/	time=0.331879ms
xmlrpc reply from http://localhost:33463/	time=0.671864ms
xmlrpc reply from http://localhost:33463/	time=0.324011ms
xmlrpc reply from http://localhost:33463/	time=1.339912ms
xmlrpc reply from http://localhost:33463/	time=0.307083ms
xmlrpc reply from http://localhost:33463/	time=1.283884ms
xmlrpc