<?xml version="1.0" encoding="utf-8"?>
<!-- Generator: Adobe Illustrator 22.1.0, SVG Export Plug-In . SVG Version: 6.00 Build 0)  -->
<svg version="1.1" id="Ñëîé_1" xmlns="http://www.w3.org/2000/svg" xmlns:xlink="http://www.w3.org/1999/xlink" x="0px" y="0px"
	 viewBox="0 0 50 48.2" style="enable-background:new 0 0 50 48.2;" xml:space="preserve">
<style type="text/css">
	.st0{fill:#374163;}
</style>
<g>
	<path class="st0" d="M36.9,48.2c-0.8,0-1.6-0.2-2.3-0.5l-9.3-4.2c-0.1-0.1-0.4-0.1-0.5,0l-9.3,4.2c-2.1,0.8-4.1,0.6-5.8-0.6
		c-1.6-1.2-2.5-3.2-2.3-5.3l1-10.1c0-0.2-0.1-0.4-0.2-0.6l-6.8-7.5c-1.5-2-1.8-4.1-1-5.8c0.5-1.8,2.1-3.2,4.1-3.6l9.9-2.2
		c0,0,0.5-0.3,0.5-0.3l5.1-8.7C21.1,1.1,22.9,0,25,0c2.1,0,3.9,1.1,5,2.9l5.1,8.7c0.1,0,0.4,0.3,0.5,0.3l10,2.2
		c2,0.4,3.6,1.9,4.2,3.9c0.6,1.7,0.2,3.8-1,5.4l-7,7.7c-0.1,0.1-0.2,0.3-0.2,0.8l1,9.9c0.2,2.1-0.7,4.1-2.3,5.3
		C39.4,47.8,38.1,48.2,36.9,48.2z"/>
</g>
</svg>
