{
	"format_version": "1.12.0",
	"minecraft:geometry": [
		{
			"description": {
				"identifier": "geometry.swinub",
				"texture_width": 64,
				"texture_height": 64,
				"visible_bounds_width": 2,
				"visible_bounds_height": 1.5,
				"visible_bounds_offset": [0, 0.25, 0]
			},
			"bones": [
				{
					"name": "swinub",
					"pivot": [0, 0, 0]
				},
				{
					"name": "body",
					"parent": "swinub",
					"pivot": [0, 3, -0.5],
					"cubes": [
						{"origin": [-3.5, 0, -5], "size": [7, 6, 9], "uv": [0, 0]},
						{"origin": [-1.5, 0.5, -5.75], "size": [3, 2, 1], "uv": [0, 0]},
						{"origin": [-4, 0.23854, 3.97704], "size": [8, 0, 3], "pivot": [-1, 0.23854, 5.47704], "rotation": [-10, 0, 0], "uv": [11, 15]},
						{"origin": [2.48463, 0.32537, -3], "size": [3, 0, 8], "pivot": [4.48463, 0.32537, 1], "rotation": [0, 0, 12.5], "uv": [15, 0]},
						{"origin": [-5.48463, 0.32537, -3], "size": [3, 0, 8], "pivot": [-4.48463, 0.32537, 1], "rotation": [0, 0, -12.5], "uv": [0, 15]}
					]
				},
				{
					"name": "lefteye",
					"parent": "body",
					"pivot": [2, 3.25, -5.025],
					"rotation": [0, 0, 7.5],
					"cubes": [
						{"origin": [1, 2.75, -5.025], "size": [2, 1, 0], "uv": [43, 0]}
					]
				},
				{
					"name": "righteye",
					"parent": "body",
					"pivot": [-2, 3.25, -5.025],
					"rotation": [0, 0, -7.5],
					"cubes": [
						{"origin": [-3, 2.75, -5.025], "size": [2, 1, 0], "uv": [43, 0], "mirror": true}
					]
				},
				{
					"name": "tail",
					"parent": "body",
					"pivot": [0, 2, 4],
					"cubes": [
						{"origin": [0, 1, 4], "size": [0, 2, 1], "uv": [34, -1]}
					]
				},
				{
					"name": "leftfrontfoot",
					"parent": "body",
					"pivot": [-1.75, 0, -1.5],
					"rotation": [2.5, 0, 0],
					"cubes": [
						{"origin": [-2.75, 0, -3.5], "size": [2, 0, 2], "uv": [0, 7]}
					]
				},
				{
					"name": "rightfrontfoot",
					"parent": "body",
					"pivot": [1.75, 0, -1.5],
					"rotation": [2.5, 0, 0],
					"cubes": [
						{"origin": [0.75, 0, -3.5], "size": [2, 0, 2], "uv": [0, 15]}
					]
				},
				{
					"name": "leftbackfoot",
					"parent": "body",
					"pivot": [-1.5, 0, 2.5],
					"rotation": [2.5, 0, 0],
					"cubes": [
						{"origin": [-2.5, 0, 0.5], "size": [2, 0, 2], "uv": [0, 5]}
					]
				},
				{
					"name": "rightbackfoot",
					"parent": "body",
					"pivot": [1.5, 0, 2.5],
					"rotation": [2.5, 0, 0],
					"cubes": [
						{"origin": [0.5, 0, 0.5], "size": [2, 0, 2], "uv": [0, 3]}
					]
				}
			]
		}
	]
}