{
  "required": true,
  "package": "com.cobblemon.mod.common.mixin",
  "compatibilityLevel": "JAVA_16",
  "minVersion": "0.8",
  "client": [
    "BuiltinModelItemRendererMixin",
    "EntityRenderDispatcherMixin",
    "GameRendererMixin",
    "PartyScrollMixin",
    "accessor.KeyBindingAccessor",
    "pokeball.ItemRendererMixin"
  ],
  "mixins": [
    "MinecraftDedicatedServerMixin",
    "PlayerMixin",
    "PointedDripstoneBlockMixin",
    "ServerChunkManagerMixin",
    "ShearsDispenserBehaviorMixin",
    "accessor.AccessorEntity",
    "invoker.ClientPlayNetworkHandlerInvoker",
    "entity.TameableEntityMixin",
    "invoker.BooleanRuleInvoker",
    "invoker.ButtonBlockInvoker",
    "invoker.DoorBlockInvoker",
    "invoker.PressurePlateBlockInvoker",
    "invoker.StairsBlockInvoker",
    "invoker.TrapdoorBlockInvoker"
  ],
  "injectors": {
    "defaultRequire": 1
  }
}