{
  "implemented": true,
  "name": "Seaking",
  "nationalPokedexNumber": 119,
  "primaryType": "water",
  "abilities": [
    "swiftswim",
    "waterveil",
    "h:lightningrod"
  ],
  "baseStats": {
    "hp": 80,
    "attack": 92,
    "defence": 65,
    "special_attack": 65,
    "special_defence": 80,
    "speed": 68
  },
  "catchRate": 60,
  "maleRatio": 0.5,
  "shoulderMountable": false,
  "baseExperienceYield": 158,
  "experienceGroup": "medium_fast",
  "eggCycles": 20,
  "eggGroups": [
    "water_2"
  ],
  "behaviour": {
    "moving": {
      "canLook": false,
      "walk": {
        "avoidsLand": true
      },
      "swim": {
        "swimSpeed": 0.1,
        "canSwimInWater": true,
        "canBreatheUnderwater": true
      },
      "wanderChance": 1
    }
  },
  "drops": {
    "amount": "2",
    "entries": [
      {
        "item": "minecraft:salmon"
      },
      {
        "item": "minecraft:bone_meal",
        "percentage": 10
      }
    ]
  },
  "moves": [
    "1:peck",
    "1:poisonjab",
    "1:supersonic",
    "1:tailwhip",
    "1:watersport",
    "15:hornattack",
    "17:waterpulse",
    "24:flail",
    "27:aquaring",
    "29:furyattack",
    "41:waterfall",
    "49:horndrill",
    "61:agility",
    "63:soak",
    "69:megahorn",
    "tm:agility",
    "tm:attract",
    "tm:blizzard",
    "tm:bodyslam",
    "tm:bounce",
    "tm:captivate",
    "tm:confide",
    "tm:dive",
    "tm:doubleteam",
    "tm:drillrun",
    "tm:endure",
    "tm:facade",
    "tm:frustration",
    "tm:gigaimpact",
    "tm:hail",
    "tm:hiddenpower",
    "tm:hydropump",
    "tm:hyperbeam",
    "tm:icebeam",
    "tm:icywind",
    "tm:megahorn",
    "tm:muddywater",
    "tm:mudshot",
    "tm:naturalgift",
    "tm:poisonjab",
    "tm:protect",
    "tm:raindance",
    "tm:rest",
    "tm:return",
    "tm:round",
    "tm:scald",
    "tm:secretpower",
    "tm:sleeptalk",
    "tm:smartstrike",
    "tm:snore",
    "tm:substitute",
    "tm:surf",
    "tm:swagger",
    "tm:swift",
    "tm:swordsdance",
    "tm:throatchop",
    "tm:toxic",
    "tm:waterfall",
    "tm:waterpulse",
    "tm:whirlpool",
    "tutor:agility",
    "tutor:aquatail",
    "tutor:attract",
    "tutor:bide",
    "tutor:blizzard",
    "tutor:bounce",
    "tutor:bubblebeam",
    "tutor:curse",
    "tutor:dive",
    "tutor:doubleedge",
    "tutor:doubleteam",
    "tutor:drillrun",
    "tutor:endure",
    "tutor:facade",
    "tutor:flail",
    "tutor:flipturn",
    "tutor:frustration",
    "tutor:furyattack",
    "tutor:furycutter",
    "tutor:headbutt",
    "tutor:hiddenpower",
    "tutor:hornattack",
    "tutor:horndrill",
    "tutor:hyperbeam",
    "tutor:icebeam",
    "tutor:icywind",
    "tutor:knockoff",
    "tutor:megahorn",
    "tutor:mimic",
    "tutor:mudslap",
    "tutor:peck",
    "tutor:poisonjab",
    "tutor:protect",
    "tutor:psybeam",
    "tutor:quickattack",
    "tutor:rage",
    "tutor:raindance",
    "tutor:rest",
    "tutor:return",
    "tutor:scald",
    "tutor:scaleshot",
    "tutor:signalbeam",
    "tutor:skullbash",
    "tutor:sleeptalk",
    "tutor:snore",
    "tutor:substitute",
    "tutor:supersonic",
    "tutor:surf",
    "tutor:swagger",
    "tutor:swift",
    "tutor:tailwhip",
    "tutor:takedown",
    "tutor:throatchop",
    "tutor:toxic",
    "tutor:waterfall",
    "tutor:watergun",
    "tutor:waterpulse"
  ],
  "labels": [
    "gen1"
  ],
  "pokedex": [
    "cobblemon.species.seaking.desc"
  ],
  "preEvolution": "goldeen",
  "evolutions": [],
  "baseScale": 1.8,
  "hitbox": {
    "width": 0.7,
    "height": 0.6,
    "fixed": false
  },
  "baseFriendship": 50,
  "evYield": {
    "hp": 0,
    "attack": 2,
    "defence": 0,
    "special_attack": 0,
    "special_defence": 0,
    "speed": 0
  },
  "height": 13,
  "weight": 390,
  "aspects": [],
  "cannotDynamax": false
}