{
  "condition": {
	"neededBaseBlocks": [
      "minecraft:dirt_path",
      "minecraft:cut_sandstone",
      "minecraft:cut_red_sandstone",
      "minecraft:bricks",
      "minecraft:smooth_stone",
      "minecraft:smooth_stone_slab",
      "minecraft:white_concrete",
      "minecraft:orange_concrete",
      "minecraft:magenta_concrete",
      "minecraft:light_blue_concrete",
      "minecraft:yellow_concrete",
      "minecraft:lime_concrete",
      "minecraft:pink_concrete",
      "minecraft:gray_concrete",
      "minecraft:light_gray_concrete",
      "minecraft:cyan_concrete",
      "minecraft:purple_concrete",
      "minecraft:blue_concrete",
      "minecraft:brown_concrete",
      "minecraft:green_concrete",
      "minecraft:red_concrete",
      "minecraft:black_concrete"
    ],
    "neededNearbyBlocks": [
      "minecraft:dirt_path",
      "minecraft:cut_sandstone",
      "minecraft:cut_red_sandstone",
      "minecraft:bricks",
      "minecraft:smooth_stone",
      "minecraft:smooth_stone_slab",
      "minecraft:white_concrete",
      "minecraft:orange_concrete",
      "minecraft:magenta_concrete",
      "minecraft:light_blue_concrete",
      "minecraft:yellow_concrete",
      "minecraft:lime_concrete",
      "minecraft:pink_concrete",
      "minecraft:gray_concrete",
      "minecraft:light_gray_concrete",
      "minecraft:cyan_concrete",
      "minecraft:purple_concrete",
      "minecraft:blue_concrete",
      "minecraft:brown_concrete",
      "minecraft:green_concrete",
      "minecraft:red_concrete",
      "minecraft:black_concrete"
    ]
  }
}
