{
  "implemented": true,
  "name": "Bibarel",
  "nationalPokedexNumber": 400,
  "primaryType": "normal",
  "secondaryType": "water",
  "abilities": [
    "simple",
    "unaware",
    "h:moody"
  ],
  "baseStats": {
    "hp": 79,
    "attack": 85,
    "defence": 60,
    "special_attack": 55,
    "special_defence": 60,
    "speed": 71
  },
  "catchRate": 127,
  "maleRatio": 0.5,
  "shoulderMountable": false,
  "baseExperienceYield": 144,
  "experienceGroup": "medium_fast",
  "eggCycles": 15,
  "eggGroups": [
    "water_1",
    "field"
  ],
  "behaviour": {
    "swim": {
      "swimSpeed": 0.25,
      "canSwimInWater": true,
      "canBreatheUnderwater": true,
      "canWalkOnWater": true
    },
    "wanderChance": 1
  },
  "drops": {
    "amount": "1",
    "entries": [
      {
        "item": "minecraft:stick",
        "quantityRange": "1-2",
        "percentage": 66
      }
    ]
  },
  "moves": [
    "1:aquajet",
    "1:growl",
    "1:rototiller",
    "1:tackle",
    "9:defensecurl",
    "13:rollout",
    "15:watergun",
    "18:headbutt",
    "23:hyperfang",
    "28:crunch",
    "28:yawn",
    "33:amnesia",
    "38:takedown",
    "43:superfang",
    "43:swordsdance",
    "48:superpower",
    "53:curse",
    "tm:attract",
    "tm:blizzard",
    "tm:bulldoze",
    "tm:captivate",
    "tm:chargebeam",
    "tm:confide",
    "tm:cut",
    "tm:dig",
    "tm:dive",
    "tm:doubleteam",
    "tm:echoedvoice",
    "tm:endure",
    "tm:facade",
    "tm:fling",
    "tm:focuspunch",
    "tm:frustration",
    "tm:gigaimpact",
    "tm:grassknot",
    "tm:hiddenpower",
    "tm:hyperbeam",
    "tm:icebeam",
    "tm:irontail",
    "tm:naturalgift",
    "tm:pluck",
    "tm:protect",
    "tm:raindance",
    "tm:rest",
    "tm:retaliate",
    "tm:return",
    "tm:rockclimb",
    "tm:rocksmash",
    "tm:round",
    "tm:scald",
    "tm:secretpower",
    "tm:shadowball",
    "tm:shockwave",
    "tm:sleeptalk",
    "tm:stealthrock",
    "tm:strength",
    "tm:substitute",
    "tm:sunnyday",
    "tm:surf",
    "tm:swagger",
    "tm:swordsdance",
    "tm:taunt",
    "tm:thief",
    "tm:thunder",
    "tm:thunderbolt",
    "tm:thunderwave",
    "tm:toxic",
    "tm:waterfall",
    "tm:waterpulse",
    "tm:whirlpool",
    "tm:workup",
    "tutor:aquatail",
    "tutor:covet",
    "tutor:dive",
    "tutor:focuspunch",
    "tutor:furycutter",
    "tutor:headbutt",
    "tutor:icywind",
    "tutor:irontail",
    "tutor:lastresort",
    "tutor:liquidation",
    "tutor:mudslap",
    "tutor:rollout",
    "tutor:shockwave",
    "tutor:sleeptalk",
    "tutor:snore",
    "tutor:stealthrock",
    "tutor:stompingtantrum",
    "tutor:superfang",
    "tutor:superpower",
    "tutor:swift",
    "tutor:waterpulse"
  ],
  "labels": [
    "gen4"
  ],
  "pokedex": [
    "cobblemon.species.bibarel.desc"
  ],
  "preEvolution": "bidoof",
  "evolutions": [],
  "baseScale": 0.7,
  "hitbox": {
    "width": 1.3,
    "height": 1.1,
    "fixed": false
  },
  "baseFriendship": 70,
  "evYield": {
    "hp": 0,
    "attack": 2,
    "defence": 0,
    "special_attack": 0,
    "special_defence": 0,
    "speed": 0
  },
  "height": 10,
  "weight": 315,
  "aspects": [],
  "cannotDynamax": false
}