{
  "name": "Lechonk",
  "nationalPokedexNumber": 915,
  "primaryType": "normal",
  "abilities": [
    "aromaveil",
    "gluttony",
    "h:thickfat"
  ],
  "baseStats": {
    "hp": 54,
    "attack": 45,
    "defence": 40,
    "special_attack": 35,
    "special_defence": 45,
    "speed": 35
  },
  "catchRate": 255,
  "maleRatio": 0.5,
  "baseExperienceYield": 0,
  "baseFriendship": 50,
  "evYield": {
    "hp": 1,
    "attack": 0,
    "defence": 0,
    "special_attack": 0,
    "special_defence": 0,
    "speed": 0
  },
  "experienceGroup": "medium_fast",
  "eggCycles": 15,
  "eggGroups": [
    "field"
  ],
  "moves": [
    "1:tackle",
    "1:tailwhip",
    "5:disarmingvoice",
    "8:echoedvoice",
    "12:mudshot",
    "15:covet",
    "17:dig",
    "21:headbutt",
    "24:yawn",
    "27:takedown",
    "30:workup",
    "32:uproar",
    "35:doubleedge",
    "egg:endeavor",
    "egg:spitup",
    "egg:stockpile",
    "egg:stuffcheeks",
    "egg:swallow",
    "tm:bodyslam",
    "tm:bulldoze",
    "tm:bulletseed",
    "tm:chillingwater",
    "tm:dig",
    "tm:disarmingvoice",
    "tm:endure",
    "tm:facade",
    "tm:helpinghand",
    "tm:hypervoice",
    "tm:ironhead",
    "tm:mudshot",
    "tm:mudslap",
    "tm:playrough",
    "tm:protect",
    "tm:raindance",
    "tm:rest",
    "tm:seedbomb",
    "tm:sleeptalk",
    "tm:substitute",
    "tm:sunnyday",
    "tm:takedown",
    "tm:terablast",
    "tm:thief",
    "tm:trailblaze",
    "tm:zenheadbutt"
  ],
  "labels": [
    "gen9"
  ],
  "aspects": [],
  "height": 5,
  "weight": 102,
  "evolutions": [
    {
      "id": "lechonk_oinkologne",
      "variant": "level_up",
      "result": "oinkologne",
      "consumeHeldItem": false,
      "learnableMoves": [],
      "requirements": [
        {
          "variant": "level",
          "minLevel": 18
        }
      ]
    },
    {
      "id": "lechonk_oinkologne",
      "variant": "level_up",
      "result": "oinkologne form=f",
      "consumeHeldItem": false,
      "learnableMoves": [],
      "requirements": [
        {
          "variant": "level",
          "minLevel": 18
        }
      ]
    }
  ],
  "cannotDynamax": false,
  "pokedex": [
    "cobblemon.species.lechonk.desc"
  ]
}