{
  "implemented": true,
  "name": "Porygon-Z",
  "nationalPokedexNumber": 474,
  "primaryType": "normal",
  "abilities": [
    "adaptability",
    "download",
    "h:analytic"
  ],
  "baseStats": {
    "hp": 85,
    "attack": 80,
    "defence": 70,
    "special_attack": 135,
    "special_defence": 75,
    "speed": 90
  },
  "catchRate": 30,
  "maleRatio": -1,
  "shoulderMountable": false,
  "baseExperienceYield": 268,
  "experienceGroup": "medium_fast",
  "eggCycles": 20,
  "eggGroups": [
    "mineral"
  ],
  "behaviour": {
    "moving": {
      "fly": {
        "canFly": true
      },
      "walk": {
        "canWalk": false
      }
    }
  },
  "drops": {
    "amount": "1",
    "entries": [
      {
        "item": "cobblemon:dubious_disc",
        "percentage": 20
      }
    ]
  },
  "moves": [
    "1:conversion2",
    "1:conversion",
    "1:defensecurl",
    "1:nastyplot",
    "1:recycle",
    "1:tackle",
    "1:trickroom",
    "7:psybeam",
    "12:agility",
    "15:thundershock",
    "18:recover",
    "23:magnetrise",
    "29:signalbeam",
    "34:embargo",
    "40:discharge",
    "45:lockon",
    "51:triattack",
    "56:magiccoat",
    "62:zapcannon",
    "67:hyperbeam",
    "tm:aerialace",
    "tm:agility",
    "tm:allyswitch",
    "tm:blizzard",
    "tm:chargebeam",
    "tm:confide",
    "tm:darkpulse",
    "tm:doubleteam",
    "tm:dreameater",
    "tm:eerieimpulse",
    "tm:electroweb",
    "tm:embargo",
    "tm:endure",
    "tm:facade",
    "tm:flash",
    "tm:foulplay",
    "tm:frustration",
    "tm:gigaimpact",
    "tm:guardswap",
    "tm:hiddenpower",
    "tm:hyperbeam",
    "tm:icebeam",
    "tm:icywind",
    "tm:irontail",
    "tm:nastyplot",
    "tm:naturalgift",
    "tm:powerswap",
    "tm:protect",
    "tm:psychic",
    "tm:psychup",
    "tm:psyshock",
    "tm:raindance",
    "tm:recycle",
    "tm:rest",
    "tm:return",
    "tm:round",
    "tm:secretpower",
    "tm:shadowball",
    "tm:shockwave",
    "tm:sleeptalk",
    "tm:snore",
    "tm:solarbeam",
    "tm:speedswap",
    "tm:substitute",
    "tm:sunnyday",
    "tm:swagger",
    "tm:swift",
    "tm:thief",
    "tm:thunder",
    "tm:thunderbolt",
    "tm:thunderwave",
    "tm:toxic",
    "tm:triattack",
    "tm:trick",
    "tm:trickroom",
    "tm:uproar",
    "tm:wonderroom",
    "tm:zenheadbutt",
    "tutor:allyswitch",
    "tutor:darkpulse",
    "tutor:electroweb",
    "tutor:foulplay",
    "tutor:gravity",
    "tutor:icywind",
    "tutor:irontail",
    "tutor:lastresort",
    "tutor:magiccoat",
    "tutor:magnetrise",
    "tutor:painsplit",
    "tutor:recycle",
    "tutor:shockwave",
    "tutor:signalbeam",
    "tutor:sleeptalk",
    "tutor:snore",
    "tutor:swift",
    "tutor:telekinesis",
    "tutor:trick",
    "tutor:uproar",
    "tutor:wonderroom",
    "tutor:zenheadbutt"
  ],
  "labels": [
    "gen4"
  ],
  "pokedex": [
    "cobblemon.species.porygonz.desc"
  ],
  "preEvolution": "porygon2",
  "evolutions": [],
  "baseScale": 0.4,
  "hitbox": {
    "width": 0.9,
    "height": 1.7,
    "fixed": false
  },
  "baseFriendship": 50,
  "evYield": {
    "hp": 0,
    "attack": 0,
    "defence": 0,
    "special_attack": 3,
    "special_defence": 0,
    "speed": 0
  },
  "height": 9,
  "weight": 340,
  "aspects": [],
  "cannotDynamax": false
}