{
  "name": "Glimmora",
  "nationalPokedexNumber": 970,
  "primaryType": "rock",
  "secondaryType": "poison",
  "abilities": [
    "toxicdebris",
    "h:corrosion"
  ],
  "baseStats": {
    "hp": 83,
    "attack": 55,
    "defence": 90,
    "special_attack": 130,
    "special_defence": 81,
    "speed": 86
  },
  "catchRate": 25,
  "maleRatio": 0.5,
  "baseExperienceYield": 0,
  "baseFriendship": 50,
  "evYield": {
    "hp": 0,
    "attack": 0,
    "defence": 0,
    "special_attack": 2,
    "special_defence": 0,
    "speed": 0
  },
  "experienceGroup": "medium_slow",
  "eggCycles": 30,
  "eggGroups": [
    "mineral"
  ],
  "moves": [
    "1:harden",
    "1:rockthrow",
    "1:smackdown",
    "1:spikyshield",
    "1:toxicspikes",
    "7:acidspray",
    "11:ancientpower",
    "15:rockpolish",
    "18:stealthrock",
    "22:venoshock",
    "26:sandstorm",
    "29:selfdestruct",
    "33:rockslide",
    "39:powergem",
    "44:acidarmor",
    "50:sludgewave",
    "tm:acidspray",
    "tm:confuseray",
    "tm:dazzlinggleam",
    "tm:earthpower",
    "tm:endure",
    "tm:energyball",
    "tm:facade",
    "tm:flashcannon",
    "tm:gigaimpact",
    "tm:gunkshot",
    "tm:hyperbeam",
    "tm:irondefense",
    "tm:lightscreen",
    "tm:mudshot",
    "tm:powergem",
    "tm:protect",
    "tm:raindance",
    "tm:reflect",
    "tm:rest",
    "tm:rockblast",
    "tm:rockslide",
    "tm:rocktomb",
    "tm:sandstorm",
    "tm:sleeptalk",
    "tm:sludgebomb",
    "tm:solarbeam",
    "tm:spikes",
    "tm:stealthrock",
    "tm:stoneedge",
    "tm:substitute",
    "tm:sunnyday",
    "tm:terablast",
    "tm:toxicspikes",
    "tm:venoshock"
  ],
  "labels": [
    "gen9"
  ],
  "aspects": [],
  "height": 15,
  "weight": 450,
  "preEvolution": "glimmet",
  "evolutions": [],
  "cannotDynamax": false,
  "pokedex": [
    "cobblemon.species.glimmora.desc"
  ]
}