{
  "name": "Crocalor",
  "nationalPokedexNumber": 910,
  "primaryType": "fire",
  "abilities": [
    "blaze",
    "h:unaware"
  ],
  "baseStats": {
    "hp": 81,
    "attack": 55,
    "defence": 78,
    "special_attack": 90,
    "special_defence": 58,
    "speed": 49
  },
  "catchRate": 45,
  "maleRatio": 0.875,
  "baseExperienceYield": 0,
  "baseFriendship": 50,
  "evYield": {
    "hp": 0,
    "attack": 0,
    "defence": 0,
    "special_attack": 2,
    "special_defence": 0,
    "speed": 0
  },
  "experienceGroup": "medium_slow",
  "eggCycles": 20,
  "eggGroups": [
    "field"
  ],
  "moves": [
    "1:ember",
    "1:leer",
    "1:tackle",
    "7:lick",
    "10:round",
    "12:bite",
    "15:yawn",
    "17:incinerate",
    "24:snarl",
    "28:roar",
    "32:flamethrower",
    "38:hypervoice",
    "42:willowisp",
    "47:fireblast",
    "tm:bodyslam",
    "tm:crunch",
    "tm:dig",
    "tm:disarmingvoice",
    "tm:endure",
    "tm:facade",
    "tm:fireblast",
    "tm:firefang",
    "tm:firepledge",
    "tm:firespin",
    "tm:flamecharge",
    "tm:flamethrower",
    "tm:flareblitz",
    "tm:heatwave",
    "tm:helpinghand",
    "tm:hypervoice",
    "tm:mudslap",
    "tm:outrage",
    "tm:overheat",
    "tm:protect",
    "tm:rest",
    "tm:seedbomb",
    "tm:sleeptalk",
    "tm:snarl",
    "tm:stompingtantrum",
    "tm:substitute",
    "tm:sunnyday",
    "tm:takedown",
    "tm:terablast",
    "tm:thunderfang",
    "tm:willowisp",
    "tm:zenheadbutt"
  ],
  "labels": [
    "gen9"
  ],
  "aspects": [],
  "height": 10,
  "weight": 307,
  "preEvolution": "fuecoco",
  "evolutions": [
    {
      "id": "crocalor_skeledirge",
      "variant": "level_up",
      "result": "skeledirge",
      "consumeHeldItem": false,
      "learnableMoves": [
        "torchsong"
      ],
      "requirements": [
        {
          "variant": "level",
          "minLevel": 36
        }
      ]
    }
  ],
  "cannotDynamax": false,
  "pokedex": [
    "cobblemon.species.crocalor.desc"
  ]
}