{
    "type": "minecraft:crafting_shaped",
    "pattern": [
        " S ",
        "MFP",
        " B "
    ],
    "key": {
        "S": {
            "item": "minecraft:wheat_seeds"
        },
        "M": {
            "item": "minecraft:melon_seeds"
        },
        "F": {
            "item": "minecraft:bone_meal"
        },
        "P": {
            "item": "minecraft:pumpkin_seeds"
        },
        "B": {
            "item": "minecraft:beetroot_seeds"
        }
    },
    "result":
    {
        "item": "cobblemon:miracle_seed"
    }
}