# DEMO WORLD 3 : Dinausaur
# For more information on these csv worlds, read the header of world_default.csv
# or read the manual at models/manual.nfo

# colors
color, green, 0, 255, 50
color, brown, 99, 59, 21
color, white, 255, 255, 255

# materials
material, green_material, 0, 1, 1, 0, green
material, brown_material, 0, 1, 1, 0, brown

# ground
plane, plane1, 0, 1, 0, 800, brown_material

# dino polyhedra (see archives/credits.txt for model source)
polyhedra, trex, models/dinosaur_model.stl, 700., 600., 300., green_material

# lights
lightsource, lightsource1, 600., -100., 300., 200.0, white
lightsource, lightsource1, 700.,  600., 000., 200.0, white
lightsource, lightsource1, 200.,  600., 100., 200.0, white
lightsource, lightsource1, 900.,  600., 100., 200.0, white
