# DEMO WORLD 4 : Parabolic Droplet
# For more information on these csv worlds, read the header of world_default.csv
# or read the manual at models/manual.nfo

# color
color, white, 255, 255, 255
color, orange, 255, 161, 66
color, cyan, 0, 255, 0

# materials
material, miror_material,  0.9, 0, 0.3, 0, white
material, white_material,  0.1, 0, 0.9, 0,  white

# parabole (y - y0) = -1/(x-x0); yx -xy0 - x0y + y0x0 + 1
generalshape, cone1, 10,  235000,  -400,  -600,  0 ,  0, 0,  10,  1,  0,  0,  white_material

# reflective plane
plane, plane2, 0, 0, 1, 600, white_material

# lights
lightsource, lightsource1,    200,   200,    -100, 150, cyan
lightsource, lightsource2, 1000, 600, -100, 150, orange
