%YAML 1.1
%TAG !u! tag:unity3d.com,2011:
--- !u!114 &11400000
MonoBehaviour:
  m_ObjectHideFlags: 0
  m_CorrespondingSourceObject: {fileID: 0}
  m_PrefabInstance: {fileID: 0}
  m_PrefabAsset: {fileID: 0}
  m_GameObject: {fileID: 0}
  m_Enabled: 1
  m_EditorHideFlags: 0
  m_Script: {fileID: 11500000, guid: 38752c9693527db4789a5a2aa1397009, type: 3}
  m_Name: AttackDamageBouns
  m_EditorClassIdentifier: 
  weight: 2
  enhanceQuality:
  - weight: 4
    quality: 0
    value: 5
  - weight: 2
    quality: 1
    value: 10
  - weight: 1
    quality: 2
    value: 20
