%YAML 1.1
%TAG !u! tag:unity3d.com,2011:
--- !u!21 &2100000
Material:
  serializedVersion: 6
  m_ObjectHideFlags: 0
  m_CorrespondingSourceObject: {fileID: 0}
  m_PrefabInstance: {fileID: 0}
  m_PrefabAsset: {fileID: 0}
  m_Name: vfx_CircleDistort_01_ma
  m_Shader: {fileID: -6465566751694194690, guid: 912cb094be87bd54c9e5d01878b12ad3, type: 3}
  m_ShaderKeywords: 
  m_LightmapFlags: 4
  m_EnableInstancingVariants: 0
  m_DoubleSidedGI: 0
  m_CustomRenderQueue: -1
  stringTagMap: {}
  disabledShaderPasses: []
  m_SavedProperties:
    serializedVersion: 3
    m_TexEnvs:
    - _MainTex:
        m_Texture: {fileID: 2800000, guid: 85b320e63243a354f938c4a2dda880b5, type: 3}
        m_Scale: {x: 1, y: 1}
        m_Offset: {x: 0, y: 0}
    - _NoiseTex:
        m_Texture: {fileID: 2800000, guid: b29bdf70ade631d49b94389410a4300a, type: 3}
        m_Scale: {x: 1, y: 1}
        m_Offset: {x: 0, y: 0}
    - unity_Lightmaps:
        m_Texture: {fileID: 0}
        m_Scale: {x: 1, y: 1}
        m_Offset: {x: 0, y: 0}
    - unity_LightmapsInd:
        m_Texture: {fileID: 0}
        m_Scale: {x: 1, y: 1}
        m_Offset: {x: 0, y: 0}
    - unity_ShadowMasks:
        m_Texture: {fileID: 0}
        m_Scale: {x: 1, y: 1}
        m_Offset: {x: 0, y: 0}
    m_Floats:
    - Boolean_0b7da27cfde641deb6601f2d4e9549b3: 1
    - Boolean_61f8448b348043508b3bd7f357839390: 1
    - Vector1_151338c7c694423685afb36f05762c7f: 0
    - Vector1_6686d040d75048b9b30d87a5655bf401: 0.51
    - _NoiseStrength: 0.06
    - _Noise_Offset_Speed: -0.33
    m_Colors:
    - Color_89a5f89808944da991afeb96ae7965af: {r: 1, g: 1, b: 1, a: 0}
    - Vector2_1bde31bddf444420a29cd40f6567b6c1: {r: 0, g: 0, b: 0, a: 0}
    - _Color: {r: 43.87657, g: 11.486013, b: 3.9052446, a: 0}
    - _MainTexS: {r: 1, g: 1, b: 0, a: 0}
    - _Noise_ST_Speed: {r: 4, g: 2, b: 0, a: 0.68}
  m_BuildTextureStacks: []
