%YAML 1.1
%TAG !u! tag:unity3d.com,2011:
--- !u!21 &2100000
Material:
  serializedVersion: 6
  m_ObjectHideFlags: 0
  m_CorrespondingSourceObject: {fileID: 0}
  m_PrefabInstance: {fileID: 0}
  m_PrefabAsset: {fileID: 0}
  m_Name: "vfx_\u706B\u7130\u7206\u70B8\u6EB6\u89E3_03_ma"
  m_Shader: {fileID: -6465566751694194690, guid: eb1c9ef1e98e38a47b519c1cd0ab7f3d, type: 3}
  m_ShaderKeywords: 
  m_LightmapFlags: 4
  m_EnableInstancingVariants: 0
  m_DoubleSidedGI: 0
  m_CustomRenderQueue: -1
  stringTagMap: {}
  disabledShaderPasses: []
  m_SavedProperties:
    serializedVersion: 3
    m_TexEnvs:
    - _MainTex:
        m_Texture: {fileID: 2800000, guid: 205e5072692bde94191484b633abcade, type: 3}
        m_Scale: {x: 1, y: 1}
        m_Offset: {x: 0, y: 0}
    - unity_Lightmaps:
        m_Texture: {fileID: 0}
        m_Scale: {x: 1, y: 1}
        m_Offset: {x: 0, y: 0}
    - unity_LightmapsInd:
        m_Texture: {fileID: 0}
        m_Scale: {x: 1, y: 1}
        m_Offset: {x: 0, y: 0}
    - unity_ShadowMasks:
        m_Texture: {fileID: 0}
        m_Scale: {x: 1, y: 1}
        m_Offset: {x: 0, y: 0}
    m_Floats:
    - Boolean_18880b4e7fd648a4a6ee4e2d87605b6e: 1
    - Boolean_774baf9642b443ab889932fd8405c4f5: 1
    - Vector1_02f9d1ce2c5042b2a9daf74915ad1933: 0.1
    - Vector1_08f47eb291474be595a48cf7f5dea59f: 0.5
    - Vector1_31b4b14cd2d34ee58fc85d517676caba: 2.13
    - Vector1_324aa429bb874c0d9fde6bf444b2475b: 0.5
    - Vector1_681b9ee57aa54289810ee025a7b3f305: 0
    - Vector1_90b1a7bcbd4445219b913949cfae2b38: 0
    - Vector1_d8350f8c6f1f4abe8bcf6b7a07bbe25d: 0
    m_Colors:
    - Vector2_eea0068ae1844494b5fe0cc005d7ca3d: {r: 1, g: 1, b: 0, a: 0}
    - _MainColor: {r: 22.041925, g: 1.5387751, b: 2.1343303, a: 1}
  m_BuildTextureStacks: []
