%YAML 1.1
%TAG !u! tag:unity3d.com,2011:
--- !u!21 &2100000
Material:
  serializedVersion: 6
  m_ObjectHideFlags: 0
  m_CorrespondingSourceObject: {fileID: 0}
  m_PrefabInstance: {fileID: 0}
  m_PrefabAsset: {fileID: 0}
  m_Name: "vfx_\u83C7\u83C7_ma_\u7C89"
  m_Shader: {fileID: -6465566751694194690, guid: c4e3db0330677144da8c4183021d193c, type: 3}
  m_ShaderKeywords: 
  m_LightmapFlags: 4
  m_EnableInstancingVariants: 0
  m_DoubleSidedGI: 0
  m_CustomRenderQueue: -1
  stringTagMap: {}
  disabledShaderPasses: []
  m_SavedProperties:
    serializedVersion: 3
    m_TexEnvs:
    - _InnerTex:
        m_Texture: {fileID: 2800000, guid: ad59c818905bfde4c8de84b4103c79f3, type: 3}
        m_Scale: {x: 1, y: 1}
        m_Offset: {x: 0, y: 0}
    - _MainTex:
        m_Texture: {fileID: 2800000, guid: ae79e5e4074b29b4893a1c920d5b1696, type: 3}
        m_Scale: {x: 1, y: 1}
        m_Offset: {x: 0, y: 0}
    - _Normal:
        m_Texture: {fileID: 2800000, guid: 161eafc6f48e0f7428e675e0e239eb18, type: 3}
        m_Scale: {x: 1, y: 1}
        m_Offset: {x: 0, y: 0}
    - unity_Lightmaps:
        m_Texture: {fileID: 0}
        m_Scale: {x: 1, y: 1}
        m_Offset: {x: 0, y: 0}
    - unity_LightmapsInd:
        m_Texture: {fileID: 0}
        m_Scale: {x: 1, y: 1}
        m_Offset: {x: 0, y: 0}
    - unity_ShadowMasks:
        m_Texture: {fileID: 0}
        m_Scale: {x: 1, y: 1}
        m_Offset: {x: 0, y: 0}
    m_Floats:
    - Vector1_6d9f88eefbf44399aac7228e52659e63: 0
    - _Blend: 0.06
    - _Smoothness: 0.621
    m_Colors:
    - InnerColor: {r: 0.031372543, g: 0.05953578, b: 0.1882353, a: 1}
    - _BaseColor: {r: 0.6132076, g: 0.25685295, b: 0.5546636, a: 1}
    - _TopColor: {r: 1.4422954, g: 0.55605596, b: 4.0848737, a: 1}
  m_BuildTextureStacks: []
