%YAML 1.1
%TAG !u! tag:unity3d.com,2011:
--- !u!114 &-2303146757539490613
MonoBehaviour:
  m_ObjectHideFlags: 11
  m_CorrespondingSourceObject: {fileID: 0}
  m_PrefabInstance: {fileID: 0}
  m_PrefabAsset: {fileID: 0}
  m_GameObject: {fileID: 0}
  m_Enabled: 1
  m_EditorHideFlags: 0
  m_Script: {fileID: 11500000, guid: d0353a89b1f911e48b9e16bdc9f2e058, type: 3}
  m_Name: 
  m_EditorClassIdentifier: 
  version: 4
--- !u!21 &2100000
Material:
  serializedVersion: 6
  m_ObjectHideFlags: 0
  m_CorrespondingSourceObject: {fileID: 0}
  m_PrefabInstance: {fileID: 0}
  m_PrefabAsset: {fileID: 0}
  m_Name: Firewood
  m_Shader: {fileID: 4800000, guid: 760f550bf9b463343a1254ec6f76b3e5, type: 3}
  m_ShaderKeywords: _DISSOLVEMODE_UV _SHADOWREMAPTYPE_USESHADERGARDIENTCOLOR _USEHEIGHTFOG_ON
    _USESSAO_ON
  m_LightmapFlags: 4
  m_EnableInstancingVariants: 0
  m_DoubleSidedGI: 0
  m_CustomRenderQueue: -1
  stringTagMap: {}
  disabledShaderPasses: []
  m_SavedProperties:
    serializedVersion: 3
    m_TexEnvs:
    - _AlbedoMap:
        m_Texture: {fileID: 2800000, guid: ac955955adcecb24d88e8fc1ac026247, type: 3}
        m_Scale: {x: 1, y: 1}
        m_Offset: {x: 0, y: 0}
    - _BaseMap:
        m_Texture: {fileID: 0}
        m_Scale: {x: 1, y: 1}
        m_Offset: {x: 0, y: 0}
    - _BumpMap:
        m_Texture: {fileID: 0}
        m_Scale: {x: 1, y: 1}
        m_Offset: {x: 0, y: 0}
    - _DetailAlbedoMap:
        m_Texture: {fileID: 0}
        m_Scale: {x: 1, y: 1}
        m_Offset: {x: 0, y: 0}
    - _DetailMask:
        m_Texture: {fileID: 0}
        m_Scale: {x: 1, y: 1}
        m_Offset: {x: 0, y: 0}
    - _DetailNormalMap:
        m_Texture: {fileID: 0}
        m_Scale: {x: 1, y: 1}
        m_Offset: {x: 0, y: 0}
    - _EmissionMap:
        m_Texture: {fileID: 0}
        m_Scale: {x: 1, y: 1}
        m_Offset: {x: 0, y: 0}
    - _EmissionTexture:
        m_Texture: {fileID: 0}
        m_Scale: {x: 1, y: 1}
        m_Offset: {x: 0, y: 0}
    - _IndirectDiffuseLightNormal:
        m_Texture: {fileID: 0}
        m_Scale: {x: 1, y: 1}
        m_Offset: {x: 0, y: 0}
    - _MainTex:
        m_Texture: {fileID: 0}
        m_Scale: {x: 1, y: 1}
        m_Offset: {x: 0, y: 0}
    - _MetallicGlossMap:
        m_Texture: {fileID: 0}
        m_Scale: {x: 1, y: 1}
        m_Offset: {x: 0, y: 0}
    - _NormalMap:
        m_Texture: {fileID: 2800000, guid: 5ff26056df342ae49b5f10f80123373f, type: 3}
        m_Scale: {x: 1, y: 1}
        m_Offset: {x: 0, y: 0}
    - _OcclusionMap:
        m_Texture: {fileID: 0}
        m_Scale: {x: 1, y: 1}
        m_Offset: {x: 0, y: 0}
    - _ParallaxMap:
        m_Texture: {fileID: 0}
        m_Scale: {x: 1, y: 1}
        m_Offset: {x: 0, y: 0}
    - _RampCelluloidNoiseTexture:
        m_Texture: {fileID: 0}
        m_Scale: {x: 1, y: 1}
        m_Offset: {x: 0, y: 0}
    - _ShadowRemapMap:
        m_Texture: {fileID: 2800000, guid: 5c17639b73e66a64eb1bf87957b3160a, type: 3}
        m_Scale: {x: 1, y: 1}
        m_Offset: {x: 0, y: 0}
    - _SpecGlossMap:
        m_Texture: {fileID: 0}
        m_Scale: {x: 1, y: 1}
        m_Offset: {x: 0, y: 0}
    - _SpecularMap:
        m_Texture: {fileID: 0}
        m_Scale: {x: 1, y: 1}
        m_Offset: {x: 0, y: 0}
    - _texcoord:
        m_Texture: {fileID: 0}
        m_Scale: {x: 1, y: 1}
        m_Offset: {x: 0, y: 0}
    - unity_Lightmaps:
        m_Texture: {fileID: 0}
        m_Scale: {x: 1, y: 1}
        m_Offset: {x: 0, y: 0}
    - unity_LightmapsInd:
        m_Texture: {fileID: 0}
        m_Scale: {x: 1, y: 1}
        m_Offset: {x: 0, y: 0}
    - unity_ShadowMasks:
        m_Texture: {fileID: 0}
        m_Scale: {x: 1, y: 1}
        m_Offset: {x: 0, y: 0}
    m_Floats:
    - _AOMix: 0.25
    - _AOSmoothness: 1
    - _AOThresold: 0.305
    - _Alpha: 1
    - _AlphaClip: 0
    - _AlphaCutoff: 0.5
    - _Blend: 0
    - _BumpScale: 1
    - _CamPosDither: -6
    - _ClearCoatMask: 0
    - _ClearCoatSmoothness: 0
    - _Cull: 2
    - _CullMode: 0
    - _Cutoff: 0.5
    - _DetailAlbedoMapScale: 1
    - _DetailNormalMapScale: 1
    - _DiffuseLightStrength: 0
    - _DirLightIntensity: 1
    - _DirLightNormalScale: 0.6
    - _DstBlend: 0
    - _EmissionStrength: 1
    - _EnvironmentReflections: 1
    - _FogHeightEnd: 45.3
    - _FogHeightStart: -454.1
    - _FogNoiseEdgeSmoothness: 1
    - _FogNoiseEdgeValue: 0
    - _GlossMapScale: 0
    - _Glossiness: 0
    - _GlossyReflections: 0
    - _HeightFogWorldPosYClipAdd: 33.58
    - _LightAttSoft: 0.36
    - _LightAttValue: -0.23
    - _Metallic: 0
    - _NoiseAlpha: -0.3
    - _NoiseDensityUseAdd: 0
    - _NoiseFogClip: 18.86
    - _NoiseFogSoft: 9.26
    - _NoiseScale: 0.02
    - _NoiseStrengthUsePower: 1.24
    - _NormalStrength: 2
    - _OcclusionStrength: 1
    - _Parallax: 0.005
    - _QueueOffset: 0
    - _RampAddincludePower: -0.19
    - _RampAddwithoutPower: -0.02
    - _RampCelluloidNoiseSoftness: 1
    - _RampCelluloidNoiseValue: 0
    - _RampPower: 0.39
    - _ReceiveShadows: 1
    - _RimOffset: 0
    - _ShadowRemapType: 0
    - _ShadowUseDither: 0
    - _Smoothness: 0.5
    - _SmoothnessTextureChannel: 0
    - _SpecularHighlights: 1
    - _SpecularIntensity: 0
    - _SpecularPow: 4
    - _SpecularSRPLightSampler: 5
    - _SrcBlend: 1
    - _Surface: 0
    - _UseCameraDepthClip: 0
    - _UseFogNoise: 1
    - _UseHeightFog: 1
    - _UseSSAO: 1
    - _WorkflowMode: 1
    - _WorldNoiseYMaskClip: -33.44
    - _WorldNoiseYMaskStrength: 1000
    - _ZWrite: 1
    m_Colors:
    - _AOColour: {r: 0, g: 0, b: 0, a: 0}
    - _AlbedoEmissionColor: {r: 0.8018868, g: 0.8018868, b: 0.8018868, a: 0}
    - _BaseColor: {r: 1, g: 1, b: 1, a: 1}
    - _BassColor: {r: 1, g: 1, b: 1, a: 1}
    - _Color: {r: 1, g: 1, b: 1, a: 1}
    - _Color0: {r: 1, g: 1, b: 1, a: 0}
    - _EmissionColor: {r: 0, g: 0, b: 0, a: 1}
    - _HeightFogColor: {r: 4.0137205, g: 1.7812121, b: 1.1557833, a: 1}
    - _NoiseSpeedWorldPos: {r: 10, g: 0, b: 10, a: 0}
    - _RimColor: {r: 0, g: 0, b: 0, a: 0}
    - _RimSmoothStepMinMax: {r: 0, g: 1, b: 0, a: 0}
    - _SpecColor: {r: 0.19999996, g: 0.19999996, b: 0.19999996, a: 1}
    - _SpecularColor: {r: 1, g: 1, b: 1, a: 0}
    - _SpecularDirLightSRPLightIntensity: {r: 1, g: 1.87, b: 0, a: 0}
    - _SpecularSRPLightSmoothstep: {r: 9.5, g: -114, b: 0, a: 0}
    - _SpecularSmoothStepMinMax: {r: 0, g: 0.01, b: 0, a: 0}
  m_BuildTextureStacks: []
