%YAML 1.1
%TAG !u! tag:unity3d.com,2011:
--- !u!114 &-5529848700061408812
MonoBehaviour:
  m_ObjectHideFlags: 11
  m_CorrespondingSourceObject: {fileID: 0}
  m_PrefabInstance: {fileID: 0}
  m_PrefabAsset: {fileID: 0}
  m_GameObject: {fileID: 0}
  m_Enabled: 1
  m_EditorHideFlags: 0
  m_Script: {fileID: 11500000, guid: d0353a89b1f911e48b9e16bdc9f2e058, type: 3}
  m_Name: 
  m_EditorClassIdentifier: 
  version: 4
--- !u!21 &2100000
Material:
  serializedVersion: 6
  m_ObjectHideFlags: 0
  m_CorrespondingSourceObject: {fileID: 0}
  m_PrefabInstance: {fileID: 0}
  m_PrefabAsset: {fileID: 0}
  m_Name: Fire02_Crystal02(t2)
  m_Shader: {fileID: 4800000, guid: 833083dcaa301c14cbef9c3bbcd582c1, type: 3}
  m_ShaderKeywords: _DISSOLVEMODE_UV _SHADOWREMAPTYPE_USESHADOWREMAPMAP
  m_LightmapFlags: 4
  m_EnableInstancingVariants: 0
  m_DoubleSidedGI: 0
  m_CustomRenderQueue: -1
  stringTagMap: {}
  disabledShaderPasses: []
  m_SavedProperties:
    serializedVersion: 3
    m_TexEnvs:
    - _AlbedoMap:
        m_Texture: {fileID: 2800000, guid: 724ec3ed5cf29df4095250bad51d6a69, type: 3}
        m_Scale: {x: 1, y: 1}
        m_Offset: {x: 0, y: 0}
    - _BaseMap:
        m_Texture: {fileID: 2800000, guid: 9f19549255e3133438d11bfb23ecf7a1, type: 3}
        m_Scale: {x: 1, y: 1}
        m_Offset: {x: 0, y: 0}
    - _BumpMap:
        m_Texture: {fileID: 0}
        m_Scale: {x: 1, y: 1}
        m_Offset: {x: 0, y: 0}
    - _DetailAlbedoMap:
        m_Texture: {fileID: 0}
        m_Scale: {x: 1, y: 1}
        m_Offset: {x: 0, y: 0}
    - _DetailMask:
        m_Texture: {fileID: 0}
        m_Scale: {x: 1, y: 1}
        m_Offset: {x: 0, y: 0}
    - _DetailNormalMap:
        m_Texture: {fileID: 0}
        m_Scale: {x: 1, y: 1}
        m_Offset: {x: 0, y: 0}
    - _EmissionMap:
        m_Texture: {fileID: 0}
        m_Scale: {x: 1, y: 1}
        m_Offset: {x: 0, y: 0}
    - _EmissionTexture:
        m_Texture: {fileID: 2800000, guid: 1ee23d5e78d9c25429cfea57956fecaf, type: 3}
        m_Scale: {x: 1, y: 1}
        m_Offset: {x: 0, y: 0}
    - _IndirectDiffuseLightNormal:
        m_Texture: {fileID: 0}
        m_Scale: {x: 1, y: 1}
        m_Offset: {x: 0, y: 0}
    - _MainTex:
        m_Texture: {fileID: 2800000, guid: 9f19549255e3133438d11bfb23ecf7a1, type: 3}
        m_Scale: {x: 1, y: 1}
        m_Offset: {x: 0, y: 0}
    - _MetallicGlossMap:
        m_Texture: {fileID: 0}
        m_Scale: {x: 1, y: 1}
        m_Offset: {x: 0, y: 0}
    - _NormalMap:
        m_Texture: {fileID: 0}
        m_Scale: {x: 1, y: 1}
        m_Offset: {x: 0, y: 0}
    - _OcclusionMap:
        m_Texture: {fileID: 0}
        m_Scale: {x: 1, y: 1}
        m_Offset: {x: 0, y: 0}
    - _ParallaxMap:
        m_Texture: {fileID: 0}
        m_Scale: {x: 1, y: 1}
        m_Offset: {x: 0, y: 0}
    - _RampCelluloidNoiseTexture:
        m_Texture: {fileID: 0}
        m_Scale: {x: 1, y: 1}
        m_Offset: {x: 0, y: 0}
    - _ShadowRemapMap:
        m_Texture: {fileID: 2800000, guid: 8b9086a9b225a584fb43685652719251, type: 3}
        m_Scale: {x: 1, y: 1}
        m_Offset: {x: 0, y: 0}
    - _SpecGlossMap:
        m_Texture: {fileID: 0}
        m_Scale: {x: 1, y: 1}
        m_Offset: {x: 0, y: 0}
    - _SpecularMap:
        m_Texture: {fileID: 0}
        m_Scale: {x: 1, y: 1}
        m_Offset: {x: 0, y: 0}
    - _texcoord:
        m_Texture: {fileID: 0}
        m_Scale: {x: 1, y: 1}
        m_Offset: {x: 0, y: 0}
    - unity_Lightmaps:
        m_Texture: {fileID: 0}
        m_Scale: {x: 1, y: 1}
        m_Offset: {x: 0, y: 0}
    - unity_LightmapsInd:
        m_Texture: {fileID: 0}
        m_Scale: {x: 1, y: 1}
        m_Offset: {x: 0, y: 0}
    - unity_ShadowMasks:
        m_Texture: {fileID: 0}
        m_Scale: {x: 1, y: 1}
        m_Offset: {x: 0, y: 0}
    m_Floats:
    - _Alpha: 0
    - _AlphaClip: 0
    - _AlphaCutoff: 0.5
    - _Blend: 0
    - _BumpScale: 1
    - _ClearCoatMask: 0
    - _ClearCoatSmoothness: 0
    - _Clip: 0
    - _ClipEdge: 0.99
    - _ClipEdgeSoftness: 0.01
    - _ClipNoiseScale: 10
    - _ClipNoiseTiling: 1
    - _Cull: 2
    - _Cutoff: 0.5
    - _DeadClip: 0
    - _DetailAlbedoMapScale: 1
    - _DetailNormalMapScale: 1
    - _DiffuseLightStrength: 0
    - _DirLightIntensity: 1
    - _DirLightNormalScale: 0.6
    - _DissolveMode: 0
    - _DstBlend: 0
    - _EmissionStrength: 1
    - _EnvironmentReflections: 1
    - _GenerateDither: 1
    - _GlossMapScale: 1
    - _Glossiness: 0
    - _GlossyReflections: 1
    - _LightAttSoft: 0.46
    - _LightAttValue: -0.3
    - _Metallic: 0
    - _Mode: 0
    - _NormalStrength: 0
    - _OcclusionStrength: 1
    - _OutlineMax: 0.03
    - _OutlineWidth: 0.1
    - _Parallax: 0.02
    - _QueueOffset: 0
    - _RampAddincludePower: 0
    - _RampAddwithoutPower: 0.07
    - _RampCelluloidNoiseSoftness: 1
    - _RampCelluloidNoiseValue: 0
    - _RampPower: 1
    - _ReceiveShadows: 1
    - _RimOffset: 0.08
    - _ShadowRemapType: 1
    - _Smoothness: 0.5
    - _SmoothnessTextureChannel: 0
    - _SpecularHighlights: 1
    - _SpecularIntensity: 0.052
    - _SpecularPow: 4
    - _SpecularSRPLightSampler: 5
    - _Sprint: 0
    - _SrcBlend: 1
    - _Surface: 0
    - _UVSec: 0
    - _WorkflowMode: 1
    - _ZWrite: 1
    m_Colors:
    - _AlbedoEmissionColor: {r: 1, g: 0.9496588, b: 0.93773586, a: 1}
    - _BaseColor: {r: 1, g: 1, b: 1, a: 1}
    - _ClipEdgeColor: {r: 31.626795, g: 3.2571409, b: 0, a: 0}
    - _Color: {r: 0.588, g: 0.588, b: 0.588, a: 1}
    - _EmissionColor: {r: 1.4980392, g: 0.7529412, b: 0.023529412, a: 1}
    - _OutlineColor: {r: 0.21698111, g: 0.21698111, b: 0.21698111, a: 0}
    - _RimColor: {r: 0.03773582, g: 0.008688685, b: 0, a: 0}
    - _RimSmoothStepMinMax: {r: 0, g: 1, b: 0, a: 0}
    - _SpecColor: {r: 0.19999996, g: 0.19999996, b: 0.19999996, a: 1}
    - _SpecularColor: {r: 0.6132076, g: 0.15791698, b: 0.0659487, a: 0}
    - _SpecularDirLightSRPLightIntensity: {r: 1, g: 1, b: 0, a: 0}
    - _SpecularSmoothStepMinMax: {r: 0, g: 0.01, b: 0, a: 0}
    - _SprintColor: {r: 3.0672052, g: 3.0672052, b: 3.0672052, a: 0}
  m_BuildTextureStacks: []
