%YAML 1.1
%TAG !u! tag:unity3d.com,2011:
--- !u!21 &2100000
Material:
  serializedVersion: 6
  m_ObjectHideFlags: 0
  m_CorrespondingSourceObject: {fileID: 0}
  m_PrefabInstance: {fileID: 0}
  m_PrefabAsset: {fileID: 0}
  m_Name: ClickParticle_Line_182x377
  m_Shader: {fileID: 4800000, guid: 955c1d8f0f170394dba39165a27b34bf, type: 3}
  m_ShaderKeywords: _MODE_CLICKMODE
  m_LightmapFlags: 4
  m_EnableInstancingVariants: 0
  m_DoubleSidedGI: 0
  m_CustomRenderQueue: -1
  stringTagMap: {}
  disabledShaderPasses: []
  m_SavedProperties:
    serializedVersion: 3
    m_TexEnvs:
    - _ClickDecorationMask:
        m_Texture: {fileID: 2800000, guid: c4196ff22c48bea4ea62dabb2e873762, type: 3}
        m_Scale: {x: 1, y: 1}
        m_Offset: {x: 0, y: 0}
    - _ClickDecorationTexture:
        m_Texture: {fileID: 2800000, guid: 6f968f96648019743b57c6f8e96ea0eb, type: 3}
        m_Scale: {x: 1, y: 1}
        m_Offset: {x: 0, y: 0}
    - _DistortTexture:
        m_Texture: {fileID: 2800000, guid: 6a41d0f6780330041b8f0ee7f45b34a5, type: 3}
        m_Scale: {x: 1, y: 1}
        m_Offset: {x: 0, y: 0}
    - _ExtraMask:
        m_Texture: {fileID: 2800000, guid: 493a4d87cc78b7242b133946019a785d, type: 3}
        m_Scale: {x: 1, y: 1}
        m_Offset: {x: 0, y: 0}
    - _InnerMask:
        m_Texture: {fileID: 2800000, guid: b05e4af899e9004458ddc36fd6605a06, type: 3}
        m_Scale: {x: 1, y: 1}
        m_Offset: {x: 0, y: 0}
    - _MainTex:
        m_Texture: {fileID: 0}
        m_Scale: {x: 1, y: 1}
        m_Offset: {x: 0, y: 0}
    - _Mask:
        m_Texture: {fileID: 2800000, guid: ef7f4d695323a14459b4a3ace24ce6fc, type: 3}
        m_Scale: {x: 1, y: 1}
        m_Offset: {x: 0, y: 0}
    - _NoiseTexture1:
        m_Texture: {fileID: 2800000, guid: 25ad72a0acb9f4c4cb927d8509cdbda2, type: 3}
        m_Scale: {x: 1, y: 1}
        m_Offset: {x: 0, y: 0}
    - _NoiseTexture2:
        m_Texture: {fileID: 2800000, guid: 58dfeb2bb9db345408903716e2ce1811, type: 3}
        m_Scale: {x: 1, y: 1}
        m_Offset: {x: 0, y: 0}
    m_Floats:
    - _AllAlpha: 0
    - _ClickDecorationEmiision: 0.37
    - _ClickDecorationMaskOffsetY: -0.6
    - _ClickDecorationMaskZoomX: 1.65
    - _ClickDecorationMaskZoomY: 6.31
    - _ClickDecorationZoomX: 1.64
    - _ClickDecorationZoomY: 1.44
    - _ClickFlow: 1
    - _ClickFlowMaxClip: 0.6
    - _ClickFlowMinClip: -0.15
    - _ClickMattern: 0
    - _ColorMask: 15
    - _DecClickorationEmiision: 0.4
    - _DistortFlowSpeed: 0.02
    - _DistortStrength: 0.05
    - _DistortZoomX: 0
    - _DistortZoomY: 0.51
    - _ExtraMaskEmi: 6.08
    - _ExtraMaskOffsetX: 0
    - _ExtraMaskOffsetY: -0.1
    - _ExtraMaskZoom: 3.03
    - _ExtraMaskZoomX: 1.9
    - _ExtraMaskZoomY: 5.67
    - _MaskEmi: 2
    - _MaskZoom: 1.65
    - _Mode: 1
    - _NoiseGeneratorEmission: 1.94
    - _NoiseGeneratorFlowSpeed: -1
    - _NoiseGeneratorPower: 1.03
    - _NoiseGeneratorZoom: 4.03
    - _NoiseTexture1Emission: 3.31
    - _NoiseTexture1FlowSpeed: -0.17
    - _NoiseTexture1FlowSpeedHorizontal: 0.01
    - _NoiseTexture1Zoom: 1.45
    - _NoiseTexture1ZoomX: 3.96
    - _NoiseTexture1ZoomY: 0.97
    - _NoiseTexture2Emission: 4.77
    - _NoiseTexture2FlowSpeed: -0.14
    - _NoiseTexture2FlowSpeedHorizontal: 0
    - _NoiseTexture2Zoom: 1.45
    - _NoiseTexture2ZoomX: 5.23
    - _NoiseTexture2ZoomY: 0.65
    - _OnlyEdgeEmission: 0
    - _Stencil: 0
    - _StencilComp: 8
    - _StencilOp: 0
    - _StencilReadMask: 255
    - _StencilWriteMask: 255
    - _UseUIAlphaClip: 0
    m_Colors:
    - _ClickDecorationST: {r: 1.65, g: 1.44, b: -0.002, a: 0.25}
    - _Color: {r: 1, g: 1, b: 1, a: 1}
    - _Color0: {r: 3.4415908, g: 2.4865944, b: 1.4775416, a: 1}
    - _MainColor: {r: 3.732132, g: 3.029613, b: 1.3611305, a: 1}
  m_BuildTextureStacks: []
