%YAML 1.1
%TAG !u! tag:unity3d.com,2011:
--- !u!114 &11400000
MonoBehaviour:
  m_ObjectHideFlags: 0
  m_CorrespondingSourceObject: {fileID: 0}
  m_PrefabInstance: {fileID: 0}
  m_PrefabAsset: {fileID: 0}
  m_GameObject: {fileID: 0}
  m_Enabled: 1
  m_EditorHideFlags: 0
  m_Script: {fileID: 11500000, guid: fdfaeaf15a52ed84fa08caeabcb67860, type: 3}
  m_Name: Boss
  m_EditorClassIdentifier: 
  sceneName: "Boss_\u8A66\u64FA"
  rooms:
  - {fileID: 11400000, guid: b7f40896c9ab04c49a95696c7ff137f0, type: 2}
