%YAML 1.1
%TAG !u! tag:unity3d.com,2011:
--- !u!21 &2100000
Material:
  serializedVersion: 6
  m_ObjectHideFlags: 0
  m_CorrespondingSourceObject: {fileID: 0}
  m_PrefabInstance: {fileID: 0}
  m_PrefabAsset: {fileID: 0}
  m_Name: "\u6389\u843D\u7269_\u907A\u5FD8\u6C34\u6676_\u53F2\u8A69"
  m_Shader: {fileID: -6465566751694194690, guid: 66867f1298964fc468be14605c3342f1, type: 3}
  m_ShaderKeywords: 
  m_LightmapFlags: 4
  m_EnableInstancingVariants: 0
  m_DoubleSidedGI: 0
  m_CustomRenderQueue: -1
  stringTagMap: {}
  disabledShaderPasses: []
  m_SavedProperties:
    serializedVersion: 3
    m_TexEnvs:
    - Texture2D_d22bb5cd047b4d289c62c09a93779d8d:
        m_Texture: {fileID: 2800000, guid: 8a19dbfd4504990479933ba766e8eabe, type: 3}
        m_Scale: {x: 1, y: 1}
        m_Offset: {x: 0, y: 0}
    - unity_Lightmaps:
        m_Texture: {fileID: 0}
        m_Scale: {x: 1, y: 1}
        m_Offset: {x: 0, y: 0}
    - unity_LightmapsInd:
        m_Texture: {fileID: 0}
        m_Scale: {x: 1, y: 1}
        m_Offset: {x: 0, y: 0}
    - unity_ShadowMasks:
        m_Texture: {fileID: 0}
        m_Scale: {x: 1, y: 1}
        m_Offset: {x: 0, y: 0}
    m_Floats:
    - Boolean_9463e89a994f49719c6462c8137a3806: 1
    - Vector1_44d1440082bd468d91b91e18efd49004: 2.41
    - Vector1_7459748adaff40128a9376ac328ca5da: 1
    - Vector1_74a471aad49b49d9a8daea46f7106fb8: 2.95
    - Vector1_75a9f24622c04607b0c348b14f75677f: 6.4
    - Vector1_8002bd673dd14c30b9ea3fc9fecac99f: 0.01
    - _Dither: 0.84
    m_Colors:
    - Color_47141c1314db4edcaca9e43e45dc5048: {r: 1.0042276, g: 0, b: 7.3772106, a: 1}
    - Color_509cf0ad18fa4822ac3a7cdfe10a8865: {r: 0.8912504, g: 0, b: 36.329643, a: 0}
    - Color_b0f06304dd634de28fcb78333098cec6: {r: 0.69886, g: 0.17197078, b: 0, a: 0}
    - Vector2_75965c67f71c417188e939e9055d004b: {r: 0.5, g: 0.5, b: 0, a: 0}
    - Vector3_7181da15050541de84961eff52f760a0: {r: 0.55, g: 0.51, b: 0.36, a: 0}
  m_BuildTextureStacks: []
