%YAML 1.1
%TAG !u! tag:unity3d.com,2011:
--- !u!1 &5430129071480669868
GameObject:
  m_ObjectHideFlags: 0
  m_CorrespondingSourceObject: {fileID: 0}
  m_PrefabInstance: {fileID: 0}
  m_PrefabAsset: {fileID: 0}
  serializedVersion: 6
  m_Component:
  - component: {fileID: 5430129071480669858}
  - component: {fileID: 5430129071480669859}
  m_Layer: 0
  m_Name: Manager (Particle)
  m_TagString: Untagged
  m_Icon: {fileID: 0}
  m_NavMeshLayer: 0
  m_StaticEditorFlags: 0
  m_IsActive: 1
--- !u!4 &5430129071480669858
Transform:
  m_ObjectHideFlags: 0
  m_CorrespondingSourceObject: {fileID: 0}
  m_PrefabInstance: {fileID: 0}
  m_PrefabAsset: {fileID: 0}
  m_GameObject: {fileID: 5430129071480669868}
  m_LocalRotation: {x: 0, y: 0, z: 0, w: 1}
  m_LocalPosition: {x: 0, y: 0, z: 0}
  m_LocalScale: {x: 1, y: 1, z: 1}
  m_Children: []
  m_Father: {fileID: 0}
  m_RootOrder: 0
  m_LocalEulerAnglesHint: {x: 0, y: 0, z: 0}
--- !u!114 &5430129071480669859
MonoBehaviour:
  m_ObjectHideFlags: 0
  m_CorrespondingSourceObject: {fileID: 0}
  m_PrefabInstance: {fileID: 0}
  m_PrefabAsset: {fileID: 0}
  m_GameObject: {fileID: 5430129071480669868}
  m_Enabled: 1
  m_EditorHideFlags: 0
  m_Script: {fileID: 11500000, guid: 0982a3e169856da4d94878c087cc3d11, type: 3}
  m_Name: 
  m_EditorClassIdentifier: 
  particleList:
  - name: Player
    particles:
    - name: PlayerAttack
      prefab: {fileID: 5614298108206260699, guid: 06edaf34f3302484d97a14fe5ffd737b, type: 3}
    - name: PlayerHeavyAttack
      prefab: {fileID: 7118093247007195654, guid: 20439668ac139204fa2cf78963e45f14, type: 3}
    - name: PlayerDashAttack
      prefab: {fileID: 4979541427751195747, guid: 144b5227cabe1f14daa7129c494ec335, type: 3}
    - name: PlayerDash
      prefab: {fileID: 6050896082625170991, guid: 4406ab8e0b7641b49ae190eb0332d8a8, type: 3}
    - name: PlayerHurt
      prefab: {fileID: 2217404378321392945, guid: ca4f8e8ec92a2ae4aa426a6055fb8d49, type: 3}
    - name: PlayerBlock
      prefab: {fileID: 3534354893175499003, guid: 539f6bd0b8f215e4f96c0d57a007a75f, type: 3}
    - name: PlayerLock
      prefab: {fileID: 7444070083385331149, guid: a52409b82e568f14ab8ebbe77e5510d1, type: 3}
    - name: PlayerSuckEnergy
      prefab: {fileID: 5278101138571288051, guid: c2126bcd01954564cbf33da686d7ae04, type: 3}
    - name: PlayerSweepAttack
      prefab: {fileID: 148659417886014726, guid: 94fd8cb5a2e53fb42b4461ad8147adcd, type: 3}
    - name: PlayerThrowShield
      prefab: {fileID: 4858352930611725188, guid: f94182a00766dcf469263e8b2770ded6, type: 3}
    - name: PlayerThrowShieldHit
      prefab: {fileID: 2046278212796532221, guid: 2055b6ecf090803449d4f8a946e1beae, type: 3}
    - name: PlayerKick
      prefab: {fileID: 4963945538949978409, guid: f99fdc22164133041b590da7f0b61db0, type: 3}
    - name: PlayerKickEnemy
      prefab: {fileID: 6660577805374294078, guid: c8f924037d309214f84e059c4a736b32, type: 3}
    - name: PlayerThrowSpear
      prefab: {fileID: 2573005809283001310, guid: 22bfbc258411166469cc0fe815c98415, type: 3}
    - name: PlayerShieldDash
      prefab: {fileID: 8779023900419513758, guid: 8645e7754a3efa34eb216a7e4bb69bbd, type: 3}
    - name: PlayerShieldDashArc
      prefab: {fileID: 3774376044662023470, guid: cf9fe897f92eda347b759712a9aaa1f3, type: 3}
    - name: PlayerDashStingStart
      prefab: {fileID: 3576452023342174835, guid: c5c8c072c08339f4ea87ed44ece763eb, type: 3}
    - name: PlayerDashSting
      prefab: {fileID: 3576452023342174835, guid: e7bcd369ab5d31d45a07f6805d6ffce4, type: 3}
    - name: PlayerDashStingHold
      prefab: {fileID: 2085868352820364835, guid: 38009c6692ee39e4f8d363c4d172d47b, type: 3}
    - name: PlayerWieldShield
      prefab: {fileID: 5064316792389351981, guid: 5dced104be8f9684ca17438a1eb6feaa, type: 3}
  - name: PlayerBuffEffect
    particles:
    - name: PlayerHeal
      prefab: {fileID: 7674572305002011252, guid: ce40425deefc71c458cae6853972c0a7, type: 3}
    - name: PlayerMoveSpeedUp
      prefab: {fileID: 451121560070253535, guid: df4c3c4fb23aa3b4584338b1788b9d2c, type: 3}
    - name: PlayerDamageUp
      prefab: {fileID: 5115354393154236524, guid: adc8b10a51919e644a3e026d02be15e2, type: 3}
  - name: Bullet
    particles:
    - name: BulletHit
      prefab: {fileID: 5683292225653204588, guid: e58d5d3c93890734992d6fc86762e52e, type: 3}
  - name: Trap
    particles:
    - name: PillarHit
      prefab: {fileID: 5567932938279247551, guid: 00fac3b605cbdad4dbfc8e813d8439dc, type: 3}
    - name: PillarBreak
      prefab: {fileID: 5567932938279247551, guid: cf47dd8540ff73146a658dcc94fdf678, type: 3}
    - name: PrickAttack
      prefab: {fileID: 409230548804236977, guid: ca6dd436e4164f243b5e52f78a769eb7, type: 3}
    - name: AwlBomb
      prefab: {fileID: 7096565992780819517, guid: dc99980d0f230d942970d3f298bd9033, type: 3}
    - name: AwlBombWarning
      prefab: {fileID: 613608825238672185, guid: 11aef21495558834fa6bc162c54e9589, type: 3}
    - name: AwlBurnBomb
      prefab: {fileID: 672531073703793298, guid: 27c0e80992b5e24459719527c81e1371, type: 3}
    - name: PrickHitPlayer
      prefab: {fileID: 8954695388943215472, guid: 0d7cb85113d373642bfcb5a8d6b13cc3, type: 3}
    - name: PreShoot
      prefab: {fileID: 6418991892537832171, guid: 21549ad9fc1e28a46a4e46a2d484314a, type: 3}
    - name: TowerBomb
      prefab: {fileID: 1198963219637882063, guid: 7a0e8a98afbb61147a7dc0b6a5d95882, type: 3}
  - name: Melee01
    particles:
    - name: Melee01Attack
      prefab: {fileID: 5955376124628950492, guid: 9707ac1d32824ba4e8ced65138fddddf, type: 3}
    - name: Melee01Rank3Attack
      prefab: {fileID: 7001271063150810849, guid: 19e0fd2e6fc343b409033390dfd5389a, type: 3}
    - name: Melee01AttackPrepare
      prefab: {fileID: 5446476741963214830, guid: 894c418d74e78ef4faf024a8e621f92f, type: 3}
    - name: Melee03SkillWarning
      prefab: {fileID: 1988104013109104710, guid: 6716924de3973234782fc90076d7a229, type: 3}
    - name: Melee03Skill
      prefab: {fileID: 2890442100637769545, guid: 1a3aa29ce83011b4ead869d30860469d, type: 3}
    - name: Melee03Bite
      prefab: {fileID: 1301758647038747897, guid: 0265657674e2f1f40820de4747bc0b42, type: 3}
    - name: Melee03BitePrepare
      prefab: {fileID: 6198768340910474003, guid: 38a98cd6eb5841a44ae5d721e80e5c0f, type: 3}
  - name: Melee02
    particles:
    - name: Melee02PreAttack
      prefab: {fileID: 7454072976466145286, guid: 0ff27addeb1992b45b611c45b0aa4f1d, type: 3}
    - name: Melee02Attack
      prefab: {fileID: 3319963405024108918, guid: 43a07889b30ea054c965de752b7b1ad4, type: 3}
  - name: Range01
    particles:
    - name: Range01Accumulate
      prefab: {fileID: 3810257253371590705, guid: dffa67c835fc53b4094df9fcfb942cd3, type: 3}
    - name: Range01Attack
      prefab: {fileID: 5446014608491388299, guid: 8e189d9cfb3034b4db5a138fb9d61ae9, type: 3}
    - name: Range01CounterAttack
      prefab: {fileID: 7409693707817311954, guid: 6829ea2c867009c46895e02e02b7fd5f, type: 3}
    - name: Range01Drail
      prefab: {fileID: 6760505021989777805, guid: a31618ff1bb71294a98019733484a84e, type: 3}
    - name: Range01DrailUp
      prefab: {fileID: 3074761583330179547, guid: 3df2715180166f34d9dcd5e2a855f380, type: 3}
    - name: Range01DrailWarning
      prefab: {fileID: 753661580073061041, guid: 754099878c338ba47afa269d8de6ecc4, type: 3}
  - name: Range01Rank3
    particles:
    - name: Range01Skill01
      prefab: {fileID: 5993429387882877841, guid: c985f528ebc8cb34296e0f8bb5b78b47, type: 3}
    - name: Range01Skill01Warning
      prefab: {fileID: 1988104013109104710, guid: 6716924de3973234782fc90076d7a229, type: 3}
    - name: Range01Skill01Hit
      prefab: {fileID: 2207658912835754681, guid: 612747e0fee7c51448ee2b3cf0730f24, type: 3}
  - name: Range02
    particles:
    - name: Range02Attack
      prefab: {fileID: 1475638912702087503, guid: b9551ce0c4529e2449fea0f9bb79e55e, type: 3}
    - name: Range02SkillAttack
      prefab: {fileID: 757528705188393652, guid: d6b900988fd3909468d3519a1af88336, type: 3}
    - name: Range02PreSkillAttack
      prefab: {fileID: 7675998898142051645, guid: 957ec168d34fa57419efd9d2aee12c36, type: 3}
  - name: Range02New
    particles:
    - name: Range02Prepare
      prefab: {fileID: 6453808469551879403, guid: 76d1ff6e1487a2745b0b4e5cfa576f64, type: 3}
    - name: Range02Warning
      prefab: {fileID: 8239700219340503283, guid: 460d17b93cb45ee4180f80823b63306c, type: 3}
  - name: Fire03
    particles:
    - name: Fire03Attack01
      prefab: {fileID: 1166175793737961109, guid: a55ba0e77d61e2949a814599f1bee318, type: 3}
    - name: Fire03Attack03
      prefab: {fileID: 3098353490032135722, guid: fb7fde501bbd1824694317a929112e7c, type: 3}
    - name: Fire03Attack02
      prefab: {fileID: 5692890607347433965, guid: b4b06cc6745189b42845730412f626f6, type: 3}
    - name: Fire03BackShootWarning
      prefab: {fileID: 4821771104955778514, guid: a0000005557d16b41a4020bcf0d98062, type: 3}
  - name: Boss
    particles:
    - name: BossHitWater
      prefab: {fileID: 3190125994726509976, guid: e1c040bd3b626a142ba7187f3cee1ec1, type: 3}
    - name: BossAwl
      prefab: {fileID: 2962873887300244847, guid: 4bba736a1656af84cb0200f2da93574a, type: 3}
    - name: BossAwlHitWater
      prefab: {fileID: 3872794633886717787, guid: 47d51dd5cc207bd4cad8745e9836dac4, type: 3}
    - name: BossAwlWarning
      prefab: {fileID: 1988104013109104710, guid: 6716924de3973234782fc90076d7a229, type: 3}
    - name: BossFlyHeavyAttack
      prefab: {fileID: 6217396680451497174, guid: 22a4d8c409df6d94cb9fad0d28b68bbe, type: 3}
    - name: BossBombCircle
      prefab: {fileID: 1122215268478065357, guid: b6087488a479fcd429d685d75cd69b79, type: 3}
    - name: WaterShockHitPlayer
      prefab: {fileID: 0}
    - name: BossHandFlyAttack
      prefab: {fileID: 597787212966625943, guid: 3ba8b504f7db7f34e820927e45ab8aaa, type: 3}
    - name: BossShootWarningShort
      prefab: {fileID: 612965603524189408, guid: 6999bea4fdee1e34492ab10fc452f9d5, type: 3}
    - name: BossShootWarningLong
      prefab: {fileID: 8186381478327265012, guid: 2306b99a583ebbc46b725ded0f7daba9, type: 3}
    - name: BossHandWarningShort
      prefab: {fileID: 612965603524189408, guid: 8b261da5f6f2f0e4884b685f1888180b, type: 3}
    - name: BossHandWarningLong
      prefab: {fileID: 8186381478327265012, guid: 51cf0fd24caf70d4587e1daa5b9871e8, type: 3}
  - name: EnemyCommon
    particles:
    - name: EnemyHurt
      prefab: {fileID: 8005356751700670364, guid: a60feb8e6d1b34347b1f101b7231f668, type: 3}
    - name: AttackIndicator
      prefab: {fileID: 8313296841210587564, guid: 52240e5d6535403419b96ea05ec68056, type: 3}
    - name: AttackIndicatorBurst
      prefab: {fileID: 3122048051375166068, guid: d5ddce0b38d212149904a5afb4952679, type: 3}
    - name: AttackIndicatorSmall
      prefab: {fileID: 8607080683063935938, guid: c5b954cbec8017f4aaac437c3fa1bab6, type: 3}
    - name: AttackIndicatorBurstSmall
      prefab: {fileID: 2324098981744169926, guid: fced386560628874baf52d9fdbb57040, type: 3}
    - name: EnemyShieldCount
      prefab: {fileID: 7522775938805346998, guid: d7618c22fa1121746b05ad7c7349ab93, type: 3}
    - name: EnemyShieldBreak
      prefab: {fileID: 11026022413736180, guid: 1f3683d5ac8956d46b0c125f51de1940, type: 3}
    - name: EnemyRaserHit
      prefab: {fileID: 6547725348804223201, guid: 171963b83a06b794fa76aecdcc2f71a7, type: 3}
    - name: EnemyBlock
      prefab: {fileID: 2144592314674337439, guid: b38931a80eb717d4f9940326d38abb12, type: 3}
    - name: EnemyDizzy
      prefab: {fileID: 4401264824258318012, guid: 70d3b71fe486b9849a99a5ea46f85eb0, type: 3}
    - name: EnemyDieBomb
      prefab: {fileID: 1198963219637882063, guid: 7a0e8a98afbb61147a7dc0b6a5d95882, type: 3}
    - name: EnemyShield
      prefab: {fileID: 7332143075833729746, guid: 0f05d1a2d64f58b47b6544ef3b927b90, type: 3}
    - name: EnemyShieldBreak
      prefab: {fileID: 11026022413736180, guid: 1f3683d5ac8956d46b0c125f51de1940, type: 3}
  - name: Common
    particles:
    - name: SpawnWarning
      prefab: {fileID: 6711234345401345615, guid: 05f1934892ef0754192c1f5fb4c6904e, type: 3}
    - name: BombWarning
      prefab: {fileID: 1988104013109104710, guid: 6716924de3973234782fc90076d7a229, type: 3}
    - name: TraceCrystalBomb
      prefab: {fileID: 7109767347053358677, guid: 731ed7af9dc910c4cb3e88bddc5c99c1, type: 3}
  - name: EnvironmentEffect
    particles:
    - name: Thunder
      prefab: {fileID: 1976616791032312973, guid: 5d7b706f36590984cacebebf90e44145, type: 3}
    - name: VinePoison
      prefab: {fileID: 1867030272124093274, guid: 10f68c100236fb54aa8e45eac4cbd498, type: 3}
    - name: TraceCrystal
      prefab: {fileID: 8011463669915732250, guid: 6e7c63581fb50a9418be8c9f623d65d6, type: 3}
    - name: ThunderRoom
      prefab: {fileID: 4354733564705885642, guid: 9e4a0ad208ce84d43bceec3fa0997b58, type: 3}
    - name: VineRoom
      prefab: {fileID: 7084622390418141216, guid: 796683dc6a4b20848b6380ebfb6ed9f4, type: 3}
    - name: Mist
      prefab: {fileID: 5194605884155736891, guid: 5e684401493eafa48b0c986a77c0f294, type: 3}
    - name: TraceCrystal
      prefab: {fileID: 8011463669915732250, guid: 6e7c63581fb50a9418be8c9f623d65d6, type: 3}
  - name: InteractableObject
    particles:
    - name: FireDissipate
      prefab: {fileID: 1457255400303986058, guid: 9251f9e0eb855524181a5db69d0f9971, type: 3}
    - name: FireCollect
      prefab: {fileID: 5745470270620136732, guid: 88c2878d9913ff443b1cc50f1f10705a, type: 3}
    - name: CrytalFlowerHit
      prefab: {fileID: 7319226583933063705, guid: 71e222c1e14dbe848bb4dbbbe9e0e757, type: 3}
    - name: BerryFruitHit
      prefab: {fileID: 4760450490588502210, guid: 20939a0358ad08b419a45c47ea40ee09, type: 3}
    - name: BerryFruitEnergy
      prefab: {fileID: 4397105593506015695, guid: 33059e0becaf6e64090e5b7b2f744236, type: 3}
