%YAML 1.1
%TAG !u! tag:unity3d.com,2011:
--- !u!21 &2100000
Material:
  serializedVersion: 6
  m_ObjectHideFlags: 0
  m_CorrespondingSourceObject: {fileID: 0}
  m_PrefabInstance: {fileID: 0}
  m_PrefabAsset: {fileID: 0}
  m_Name: "vfx_\u7981\u932E\u4E4B\u6A39"
  m_Shader: {fileID: 4800000, guid: f75c16b77e4862f4d8830e67281dd18d, type: 3}
  m_ShaderKeywords: 
  m_LightmapFlags: 4
  m_EnableInstancingVariants: 0
  m_DoubleSidedGI: 0
  m_CustomRenderQueue: -1
  stringTagMap: {}
  disabledShaderPasses: []
  m_SavedProperties:
    serializedVersion: 3
    m_TexEnvs:
    - _Trunk:
        m_Texture: {fileID: 2800000, guid: f82113c18274bb546aa6216f476541fb, type: 3}
        m_Scale: {x: 1.5, y: 10}
        m_Offset: {x: 0, y: 0}
    - _Trunk_Emission:
        m_Texture: {fileID: 2800000, guid: 9706e0bfeff25be4ea6cbf3ba7cdde40, type: 3}
        m_Scale: {x: 1.5, y: 10}
        m_Offset: {x: 0, y: 0}
    - _Trunk_Height:
        m_Texture: {fileID: 2800000, guid: 45f36ce3e6fada24f870c07af873204d, type: 3}
        m_Scale: {x: 1.5, y: 10}
        m_Offset: {x: 0, y: 0}
    - _Trunk_Normal:
        m_Texture: {fileID: 2800000, guid: edffad569fa0ab24e8a6a07d8a598506, type: 3}
        m_Scale: {x: 1.5, y: 10}
        m_Offset: {x: 0, y: 0}
    - _texcoord:
        m_Texture: {fileID: 0}
        m_Scale: {x: 1, y: 1}
        m_Offset: {x: 0, y: 0}
    m_Floats:
    - _AlphaCutoff: 0.5
    - _CSRange: 0
    - _CSRange1: 0
    - _CSSoft: 1
    - _CSSoft1: 1
    - _Clip: -0.11
    - _HeightStrength: 0.24
    - _TessValue: 16
    - _VertexOffset: 0.6
    - _WidthOffset: 1
    m_Colors:
    - _Color0: {r: 1, g: 0.97547174, b: 0.97547174, a: 0}
    - _Emission: {r: 0.4755189, g: 3.7090473, b: 0, a: 1}
    - _EmissionColor: {r: 1, g: 1, b: 1, a: 1}
    - _MSO: {r: 0.16, g: -1, b: 0.5, a: 0}
  m_BuildTextureStacks: []
