%YAML 1.1
%TAG !u! tag:unity3d.com,2011:
--- !u!21 &2100000
Material:
  serializedVersion: 6
  m_ObjectHideFlags: 0
  m_CorrespondingSourceObject: {fileID: 0}
  m_PrefabInstance: {fileID: 0}
  m_PrefabAsset: {fileID: 0}
  m_Name: "vfx_\u9EDE\u7DB4\u7CFB\u5217_ToonExplosionCore_01_ma"
  m_Shader: {fileID: 4800000, guid: 208e7af19aa38c34db8d81ac82a00547, type: 3}
  m_ShaderKeywords: 
  m_LightmapFlags: 4
  m_EnableInstancingVariants: 0
  m_DoubleSidedGI: 0
  m_CustomRenderQueue: -1
  stringTagMap: {}
  disabledShaderPasses: []
  m_SavedProperties:
    serializedVersion: 3
    m_TexEnvs:
    - _MainTex:
        m_Texture: {fileID: 2800000, guid: 46d158eb78ec443458cf2f025380348d, type: 3}
        m_Scale: {x: 1, y: 1}
        m_Offset: {x: 0, y: 0}
    - _SmokeTexture:
        m_Texture: {fileID: 2800000, guid: 76a3f0d66ca121d40b4b2f4ebfe01c85, type: 3}
        m_Scale: {x: 2, y: 2}
        m_Offset: {x: 0, y: 0}
    - _TextureSample0:
        m_Texture: {fileID: 2800000, guid: fcf78a304a5941a498cf4f4e45156082, type: 3}
        m_Scale: {x: 2, y: 2}
        m_Offset: {x: 0, y: 0}
    - _texcoord:
        m_Texture: {fileID: 0}
        m_Scale: {x: 1, y: 1}
        m_Offset: {x: 0, y: 0}
    m_Floats:
    - _AlphaCutoff: 0.5
    - _CullMode: 0
    - _Float1: 0
    - _Float2: 0.0001
    - _MainTexUSpeed: -0.1
    - _MainTexVSpeed: 0.2
    - _NoiseScale: 30
    - _VertexScaleMultiply: 4
    m_Colors:
    - _Color0: {r: 15.813397, g: 0.46879166, b: 0, a: 1}
    - _Color1: {r: 0.2264151, g: 0.023480084, b: 0, a: 1}
    - _CoreColor: {r: 1.7207954, g: 0.135141, b: 0, a: 1}
    - _EmissionColor: {r: 1, g: 1, b: 1, a: 1}
    - _MiddleColor: {r: 8.47419, g: 2.3372252, b: 0, a: 1}
    - _OutColor: {r: 0.11320752, g: 0.0680731, b: 0.061302938, a: 1}
    - _VertexPower: {r: 0, g: 0, b: 0, a: 0}
  m_BuildTextureStacks: []
