%YAML 1.1
%TAG !u! tag:unity3d.com,2011:
--- !u!114 &-7597570453632370572
MonoBehaviour:
  m_ObjectHideFlags: 11
  m_CorrespondingSourceObject: {fileID: 0}
  m_PrefabInstance: {fileID: 0}
  m_PrefabAsset: {fileID: 0}
  m_GameObject: {fileID: 0}
  m_Enabled: 1
  m_EditorHideFlags: 0
  m_Script: {fileID: 11500000, guid: d0353a89b1f911e48b9e16bdc9f2e058, type: 3}
  m_Name: 
  m_EditorClassIdentifier: 
  version: 4
--- !u!21 &2100000
Material:
  serializedVersion: 6
  m_ObjectHideFlags: 0
  m_CorrespondingSourceObject: {fileID: 0}
  m_PrefabInstance: {fileID: 0}
  m_PrefabAsset: {fileID: 0}
  m_Name: Jars_m_Outdoor
  m_Shader: {fileID: 4800000, guid: 760f550bf9b463343a1254ec6f76b3e5, type: 3}
  m_ShaderKeywords: _SHADOWREMAPTYPE_USESHADOWREMAPMAP _SHADOWUSEDITHER_ON _USEHEIGHTFOG_ON
    _USESSAO_ON
  m_LightmapFlags: 4
  m_EnableInstancingVariants: 0
  m_DoubleSidedGI: 0
  m_CustomRenderQueue: -1
  stringTagMap: {}
  disabledShaderPasses: []
  m_SavedProperties:
    serializedVersion: 3
    m_TexEnvs:
    - _3DTexture:
        m_Texture: {fileID: 0}
        m_Scale: {x: 1, y: 1}
        m_Offset: {x: 0, y: 0}
    - _AlbedoMap:
        m_Texture: {fileID: 2800000, guid: 985473ecd8edb0c4aac95762e5b9d815, type: 3}
        m_Scale: {x: 1, y: 1}
        m_Offset: {x: 0, y: 0}
    - _BaseMap:
        m_Texture: {fileID: 2800000, guid: 985473ecd8edb0c4aac95762e5b9d815, type: 3}
        m_Scale: {x: 1, y: 1}
        m_Offset: {x: 0, y: 0}
    - _BumpMap:
        m_Texture: {fileID: 0}
        m_Scale: {x: 1, y: 1}
        m_Offset: {x: 0, y: 0}
    - _DetailAlbedoMap:
        m_Texture: {fileID: 0}
        m_Scale: {x: 1, y: 1}
        m_Offset: {x: 0, y: 0}
    - _DetailMask:
        m_Texture: {fileID: 0}
        m_Scale: {x: 1, y: 1}
        m_Offset: {x: 0, y: 0}
    - _DetailNormalMap:
        m_Texture: {fileID: 0}
        m_Scale: {x: 1, y: 1}
        m_Offset: {x: 0, y: 0}
    - _EmissionMap:
        m_Texture: {fileID: 0}
        m_Scale: {x: 1, y: 1}
        m_Offset: {x: 0, y: 0}
    - _EmissionTexture:
        m_Texture: {fileID: 0}
        m_Scale: {x: 1, y: 1}
        m_Offset: {x: 0, y: 0}
    - _IndirectDiffuseLightNormal:
        m_Texture: {fileID: 0}
        m_Scale: {x: 1, y: 1}
        m_Offset: {x: 0, y: 0}
    - _MainTex:
        m_Texture: {fileID: 2800000, guid: 985473ecd8edb0c4aac95762e5b9d815, type: 3}
        m_Scale: {x: 1, y: 1}
        m_Offset: {x: 0, y: 0}
    - _MetallicGlossMap:
        m_Texture: {fileID: 0}
        m_Scale: {x: 1, y: 1}
        m_Offset: {x: 0, y: 0}
    - _NormalMap:
        m_Texture: {fileID: 2800000, guid: 7c63f4aa0acf7744a822ecce77a0ed53, type: 3}
        m_Scale: {x: 1, y: 1}
        m_Offset: {x: 0, y: 0}
    - _OcclusionMap:
        m_Texture: {fileID: 0}
        m_Scale: {x: 1, y: 1}
        m_Offset: {x: 0, y: 0}
    - _ParallaxMap:
        m_Texture: {fileID: 0}
        m_Scale: {x: 1, y: 1}
        m_Offset: {x: 0, y: 0}
    - _RampCelluloidNoiseTexture:
        m_Texture: {fileID: 0}
        m_Scale: {x: 1, y: 1}
        m_Offset: {x: 0, y: 0}
    - _ShadowRemapMap:
        m_Texture: {fileID: 2800000, guid: 5c17639b73e66a64eb1bf87957b3160a, type: 3}
        m_Scale: {x: 1, y: 1}
        m_Offset: {x: 0, y: 0}
    - _SpecGlossMap:
        m_Texture: {fileID: 0}
        m_Scale: {x: 1, y: 1}
        m_Offset: {x: 0, y: 0}
    - _SpecularMap:
        m_Texture: {fileID: 0}
        m_Scale: {x: 1, y: 1}
        m_Offset: {x: 0, y: 0}
    - _texcoord:
        m_Texture: {fileID: 0}
        m_Scale: {x: 1, y: 1}
        m_Offset: {x: 0, y: 0}
    - unity_Lightmaps:
        m_Texture: {fileID: 0}
        m_Scale: {x: 1, y: 1}
        m_Offset: {x: 0, y: 0}
    - unity_LightmapsInd:
        m_Texture: {fileID: 0}
        m_Scale: {x: 1, y: 1}
        m_Offset: {x: 0, y: 0}
    - unity_ShadowMasks:
        m_Texture: {fileID: 0}
        m_Scale: {x: 1, y: 1}
        m_Offset: {x: 0, y: 0}
    m_Floats:
    - _AOMix: 0.728
    - _AOSmoothness: 1
    - _AOThresold: 0
    - _Alpha: 1
    - _AlphaClip: 0
    - _AlphaCutoff: 0.5
    - _BlackClipSmoothness: 1
    - _BlackClipValue: 0
    - _Blend: 1
    - _BumpScale: 1
    - _CamPosDither: -6
    - _ClearCoatMask: 0
    - _ClearCoatSmoothness: 0
    - _Cull: 2
    - _Cutoff: 0.5
    - _DetailAlbedoMapScale: 1
    - _DetailNormalMapScale: 1
    - _DiffuseLightStrength: 0
    - _DirLightIntensity: 1
    - _DirLightNormalScale: 0.6
    - _DstBlend: 0
    - _EmissionStrength: 1
    - _EnvironmentReflections: 1
    - _FogHeightEnd: 4.5
    - _FogHeightStart: 20
    - _FogNoiseEdgeSmoothness: 1.12
    - _FogNoiseEdgeValue: 0
    - _GlossMapScale: 0
    - _Glossiness: 0
    - _GlossyReflections: 0
    - _HeightFogWorldPosYClipAdd: -0.5
    - _IndirectDiffuseLightNormalStrength: 1
    - _LightAttSoft: 0.46
    - _LightAttValue: -0.3
    - _Metallic: 0
    - _MultiplyEmissionTexture: 0
    - _NoiseAlpha: 0
    - _NoiseDensityUseAdd: 0.4
    - _NoiseFogClip: 2.75
    - _NoiseFogSoft: 2.81
    - _NoiseScale: 0.05
    - _NoiseStrengthUsePower: 1.11
    - _NormalStrength: 3
    - _OcclusionStrength: 1
    - _OnlyUseXZAxis: 1
    - _Parallax: 0.005
    - _PlayerMaskOpen: 0
    - _PlayerPositionMaskAlpha: 1
    - _Power: 1
    - _QueueOffset: 0
    - _RampAddincludePower: 0
    - _RampAddwithoutPower: 0.25
    - _RampCelluloidNoiseSoftness: 1
    - _RampCelluloidNoiseValue: 0
    - _RampPower: 1
    - _ReceiveShadows: 1
    - _RimOffset: 0
    - _ShadowRemapType: 1
    - _ShadowUseDither: 1
    - _Smoothness: 0
    - _SmoothnessTextureChannel: 0
    - _SpecularHighlights: 1
    - _SpecularIntensity: 0
    - _SpecularPow: 4
    - _SpecularSRPLightSampler: 5
    - _SrcBlend: 1
    - _Surface: 0
    - _Use3SSimulation: 0
    - _Use3SSimulation1: 0
    - _UseBakedGl: 0
    - _UseCameraDepthClip: 0
    - _UseFogNoise: 1
    - _UseHeightFog: 1
    - _UseSSAO: 1
    - _WorkflowMode: 1
    - _WorldNoiseYMaskClip: -0.59
    - _WorldNoiseYMaskStrength: 1000
    - _ZWrite: 1
    m_Colors:
    - _3SColor: {r: 0, g: 0, b: 0, a: 0}
    - _AOColour: {r: 0, g: 0, b: 0, a: 0}
    - _AlbedoEmissionColor: {r: 0.5943396, g: 0.5152738, b: 0.4457547, a: 0}
    - _BaseColor: {r: 1, g: 1, b: 1, a: 1}
    - _BassColor: {r: 1, g: 1, b: 1, a: 1}
    - _Color: {r: 1, g: 1, b: 1, a: 1}
    - _Color0: {r: 1, g: 1, b: 1, a: 0}
    - _EmissionColor: {r: 0, g: 0, b: 0, a: 1}
    - _HeightFogColor: {r: 0.15896086, g: 0.03071345, b: 0, a: 0}
    - _NoiseSpeedWorldPos: {r: 1, g: 0, b: -1, a: 0}
    - _PlayerMaskPosition: {r: 0, g: 0, b: 0, a: 0}
    - _RimColor: {r: 0, g: 0, b: 0, a: 0}
    - _RimSmoothStepMinMax: {r: 0, g: 1, b: 0, a: 0}
    - _SpecColor: {r: 0.19999996, g: 0.19999996, b: 0.19999996, a: 1}
    - _SpecularColor: {r: 1, g: 1, b: 1, a: 0}
    - _SpecularDirLightSRPLightIntensity: {r: 1, g: 1, b: 0, a: 0}
    - _SpecularSRPLightSmoothstep: {r: 0, g: 1, b: 0, a: 0}
    - _SpecularSmoothStepMinMax: {r: 0, g: 0.01, b: 0, a: 0}
  m_BuildTextureStacks: []
