%YAML 1.1
%TAG !u! tag:unity3d.com,2011:
--- !u!21 &2100000
Material:
  serializedVersion: 6
  m_ObjectHideFlags: 0
  m_CorrespondingSourceObject: {fileID: 0}
  m_PrefabInstance: {fileID: 0}
  m_PrefabAsset: {fileID: 0}
  m_Name: ce_Aurora_02_ma
  m_Shader: {fileID: -6465566751694194690, guid: b60ea12de3c933742974bc892c1812d4, type: 3}
  m_ShaderKeywords: 
  m_LightmapFlags: 4
  m_EnableInstancingVariants: 0
  m_DoubleSidedGI: 0
  m_CustomRenderQueue: -1
  stringTagMap: {}
  disabledShaderPasses: []
  m_SavedProperties:
    serializedVersion: 3
    m_TexEnvs:
    - Texture2D_9a23e788aeb74d1ab8c292e9cd2c686f:
        m_Texture: {fileID: 10300, guid: 0000000000000000f000000000000000, type: 0}
        m_Scale: {x: 1, y: 1}
        m_Offset: {x: 0, y: 0}
    - Texture2D_d6d98b4e96b04720afe4bfdf8746a490:
        m_Texture: {fileID: 2800000, guid: 36ada77200269134f905e49618155867, type: 3}
        m_Scale: {x: 1, y: 1}
        m_Offset: {x: 0, y: 0}
    - _Texture2DAsset_1c54f99ea1bf426990b3ea8c0f4d40cb_Out_0:
        m_Texture: {fileID: 2800000, guid: 02b833a1d15601142baf90e99e76e7e7, type: 3}
        m_Scale: {x: 1, y: 1}
        m_Offset: {x: 0, y: 0}
    - unity_Lightmaps:
        m_Texture: {fileID: 0}
        m_Scale: {x: 1, y: 1}
        m_Offset: {x: 0, y: 0}
    - unity_LightmapsInd:
        m_Texture: {fileID: 0}
        m_Scale: {x: 1, y: 1}
        m_Offset: {x: 0, y: 0}
    - unity_ShadowMasks:
        m_Texture: {fileID: 0}
        m_Scale: {x: 1, y: 1}
        m_Offset: {x: 0, y: 0}
    m_Floats:
    - Vector1_8f085813065d4afa92dfaca8839fcd67: 1.21
    - Vector1_9533cdc649164513bffd69c6e7cc1b62: 0.3
    - Vector1_e24036e59b6a4027b4bdbafe53e35f45: 4.49
    - Vector1_f8f13a3f0d804a0eb29187aaf2e3eefd: 0
    m_Colors:
    - Color_240ae0ae2e0f40948557182b5b3e6839: {r: 3.869203, g: 158.05533, b: 170.89003, a: 1}
    - Vector3_4f5eb1b650614ed98f962888a57ab5cc: {r: 0, g: -90, b: 0, a: 0}
    - Vector4_f3fea5af201a47039385fcdcd81c5be8: {r: 1, g: 10.4, b: 0.02, a: 0}
    - _NoiseST: {r: 90.51, g: 1, b: 0, a: -0.1}
  m_BuildTextureStacks: []
