%YAML 1.1
%TAG !u! tag:unity3d.com,2011:
--- !u!21 &2100000
Material:
  serializedVersion: 6
  m_ObjectHideFlags: 0
  m_CorrespondingSourceObject: {fileID: 0}
  m_PrefabInstance: {fileID: 0}
  m_PrefabAsset: {fileID: 0}
  m_Name: Hasira
  m_Shader: {fileID: -6465566751694194690, guid: 6df3257be4479bd409c1eee9c1f39e7d, type: 3}
  m_ShaderKeywords: 
  m_LightmapFlags: 4
  m_EnableInstancingVariants: 0
  m_DoubleSidedGI: 0
  m_CustomRenderQueue: -1
  stringTagMap: {}
  disabledShaderPasses: []
  m_SavedProperties:
    serializedVersion: 3
    m_TexEnvs:
    - Texture2D_64a33f42e9714e57b8c701e27b758a84:
        m_Texture: {fileID: 2800000, guid: 3b06ed30f9e3e424cb0bb8470fce0b16, type: 3}
        m_Scale: {x: 1, y: 1}
        m_Offset: {x: 0, y: 0}
    - unity_Lightmaps:
        m_Texture: {fileID: 0}
        m_Scale: {x: 1, y: 1}
        m_Offset: {x: 0, y: 0}
    - unity_LightmapsInd:
        m_Texture: {fileID: 0}
        m_Scale: {x: 1, y: 1}
        m_Offset: {x: 0, y: 0}
    - unity_ShadowMasks:
        m_Texture: {fileID: 0}
        m_Scale: {x: 1, y: 1}
        m_Offset: {x: 0, y: 0}
    m_Floats:
    - Vector1_54a86f0195404fdda255035a0db95f21: 0.08
    - Vector1_59dba137141249328c7de151feb11036: 0.6
    - Vector1_64a71fdd527d47f8b32907b9bedbb9c6: 0.19
    - Vector1_a1ae20695b434076bf641b5e104772cc: 1.19
    - Vector1_fc18e95657f44151b38442a3ad68616f: 0.16
    m_Colors:
    - Color_50d62946dcd741d5b798096c6f8fb61d: {r: 0.754717, g: 0.2783837, b: 0, a: 0.21176471}
    - Vector4_fd5930ed786f48acbacd37c0f2f45bee: {r: 16, g: 8, b: 0, a: -0.32}
  m_BuildTextureStacks: []
