%YAML 1.1
%TAG !u! tag:unity3d.com,2011:
--- !u!21 &2100000
Material:
  serializedVersion: 6
  m_ObjectHideFlags: 0
  m_CorrespondingSourceObject: {fileID: 0}
  m_PrefabInstance: {fileID: 0}
  m_PrefabAsset: {fileID: 0}
  m_Name: TAASE_mesh_Field
  m_Shader: {fileID: 4800000, guid: f37155d6fc5bdca45bf32f1f22c1a229, type: 3}
  m_ShaderKeywords: _OFFSETEFFECTOPEN_ON
  m_LightmapFlags: 4
  m_EnableInstancingVariants: 0
  m_DoubleSidedGI: 0
  m_CustomRenderQueue: -1
  stringTagMap: {}
  disabledShaderPasses: []
  m_SavedProperties:
    serializedVersion: 3
    m_TexEnvs:
    - _MainTex:
        m_Texture: {fileID: 2800000, guid: 179d13ea80f031b4e860841fb9e40bfa, type: 3}
        m_Scale: {x: 5, y: 5}
        m_Offset: {x: 0, y: 0}
    - _NoiseTexture:
        m_Texture: {fileID: 11700000, guid: 5f35d93e2de904dadbc51cf5100fe09c, type: 2}
        m_Scale: {x: 1, y: 1}
        m_Offset: {x: 0, y: 0}
    - _NormalTex:
        m_Texture: {fileID: 2800000, guid: 9f4ef5bb2517ab64392ad2b8e87bf636, type: 3}
        m_Scale: {x: 5, y: 5}
        m_Offset: {x: 0, y: 0}
    - _tex3coord:
        m_Texture: {fileID: 0}
        m_Scale: {x: 1, y: 1}
        m_Offset: {x: 0, y: 0}
    - _texcoord:
        m_Texture: {fileID: 0}
        m_Scale: {x: 1, y: 1}
        m_Offset: {x: 0, y: 0}
    m_Floats:
    - _AO: 1
    - _AlphaCutoff: 0.5
    - _DistanceSoft: 30
    - _DistanceValue: 0.47
    - _HeightControlZOffset: 0
    - _Lerp0Scale: 100
    - _Lerp0zScale: 0.99
    - _Lerp1Scale: 0
    - _NoiseStrength: -13.1
    - _NormalScale: 1
    - _OffsetEffectOpen: 1
    - _PlayerPositionScale: 0.15
    - _Power: -5
    - _Range: 27.15
    - _RotateAngleStrength: 128.48
    - _SmoothnessValue: -5.23
    - _Soft: 17.33
    - _VertexPositionCAll: 1.86
    m_Colors:
    - _Clamp: {r: 0, g: 1.31, b: 0, a: 0}
    - _EmiColorOne: {r: 0, g: 0, b: 0, a: 1}
    - _EmiColorZero: {r: 0, g: 0, b: 0, a: 0}
    - _EmissionColor: {r: 1, g: 1, b: 1, a: 1}
    - _Lerp0XYZOffset: {r: 0, g: 0, b: 200, a: 0}
    - _MainColor: {r: 1, g: 1, b: 1, a: 1}
    - _MetaSmooth: {r: 0, g: 0, b: 0, a: 0}
    - _PlayerPositionOffset: {r: 0, g: 0, b: 0, a: 0}
    - _Position: {r: -1.901, g: 0.469, b: 0.358, a: 0}
    - _VertexOffsetXYZStrength: {r: 50, g: 50, b: -50, a: 0}
  m_BuildTextureStacks: []
