%YAML 1.1
%TAG !u! tag:unity3d.com,2011:
--- !u!21 &2100000
Material:
  serializedVersion: 6
  m_ObjectHideFlags: 0
  m_CorrespondingSourceObject: {fileID: 0}
  m_PrefabInstance: {fileID: 0}
  m_PrefabAsset: {fileID: 0}
  m_Name: "Statue_m(\u6697\u9ED1\u795E\u50CF \u738B\u95DC)"
  m_Shader: {fileID: 4800000, guid: 760f550bf9b463343a1254ec6f76b3e5, type: 3}
  m_ShaderKeywords: _ONLYUSEXZAXIS_ON _SHADOWREMAPTYPE_USESHADOWREMAPMAP
  m_LightmapFlags: 4
  m_EnableInstancingVariants: 0
  m_DoubleSidedGI: 0
  m_CustomRenderQueue: -1
  stringTagMap: {}
  disabledShaderPasses: []
  m_SavedProperties:
    serializedVersion: 3
    m_TexEnvs:
    - _3DTexture:
        m_Texture: {fileID: 2800000, guid: e025385ced9529246bb9a266feb0996d, type: 3}
        m_Scale: {x: 1, y: 1}
        m_Offset: {x: 0, y: 0}
    - _AlbedoMap:
        m_Texture: {fileID: 2800000, guid: 3c4c174f31e306e40b45d9fa3bbcd713, type: 3}
        m_Scale: {x: 1, y: 1}
        m_Offset: {x: 0, y: 0}
    - _BaseMap:
        m_Texture: {fileID: 0}
        m_Scale: {x: 1, y: 1}
        m_Offset: {x: 0, y: 0}
    - _BumpMap:
        m_Texture: {fileID: 0}
        m_Scale: {x: 1, y: 1}
        m_Offset: {x: 0, y: 0}
    - _DetailAlbedoMap:
        m_Texture: {fileID: 0}
        m_Scale: {x: 1, y: 1}
        m_Offset: {x: 0, y: 0}
    - _DetailMask:
        m_Texture: {fileID: 0}
        m_Scale: {x: 1, y: 1}
        m_Offset: {x: 0, y: 0}
    - _DetailNormalMap:
        m_Texture: {fileID: 0}
        m_Scale: {x: 1, y: 1}
        m_Offset: {x: 0, y: 0}
    - _EmissionMap:
        m_Texture: {fileID: 0}
        m_Scale: {x: 1, y: 1}
        m_Offset: {x: 0, y: 0}
    - _EmissionTexture:
        m_Texture: {fileID: 0}
        m_Scale: {x: 1, y: 1}
        m_Offset: {x: 0, y: 0}
    - _IndirectDiffuseLightNormal:
        m_Texture: {fileID: 2800000, guid: 87adef385789a3f47b6124956e04dcb8, type: 3}
        m_Scale: {x: 5, y: 5}
        m_Offset: {x: 0, y: 0}
    - _MainTex:
        m_Texture: {fileID: 0}
        m_Scale: {x: 1, y: 1}
        m_Offset: {x: 0, y: 0}
    - _MetallicGlossMap:
        m_Texture: {fileID: 0}
        m_Scale: {x: 1, y: 1}
        m_Offset: {x: 0, y: 0}
    - _NormalMap:
        m_Texture: {fileID: 2800000, guid: b34f828727f775346828f5c00186ec71, type: 3}
        m_Scale: {x: 1, y: 1}
        m_Offset: {x: 0, y: 0}
    - _OcclusionMap:
        m_Texture: {fileID: 0}
        m_Scale: {x: 1, y: 1}
        m_Offset: {x: 0, y: 0}
    - _ParallaxMap:
        m_Texture: {fileID: 0}
        m_Scale: {x: 1, y: 1}
        m_Offset: {x: 0, y: 0}
    - _RampCelluloidNoiseTexture:
        m_Texture: {fileID: 0}
        m_Scale: {x: 1, y: 1}
        m_Offset: {x: 0, y: 0}
    - _ShadowRemapMap:
        m_Texture: {fileID: 2800000, guid: 5c17639b73e66a64eb1bf87957b3160a, type: 3}
        m_Scale: {x: 1, y: 1}
        m_Offset: {x: 0, y: 0}
    - _SpecGlossMap:
        m_Texture: {fileID: 0}
        m_Scale: {x: 1, y: 1}
        m_Offset: {x: 0, y: 0}
    - _SpecularMap:
        m_Texture: {fileID: 0}
        m_Scale: {x: 1, y: 1}
        m_Offset: {x: 0, y: 0}
    - _texcoord:
        m_Texture: {fileID: 0}
        m_Scale: {x: 1, y: 1}
        m_Offset: {x: 0, y: 0}
    - unity_Lightmaps:
        m_Texture: {fileID: 0}
        m_Scale: {x: 1, y: 1}
        m_Offset: {x: 0, y: 0}
    - unity_LightmapsInd:
        m_Texture: {fileID: 0}
        m_Scale: {x: 1, y: 1}
        m_Offset: {x: 0, y: 0}
    - unity_ShadowMasks:
        m_Texture: {fileID: 0}
        m_Scale: {x: 1, y: 1}
        m_Offset: {x: 0, y: 0}
    m_Floats:
    - _AOMix: 0
    - _AOSmoothness: 1
    - _AOThresold: 0
    - _Alpha: 1
    - _AlphaClip: 0
    - _AlphaCutoff: 0.5
    - _BlackClipSmoothness: 1
    - _BlackClipValue: 0
    - _Blend: 0
    - _BumpScale: 1
    - _CamPosDither: -6
    - _ClearCoatMask: 0
    - _ClearCoatSmoothness: 0
    - _Cull: 2
    - _Cutoff: 0.5
    - _DetailAlbedoMapScale: 1
    - _DetailNormalMapScale: 1
    - _DiffuseLightStrength: 0
    - _DirLightIntensity: 1
    - _DirLightNormalScale: 0.6
    - _DstBlend: 0
    - _EmissionStrength: 1
    - _EnvironmentReflections: 1
    - _FogHeightEnd: 4
    - _FogHeightStart: 0
    - _FogNoiseEdgeSmoothness: 0
    - _FogNoiseEdgeValue: 0
    - _GlossMapScale: 0
    - _Glossiness: 0
    - _GlossyReflections: 0
    - _HeightFogWorldPosYClipAdd: 0
    - _IndirectDiffuseLightNormalStrength: 0.5
    - _LightAttSoft: 1
    - _LightAttValue: -0.6
    - _Metallic: 0
    - _MultiplyEmissionTexture: 0
    - _NoiseAlpha: 0
    - _NoiseDensityUseAdd: 0
    - _NoiseFogClip: 0.76
    - _NoiseFogSoft: 0.4
    - _NoiseScale: 1
    - _NoiseStrengthUsePower: 0
    - _NormalStrength: 2.01
    - _OcclusionStrength: 1
    - _OnlyUseXZAxis: 1
    - _Parallax: 0.005
    - _PlayerMaskOpen: 0
    - _PlayerPositionMaskAlpha: 1
    - _Power: 1
    - _QueueOffset: 0
    - _RampAddincludePower: 0.02
    - _RampAddwithoutPower: 0.18
    - _RampCelluloidNoiseSoftness: 1
    - _RampCelluloidNoiseValue: 0
    - _RampPower: 0.25
    - _ReceiveShadows: 1
    - _RimOffset: 0
    - _ShadowRemapType: 1
    - _ShadowUseDither: 0
    - _Smoothness: 0.5
    - _SmoothnessTextureChannel: 0
    - _SpecularHighlights: 1
    - _SpecularIntensity: 0
    - _SpecularPow: 4
    - _SpecularSRPLightSampler: 5
    - _SrcBlend: 1
    - _Surface: 0
    - _Use3SSimulation: 1
    - _Use3SSimulation1: 1
    - _UseBakedGl: 0
    - _UseCameraDepthClip: 0
    - _UseFogNoise: 0
    - _UseHeightFog: 0
    - _UseSSAO: 0
    - _WorkflowMode: 1
    - _WorldNoiseYMaskClip: -0.59
    - _WorldNoiseYMaskStrength: -0.59
    - _ZWrite: 1
    m_Colors:
    - _3SColor: {r: 0.16744804, g: 0, b: 1, a: 0}
    - _AOColour: {r: 0, g: 0, b: 0, a: 0}
    - _AlbedoEmissionColor: {r: 1.3756118, g: 1.2709002, b: 1.137631, a: 0}
    - _BaseColor: {r: 1, g: 1, b: 1, a: 1}
    - _BassColor: {r: 1, g: 1, b: 1, a: 1}
    - _Color: {r: 1, g: 1, b: 1, a: 1}
    - _Color0: {r: 1, g: 1, b: 1, a: 0}
    - _EmissionColor: {r: 0, g: 0, b: 0, a: 1}
    - _HeightFogColor: {r: 0, g: 0, b: 0, a: 0}
    - _NoiseSpeedWorldPos: {r: 0, g: 0, b: 0, a: 0}
    - _PlayerMaskPosition: {r: 0, g: 0, b: 0, a: 0}
    - _RimColor: {r: 0, g: 0, b: 0, a: 0}
    - _RimSmoothStepMinMax: {r: 0, g: 1, b: 0, a: 0}
    - _SpecColor: {r: 0.19999996, g: 0.19999996, b: 0.19999996, a: 1}
    - _SpecularColor: {r: 1, g: 1, b: 1, a: 0}
    - _SpecularDirLightSRPLightIntensity: {r: 1, g: 1, b: 0, a: 0}
    - _SpecularSRPLightSmoothstep: {r: 0, g: 5, b: 0, a: 0}
    - _SpecularSmoothStepMinMax: {r: 0, g: 0.01, b: 0, a: 0}
  m_BuildTextureStacks: []
--- !u!114 &5592202773172516848
MonoBehaviour:
  m_ObjectHideFlags: 11
  m_CorrespondingSourceObject: {fileID: 0}
  m_PrefabInstance: {fileID: 0}
  m_PrefabAsset: {fileID: 0}
  m_GameObject: {fileID: 0}
  m_Enabled: 1
  m_EditorHideFlags: 0
  m_Script: {fileID: 11500000, guid: d0353a89b1f911e48b9e16bdc9f2e058, type: 3}
  m_Name: 
  m_EditorClassIdentifier: 
  version: 4
