%YAML 1.1
%TAG !u! tag:unity3d.com,2011:
--- !u!21 &2100000
Material:
  serializedVersion: 6
  m_ObjectHideFlags: 0
  m_CorrespondingSourceObject: {fileID: 0}
  m_PrefabInstance: {fileID: 0}
  m_PrefabAsset: {fileID: 0}
  m_Name: eff_BilboardEmergencyEye_01_ma
  m_Shader: {fileID: -6465566751694194690, guid: 5a148834732978c4d8f61dbc293fbdb7, type: 3}
  m_ShaderKeywords: 
  m_LightmapFlags: 4
  m_EnableInstancingVariants: 0
  m_DoubleSidedGI: 0
  m_CustomRenderQueue: -1
  stringTagMap: {}
  disabledShaderPasses: []
  m_SavedProperties:
    serializedVersion: 3
    m_TexEnvs:
    - _BreakEyeTexture:
        m_Texture: {fileID: 2800000, guid: eea12abe4c122c848b32cf942955b6e6, type: 3}
        m_Scale: {x: 1, y: 1}
        m_Offset: {x: 0, y: 0}
    - _MainTex:
        m_Texture: {fileID: 2800000, guid: 69e2da63ea15aff4bb4e4036facdb6d4, type: 3}
        m_Scale: {x: 1, y: 1}
        m_Offset: {x: 0, y: 0}
    - _SampleTexture2D_d77c7c652dd641c085bb2452e1cdfba3_Texture_1:
        m_Texture: {fileID: 2800000, guid: 1f2ec28c830b3434db6cfd2d0c3291a1, type: 3}
        m_Scale: {x: 1, y: 1}
        m_Offset: {x: 0, y: 0}
    - unity_Lightmaps:
        m_Texture: {fileID: 0}
        m_Scale: {x: 1, y: 1}
        m_Offset: {x: 0, y: 0}
    - unity_LightmapsInd:
        m_Texture: {fileID: 0}
        m_Scale: {x: 1, y: 1}
        m_Offset: {x: 0, y: 0}
    - unity_ShadowMasks:
        m_Texture: {fileID: 0}
        m_Scale: {x: 1, y: 1}
        m_Offset: {x: 0, y: 0}
    m_Floats:
    - Boolean_ed05f1fb02b74cea844f8d21614657c6: 1
    - Vector1_69536c75f3ab478fa5209a351242661f: 0.01
    - Vector1_c56d6fd1c3f6450da15c2597ae254e59: 0
    - _Alpha: 1
    - _BreakEyeAni: 0.001
    - _BreakZoom: 1
    - _FlipBookTile: 0
    - _FlowSpeed: 0
    - _NoiseSwitch: 0
    m_Colors:
    - Color_bda76ad70ce44a27b2dbf36a1f0f3e88: {r: 6.13441, g: 6.13441, b: 6.13441, a: 0}
    - Vector3_70a5d4ab2f084c1685f39b824a0a4a53: {r: 0, g: 0, b: 0, a: 0}
    - Vector3_8253e9b69e48458cb4dd91ea235c382d: {r: 0, g: 0, b: 0, a: 0}
    - Vector4_d1621a5e06404205afdd33660d1b3541: {r: 1, g: 1, b: 0, a: -0.2}
    - _Color: {r: 1, g: 1, b: 1, a: 0}
    - _UIScale: {r: 0.7, g: 0.7, b: 0.7, a: 0}
  m_BuildTextureStacks: []
