%YAML 1.1
%TAG !u! tag:unity3d.com,2011:
--- !u!21 &2100000
Material:
  serializedVersion: 6
  m_ObjectHideFlags: 0
  m_CorrespondingSourceObject: {fileID: 0}
  m_PrefabInstance: {fileID: 0}
  m_PrefabAsset: {fileID: 0}
  m_Name: Airflow
  m_Shader: {fileID: -6465566751694194690, guid: 3029b258a9d9b72498bead07e7b9fe36, type: 3}
  m_ShaderKeywords: ENUM_4DC8B376C10541E888A7A48F7B2FB86D_NONE ENUM_B4C3D63704184036B4D285E41D1EDD68_DEFAULT
  m_LightmapFlags: 4
  m_EnableInstancingVariants: 0
  m_DoubleSidedGI: 0
  m_CustomRenderQueue: -1
  stringTagMap: {}
  disabledShaderPasses: []
  m_SavedProperties:
    serializedVersion: 3
    m_TexEnvs:
    - _MainTex:
        m_Texture: {fileID: 2800000, guid: 3a951f6876fa570419e922d44ea0f100, type: 3}
        m_Scale: {x: 1, y: 1}
        m_Offset: {x: 0, y: 0}
    - _MaskTex:
        m_Texture: {fileID: 2800000, guid: 8c4a7fca2884fab419769ccc0355c0c1, type: 3}
        m_Scale: {x: 1, y: 1}
        m_Offset: {x: 0, y: 0}
    - unity_Lightmaps:
        m_Texture: {fileID: 0}
        m_Scale: {x: 1, y: 1}
        m_Offset: {x: 0, y: 0}
    - unity_LightmapsInd:
        m_Texture: {fileID: 0}
        m_Scale: {x: 1, y: 1}
        m_Offset: {x: 0, y: 0}
    - unity_ShadowMasks:
        m_Texture: {fileID: 0}
        m_Scale: {x: 1, y: 1}
        m_Offset: {x: 0, y: 0}
    m_Floats:
    - ENUM_4DC8B376C10541E888A7A48F7B2FB86D: 0
    - ENUM_B4C3D63704184036B4D285E41D1EDD68: 0
    - Vector1_dbb2d17ae4e94f098ae8ebb11c1dde8f: 1
    m_Colors:
    - Vector4_69a3dbae59dd4e69b9cc81fa830b640b: {r: 1, g: 1, b: 0, a: 0}
    - Vector4_9d8325a95e0141c4ae533b0917621f92: {r: 1, g: 1, b: 0, a: 0}
    - _Color: {r: 1, g: 1, b: 1, a: 1}
  m_BuildTextureStacks: []
