%YAML 1.1
%TAG !u! tag:unity3d.com,2011:
--- !u!114 &-8423788527920431896
MonoBehaviour:
  m_ObjectHideFlags: 11
  m_CorrespondingSourceObject: {fileID: 0}
  m_PrefabInstance: {fileID: 0}
  m_PrefabAsset: {fileID: 0}
  m_GameObject: {fileID: 0}
  m_Enabled: 1
  m_EditorHideFlags: 0
  m_Script: {fileID: 11500000, guid: d0353a89b1f911e48b9e16bdc9f2e058, type: 3}
  m_Name: 
  m_EditorClassIdentifier: 
  version: 4
--- !u!21 &2100000
Material:
  serializedVersion: 6
  m_ObjectHideFlags: 0
  m_CorrespondingSourceObject: {fileID: 0}
  m_PrefabInstance: {fileID: 0}
  m_PrefabAsset: {fileID: 0}
  m_Name: vfx_Trail_01_ma_Two
  m_Shader: {fileID: 4800000, guid: a705158fd54393f4eaa790e949a17d35, type: 3}
  m_ShaderKeywords: _ALPHACHENNEL_R _COLORCHANNEL_R
  m_LightmapFlags: 4
  m_EnableInstancingVariants: 0
  m_DoubleSidedGI: 0
  m_CustomRenderQueue: -1
  stringTagMap: {}
  disabledShaderPasses: []
  m_SavedProperties:
    serializedVersion: 3
    m_TexEnvs:
    - _BaseMap:
        m_Texture: {fileID: 0}
        m_Scale: {x: 1, y: 1}
        m_Offset: {x: 0, y: 0}
    - _BumpMap:
        m_Texture: {fileID: 0}
        m_Scale: {x: 1, y: 1}
        m_Offset: {x: 0, y: 0}
    - _DetailAlbedoMap:
        m_Texture: {fileID: 0}
        m_Scale: {x: 1, y: 1}
        m_Offset: {x: 0, y: 0}
    - _DetailMask:
        m_Texture: {fileID: 0}
        m_Scale: {x: 1, y: 1}
        m_Offset: {x: 0, y: 0}
    - _DetailNormalMap:
        m_Texture: {fileID: 0}
        m_Scale: {x: 1, y: 1}
        m_Offset: {x: 0, y: 0}
    - _DistortTexture:
        m_Texture: {fileID: 2800000, guid: 6a41d0f6780330041b8f0ee7f45b34a5, type: 3}
        m_Scale: {x: 1, y: 1}
        m_Offset: {x: 0, y: 0}
    - _EmissionMap:
        m_Texture: {fileID: 0}
        m_Scale: {x: 1, y: 1}
        m_Offset: {x: 0, y: 0}
    - _MainTex:
        m_Texture: {fileID: 2800000, guid: ed254c1733113a64dbfc54ee476a6e74, type: 3}
        m_Scale: {x: 0.5, y: 1}
        m_Offset: {x: 0, y: 0}
    - _MaskTex:
        m_Texture: {fileID: 2800000, guid: fb31defe5da769e4b802c4d782103944, type: 3}
        m_Scale: {x: 1, y: 1}
        m_Offset: {x: 0, y: 0}
    - _MetallicGlossMap:
        m_Texture: {fileID: 0}
        m_Scale: {x: 1, y: 1}
        m_Offset: {x: 0, y: 0}
    - _OcclusionMap:
        m_Texture: {fileID: 0}
        m_Scale: {x: 1, y: 1}
        m_Offset: {x: 0, y: 0}
    - _ParallaxMap:
        m_Texture: {fileID: 0}
        m_Scale: {x: 1, y: 1}
        m_Offset: {x: 0, y: 0}
    - _SpecGlossMap:
        m_Texture: {fileID: 0}
        m_Scale: {x: 1, y: 1}
        m_Offset: {x: 0, y: 0}
    - _texcoord:
        m_Texture: {fileID: 0}
        m_Scale: {x: 1, y: 1}
        m_Offset: {x: 0, y: 0}
    - unity_Lightmaps:
        m_Texture: {fileID: 0}
        m_Scale: {x: 1, y: 1}
        m_Offset: {x: 0, y: 0}
    - unity_LightmapsInd:
        m_Texture: {fileID: 0}
        m_Scale: {x: 1, y: 1}
        m_Offset: {x: 0, y: 0}
    - unity_ShadowMasks:
        m_Texture: {fileID: 0}
        m_Scale: {x: 1, y: 1}
        m_Offset: {x: 0, y: 0}
    m_Floats:
    - Boolean_3b68b67635ad44b7a675e88d0ac18809: 1
    - Boolean_5E50C01B: 1
    - Boolean_85051211624549778e223d7607c56b0a: 1
    - Boolean_f078f0d99e0e4d0496f312b07361cf43: 0
    - MaskTex_Add: 0
    - Vector1_14f0195a2f2648e68f33b0042d237a69: 1
    - _ALPHACHENNEL: 0
    - _AlphaClip: 0
    - _AlphaCutoff: 0.5
    - _AlphaStrength: 1
    - _Blend: 0
    - _BumpScale: 1
    - _COLORCHANNEL: 1
    - _ClearCoatMask: 0
    - _ClearCoatSmoothness: 0
    - _Cull: 2
    - _CullMode: 0
    - _CustomData: 0
    - _Cutoff: 0.5
    - _DetailAlbedoMapScale: 1
    - _DetailNormalMapScale: 1
    - _DistortPolarLengthScale: 1
    - _DistortPolarRadialScale: 1
    - _DistortStrength: 0.11
    - _DistortZoom: 1
    - _Dst: 10
    - _DstBlend: 0
    - _Emission: 1
    - _EnvironmentReflections: 1
    - _GlossMapScale: 0
    - _Glossiness: 0
    - _GlossyReflections: 0
    - _Hue: 0
    - _MainTex_Offset_With_Speed: 1
    - _MaskPow: 1
    - _MaskScale: 0.92
    - _Metallic: 0
    - _OcclusionStrength: 1
    - _Parallax: 0.005
    - _QueueOffset: 0
    - _ReceiveShadows: 1
    - _Saturation: 1
    - _Smoothness: 0.5
    - _SmoothnessTextureChannel: 0
    - _SpecularHighlights: 1
    - _Src: 5
    - _SrcBlend: 1
    - _Surface: 0
    - _ToggleSwitch0: 0
    - _UVSpeed: 0
    - _VO_Scale: 1
    - _WorkflowMode: 1
    - _ZWrite: 1
    - _ZtestMode: 4
    - _alphaclip: 0
    m_Colors:
    - _BaseColor: {r: 1, g: 1, b: 1, a: 1}
    - _Color: {r: 63.999992, g: 63.999992, b: 63.999992, a: 1}
    - _DistortTilingDistortSpeed: {r: 1, g: 1, b: 0.12, a: 0.15}
    - _EmissionColor: {r: 0, g: 0, b: 0, a: 1}
    - _MainColor: {r: 2.3488386, g: 1.2802879, b: 0.540676, a: 1}
    - _MaskTexST: {r: 1, g: 1, b: 0, a: 0}
    - _Panner: {r: 0.45, g: 0, b: 1, a: 0}
    - _RGBA_Alpha: {r: 1, g: 0, b: 0, a: 0}
    - _SpecColor: {r: 0.19999996, g: 0.19999996, b: 0.19999996, a: 1}
    - _TilingOffsetFlowSpeed: {r: 1, g: 1, b: 0, a: 0}
    - _VONoiseTiling: {r: 0.1, g: 0.1, b: 0.1, a: 0}
    - _VOPanner: {r: -1, g: 0.1, b: 1.2, a: 0}
    - _VOScale: {r: 0.5, g: 0.5, b: 0.5, a: 0}
  m_BuildTextureStacks: []
