%YAML 1.1
%TAG !u! tag:unity3d.com,2011:
--- !u!21 &2100000
Material:
  serializedVersion: 6
  m_ObjectHideFlags: 0
  m_CorrespondingSourceObject: {fileID: 0}
  m_PrefabInstance: {fileID: 0}
  m_PrefabAsset: {fileID: 0}
  m_Name: vfx_AirflowMask_01_ma 2
  m_Shader: {fileID: -6465566751694194690, guid: 818fc7c4967521d4ea884dbf675e7f98, type: 3}
  m_ShaderKeywords: 
  m_LightmapFlags: 4
  m_EnableInstancingVariants: 0
  m_DoubleSidedGI: 0
  m_CustomRenderQueue: 2999
  stringTagMap: {}
  disabledShaderPasses: []
  m_SavedProperties:
    serializedVersion: 3
    m_TexEnvs:
    - Texture2D_995f65047170429c84ff23cde72a14a3:
        m_Texture: {fileID: 2800000, guid: 0544f6bafe2b8d1478741fc28279c1d5, type: 3}
        m_Scale: {x: 1, y: 1}
        m_Offset: {x: 0, y: 0}
    - Texture2D_9f31ac35b8b64c7b9c3d35105fc187bb:
        m_Texture: {fileID: 2800000, guid: 757d6f8e338b8b84fb1bb0797a59f13d, type: 3}
        m_Scale: {x: 1, y: 1}
        m_Offset: {x: 0, y: 0}
    - Texture2D_d3e41e0c71fc4b25a6843f448c3c2a54:
        m_Texture: {fileID: 2800000, guid: 1b5887c4243a7644d8fb9614339b8601, type: 3}
        m_Scale: {x: 1, y: 1}
        m_Offset: {x: 0, y: 0}
    - _Texture2DAsset_c6873bec4b2545099483004684526cb2_Out_0:
        m_Texture: {fileID: 2800000, guid: 1b5887c4243a7644d8fb9614339b8601, type: 3}
        m_Scale: {x: 1, y: 1}
        m_Offset: {x: 0, y: 0}
    - _Texture2DAsset_d68c7e7133df4a63a0c7e1e8c5b28b9c_Out_0:
        m_Texture: {fileID: 2800000, guid: 0544f6bafe2b8d1478741fc28279c1d5, type: 3}
        m_Scale: {x: 1, y: 1}
        m_Offset: {x: 0, y: 0}
    - unity_Lightmaps:
        m_Texture: {fileID: 0}
        m_Scale: {x: 1, y: 1}
        m_Offset: {x: 0, y: 0}
    - unity_LightmapsInd:
        m_Texture: {fileID: 0}
        m_Scale: {x: 1, y: 1}
        m_Offset: {x: 0, y: 0}
    - unity_ShadowMasks:
        m_Texture: {fileID: 0}
        m_Scale: {x: 1, y: 1}
        m_Offset: {x: 0, y: 0}
    m_Floats:
    - Boolean_27cce0a80ef844fe9ebc98321d182625: 1
    - Boolean_c4fb5c213c2e4080b438d68c755882c9: 1
    - Boolean_c58070488b2a4d6a8152fc7672acfdf6: 0
    - Boolean_f1df9fd78b1d41ca8ba82dba7a29d136: 0
    - Vector1_3112efc01ff04ef38776d33d46c23e4e: -0.005
    - Vector1_4fa50491b94142369be642889ecc1256: 0
    - Vector1_5bf19dd17f2547c198478878bc83f082: 0
    - Vector1_6f0e0cd6179948278438c3bcfe2cdf16: 0.59
    - Vector1_cf82a48dd4f34c3a8309bb472f117afd: 20
    - Vector1_cf9fa9cc887e4f92bb36c7994e0d362f: 0.8
    - _AfterTransparent: 0
    m_Colors:
    - Color_4f91d5765f6243d3a68675c8855b685e: {r: 5.278032, g: 3.2353494, b: 0.567637, a: 0}
    - Color_80f6368ea79d40f790c9dd42fd0b5d0a: {r: 0, g: 2.3843138, b: 32, a: 0}
    - Vector2_f21b0d1808f7473f9dcd0ac57ae8b716: {r: 1, g: 0.24, b: 0, a: 0}
  m_BuildTextureStacks: []
