%YAML 1.1
%TAG !u! tag:unity3d.com,2011:
--- !u!21 &2100000
Material:
  serializedVersion: 6
  m_ObjectHideFlags: 0
  m_CorrespondingSourceObject: {fileID: 0}
  m_PrefabInstance: {fileID: 0}
  m_PrefabAsset: {fileID: 0}
  m_Name: vfx_OilLightCore_01_ma
  m_Shader: {fileID: -6465566751694194690, guid: d8adc8ba0d3b51249b5858935c9e49c8, type: 3}
  m_ShaderKeywords: 
  m_LightmapFlags: 4
  m_EnableInstancingVariants: 0
  m_DoubleSidedGI: 0
  m_CustomRenderQueue: 3010
  stringTagMap: {}
  disabledShaderPasses: []
  m_SavedProperties:
    serializedVersion: 3
    m_TexEnvs:
    - unity_Lightmaps:
        m_Texture: {fileID: 0}
        m_Scale: {x: 1, y: 1}
        m_Offset: {x: 0, y: 0}
    - unity_LightmapsInd:
        m_Texture: {fileID: 0}
        m_Scale: {x: 1, y: 1}
        m_Offset: {x: 0, y: 0}
    - unity_ShadowMasks:
        m_Texture: {fileID: 0}
        m_Scale: {x: 1, y: 1}
        m_Offset: {x: 0, y: 0}
    m_Floats:
    - Vector1_113326aad6b14cf6b9ca003e24f82487: 1
    - Vector1_a90974c2fa61437ca1c02bc5aa45c412: 0.38
    - Vector1_bf64105089d24726b7c388fd5f957a0d: 1.19
    m_Colors:
    - Color_fac7182efd5d4b448b1e7ef434e797b2: {r: 13.589273, g: 1.4713485, b: 0, a: 1}
    - Vector3_1755101200844760963ed0c8fb6a7ebb: {r: 70, g: 1.96, b: 7.08, a: 0}
    - Vector4_1ee62175675a4916b1ad6ac5e0d5be5a: {r: 1, g: 1, b: 0, a: -0.3}
    - Vector4_a3827104c7e946ffae8e88689edeb709: {r: 1, g: 1, b: 0, a: -1.16}
    - Vector4_f2c62b6fe7b949efa0573f04fafb5b7d: {r: 1, g: 1, b: 0.35, a: -1.13}
  m_BuildTextureStacks: []
