%YAML 1.1
%TAG !u! tag:unity3d.com,2011:
--- !u!21 &2100000
Material:
  serializedVersion: 6
  m_ObjectHideFlags: 0
  m_CorrespondingSourceObject: {fileID: 0}
  m_PrefabInstance: {fileID: 0}
  m_PrefabAsset: {fileID: 0}
  m_Name: vfx_Dissolve_01_ma
  m_Shader: {fileID: -6465566751694194690, guid: 80be80ea80e384e46b7c95c8b12fe3a6, type: 3}
  m_ShaderKeywords: ENUM_0B15F77375644980812E8DAC158D91AC_NONE
  m_LightmapFlags: 4
  m_EnableInstancingVariants: 0
  m_DoubleSidedGI: 0
  m_CustomRenderQueue: -1
  stringTagMap: {}
  disabledShaderPasses: []
  m_SavedProperties:
    serializedVersion: 3
    m_TexEnvs:
    - _MainTex:
        m_Texture: {fileID: 2800000, guid: 785ea80de207635448af8c3ad2b79edd, type: 3}
        m_Scale: {x: 1, y: 1}
        m_Offset: {x: 0, y: 0}
    - _MaskTex:
        m_Texture: {fileID: 2800000, guid: 36ada77200269134f905e49618155867, type: 3}
        m_Scale: {x: 1, y: 1}
        m_Offset: {x: 0, y: 0}
    - unity_Lightmaps:
        m_Texture: {fileID: 0}
        m_Scale: {x: 1, y: 1}
        m_Offset: {x: 0, y: 0}
    - unity_LightmapsInd:
        m_Texture: {fileID: 0}
        m_Scale: {x: 1, y: 1}
        m_Offset: {x: 0, y: 0}
    - unity_ShadowMasks:
        m_Texture: {fileID: 0}
        m_Scale: {x: 1, y: 1}
        m_Offset: {x: 0, y: 0}
    m_Floats:
    - Boolean_e70519c9e49542f3a53eab4f7aa8c77f: 0
    - ENUM_0B15F77375644980812E8DAC158D91AC: 0
    - Vector1_2f5ee2d90d464e2db2da02f9fb9b459b: 1
    - Vector1_5B52D0BE: 0.08
    - Vector1_956D2330: 11
    - ___: 0
    m_Colors:
    - Color_71F6C0EA: {r: 0, g: 0.627451, b: 2, a: 0}
    - Color_9C39EFDB: {r: 1.319508, g: 1.319508, b: 1.319508, a: 0}
    - Vector4_9F3CD2F7: {r: 1, g: 1, b: 0, a: 0}
  m_BuildTextureStacks: []
