%YAML 1.1
%TAG !u! tag:unity3d.com,2011:
--- !u!21 &2100000
Material:
  serializedVersion: 6
  m_ObjectHideFlags: 0
  m_CorrespondingSourceObject: {fileID: 0}
  m_PrefabInstance: {fileID: 0}
  m_PrefabAsset: {fileID: 0}
  m_Name: ParticleDistortByNormal
  m_Shader: {fileID: 4800000, guid: 8301994317c8c6740a840a9b9dade744, type: 3}
  m_ShaderKeywords: _DISTORTSTRENGTHUSECUSTOMZ_ON _INCLUDINGTRANSPARENTQUEUE_ON _NOISEDISTORTMAPTILINGHAVESPEED_ON
    _USEPARTICLEALPHACONTROL_DISTORTSTRENGTH _USEPOLARCOORDINATE_ON _ZOOMUSECOUSTOMW_ON
  m_LightmapFlags: 4
  m_EnableInstancingVariants: 0
  m_DoubleSidedGI: 0
  m_CustomRenderQueue: -1
  stringTagMap: {}
  disabledShaderPasses: []
  m_SavedProperties:
    serializedVersion: 3
    m_TexEnvs:
    - _DistortMap:
        m_Texture: {fileID: 2800000, guid: b86a1fbc61e05e744bac15e6b6d80460, type: 3}
        m_Scale: {x: 1, y: 1}
        m_Offset: {x: 0, y: 0}
    - _NoiseDistortMap:
        m_Texture: {fileID: 2800000, guid: 33f4fe70796aee34eb18113883847d3c, type: 3}
        m_Scale: {x: 1, y: 1}
        m_Offset: {x: 0, y: 0}
    - _texcoord:
        m_Texture: {fileID: 0}
        m_Scale: {x: 1, y: 1}
        m_Offset: {x: 0, y: 0}
    m_Floats:
    - _AlphaCutoff: 0.5
    - _Depth: 1
    - _DistortNormalNegative: 0
    - _DistortPolarRadiusLength: 1
    - _DistortPolarRadiusScale: 1
    - _DistortPolarXFlowSpeed: -1.32
    - _DistortPolarYFlowSpeed: 0
    - _DistortStrength: 1
    - _DistortStrengthUseCustomZ: 1
    - _IncludingTransparentQueue: 1
    - _Keyword0: 0
    - _NoiseDistortMapTilingHaveSpeed: 1
    - _NoiseDistortMapTilingUseCustomDataXY: 0
    - _TwoTextureLerp: 0.91
    - _UseParticleAlphaControl: 1
    - _UsePolarCoordinate: 1
    - _Zoom: 0.55
    - _ZoomUseCoustomW: 1
    - _ZoomUseCoustomZ: 0
    m_Colors:
    - _DistortMapST: {r: 1, g: 1, b: 0, a: 0}
    - _EmissionColor: {r: 1, g: 1, b: 1, a: 1}
    - _NoiseDistortMapST: {r: 3, g: 3, b: 0, a: -1}
  m_BuildTextureStacks: []
