%YAML 1.1
%TAG !u! tag:unity3d.com,2011:
--- !u!114 &11400000
MonoBehaviour:
  m_ObjectHideFlags: 0
  m_CorrespondingSourceObject: {fileID: 0}
  m_PrefabInstance: {fileID: 0}
  m_PrefabAsset: {fileID: 0}
  m_GameObject: {fileID: 0}
  m_Enabled: 1
  m_EditorHideFlags: 0
  m_Script: {fileID: 11500000, guid: 104001799dab9c64c9feda867ff8a6c1, type: 3}
  m_Name: Rank3_02
  m_EditorClassIdentifier: 
  waves:
  - enemys:
    - enemyPrefab: {fileID: 1693487396996714921, guid: 0b2ce68851c7d9f4391998c657e56b3f, type: 3}
      count: 1
    - enemyPrefab: {fileID: 5600491463437476476, guid: f717793b44fd68c4fb9d97fcb6d6bdc5, type: 3}
      count: 1
    - enemyPrefab: {fileID: 3571589457042039501, guid: 417fedf7a8a44bc4c919b983afba9b0e, type: 3}
      count: 1
  - enemys:
    - enemyPrefab: {fileID: 6955951942779913318, guid: 22a01ce53993cde419e04235cd6b05d1, type: 3}
      count: 1
    - enemyPrefab: {fileID: 814512190395278089, guid: f762de29a32c39f4f8e58a0590537f1b, type: 3}
      count: 1
    - enemyPrefab: {fileID: 3571589457042039501, guid: 417fedf7a8a44bc4c919b983afba9b0e, type: 3}
      count: 2
    - enemyPrefab: {fileID: 1693487396996714921, guid: 0b2ce68851c7d9f4391998c657e56b3f, type: 3}
      count: 1
