%YAML 1.1
%TAG !u! tag:unity3d.com,2011:
--- !u!21 &2100000
Material:
  serializedVersion: 6
  m_ObjectHideFlags: 0
  m_CorrespondingSourceObject: {fileID: 0}
  m_PrefabInstance: {fileID: 0}
  m_PrefabAsset: {fileID: 0}
  m_Name: BossHP
  m_Shader: {fileID: 4800000, guid: eee68e9c065f9e24e9b5262beb02aec5, type: 3}
  m_ShaderKeywords: _ISMONSTERHP_ON
  m_LightmapFlags: 4
  m_EnableInstancingVariants: 0
  m_DoubleSidedGI: 0
  m_CustomRenderQueue: -1
  stringTagMap: {}
  disabledShaderPasses: []
  m_SavedProperties:
    serializedVersion: 3
    m_TexEnvs:
    - _DistortTexture:
        m_Texture: {fileID: 2800000, guid: 1e07ea37304678f4481770840645116c, type: 3}
        m_Scale: {x: 1, y: 1}
        m_Offset: {x: 0, y: 0}
    - _FluidTexture:
        m_Texture: {fileID: 2800000, guid: d7e09893eb775aa47afbba1458b4c2ff, type: 3}
        m_Scale: {x: 2, y: 1}
        m_Offset: {x: 0, y: 0}
    - _HPBarTexture:
        m_Texture: {fileID: 2800000, guid: 91dd4fd7ada8eb14c845a4259d384d6f, type: 3}
        m_Scale: {x: 1, y: 1}
        m_Offset: {x: 0, y: 0}
    - _MainTex:
        m_Texture: {fileID: 0}
        m_Scale: {x: 1, y: 1}
        m_Offset: {x: 0, y: 0}
    - _texcoord:
        m_Texture: {fileID: 0}
        m_Scale: {x: 1, y: 1}
        m_Offset: {x: 0, y: 0}
    m_Floats:
    - _ColorMask: 15
    - _DistortStrength: 0.1
    - _FlowSpeed: 0
    - _GardientFlowFreq: 10
    - _IsMonsterHP: 1
    - _NoiseDiffStrength: 1
    - _NoiseScale: 2
    - _Stencil: 0
    - _StencilComp: 8
    - _StencilOp: 0
    - _StencilReadMask: 255
    - _StencilWriteMask: 255
    - _TimeSpeed: 3
    - _UseUIAlphaClip: 0
    m_Colors:
    - _Color: {r: 1, g: 1, b: 1, a: 1}
    - _FluidTextureSTSpeed: {r: 1, g: 1, b: 0.25, a: 0}
    - _FluidTextureSTSpeed1: {r: 2, g: 2, b: -0.05, a: 0}
    - _GardientColorFluidColor: {r: 0.9339623, g: 0.16882096, b: 0.012335302, a: 1}
    - _TextureColor: {r: 0.9150943, g: 0.9150943, b: 0.9150943, a: 1}
  m_BuildTextureStacks: []
