%YAML 1.1
%TAG !u! tag:unity3d.com,2011:
--- !u!114 &11400000
MonoBehaviour:
  m_ObjectHideFlags: 0
  m_CorrespondingSourceObject: {fileID: 0}
  m_PrefabInstance: {fileID: 0}
  m_PrefabAsset: {fileID: 0}
  m_GameObject: {fileID: 0}
  m_Enabled: 1
  m_EditorHideFlags: 0
  m_Script: {fileID: 11500000, guid: f586cc6c494b55547aada7e9dfcf9af3, type: 3}
  m_Name: GameFeel
  m_EditorClassIdentifier: 
  heavyAttackStop:
    time: 0.35
    intensity: 0
    lerpToggle: 0
    lerpTime: 0
  heavyAttackSlow:
    time: 0.1
    intensity: 0.05
    lerpToggle: 1
    lerpTime: 0.05
  lastAttackSlow:
    time: 0.2
    intensity: 0.1
    lerpToggle: 1
    lerpTime: 0.15
  lastAttackShake:
    time: 0.2
    intensity: 0.15
  blockAttackStop:
    time: 0.2
    intensity: 0.1
    lerpToggle: 1
    lerpTime: 0.1
  blockAttackSlow:
    time: 0.18
    intensity: 0.05
    lerpToggle: 1
    lerpTime: 0.05
  bossLastAttackSlow:
    time: 0.5
    intensity: 0.2
    lerpToggle: 1
    lerpTime: 0.1
