%YAML 1.1
%TAG !u! tag:unity3d.com,2011:
--- !u!114 &-9213298138769209249
MonoBehaviour:
  m_ObjectHideFlags: 0
  m_CorrespondingSourceObject: {fileID: 0}
  m_PrefabInstance: {fileID: 0}
  m_PrefabAsset: {fileID: 0}
  m_GameObject: {fileID: 0}
  m_Enabled: 1
  m_EditorHideFlags: 0
  m_Script: {fileID: 11500000, guid: 9dea88b8bfbd93941b433ee338a4192d, type: 3}
  m_Name: ScreenBlur
  m_EditorClassIdentifier: 
  m_Active: 0
  settings:
    Event: 550
    blitMaterial: {fileID: 2100000, guid: 7b1b173b8a8987b4ca06f834fb485969, type: 2}
    blitMaterialPassIndex: 0
    setInverseViewMatrix: 0
    srcType: 0
    srcTextureId: _CameraColorTexture
    srcTextureObject: {fileID: 0}
    dstType: 0
    dstTextureId: _BlitPassTexture
    dstTextureObject: {fileID: 0}
--- !u!114 &-4381575744005649164
MonoBehaviour:
  m_ObjectHideFlags: 0
  m_CorrespondingSourceObject: {fileID: 0}
  m_PrefabInstance: {fileID: 0}
  m_PrefabAsset: {fileID: 0}
  m_GameObject: {fileID: 0}
  m_Enabled: 1
  m_EditorHideFlags: 0
  m_Script: {fileID: 11500000, guid: 9dea88b8bfbd93941b433ee338a4192d, type: 3}
  m_Name: Blood
  m_EditorClassIdentifier: 
  m_Active: 1
  settings:
    Event: 1000
    blitMaterial: {fileID: 2100000, guid: 62e0bc288234d5a48ba722e731645485, type: 2}
    blitMaterialPassIndex: 0
    setInverseViewMatrix: 0
    srcType: 1
    srcTextureId: _AfterPostProcessTexture
    srcTextureObject: {fileID: 0}
    dstType: 1
    dstTextureId: _AfterPostProcessTexture
    dstTextureObject: {fileID: 0}
--- !u!114 &11400000
MonoBehaviour:
  m_ObjectHideFlags: 0
  m_CorrespondingSourceObject: {fileID: 0}
  m_PrefabInstance: {fileID: 0}
  m_PrefabAsset: {fileID: 0}
  m_GameObject: {fileID: 0}
  m_Enabled: 1
  m_EditorHideFlags: 0
  m_Script: {fileID: 11500000, guid: de640fe3d0db1804a85f9fc8f5cadab6, type: 3}
  m_Name: ForwardRenderer
  m_EditorClassIdentifier: 
  m_RendererFeatures:
  - {fileID: -9213298138769209249}
  - {fileID: 776992249399972337}
  - {fileID: 5417231573152740104}
  - {fileID: 9141267208346738569}
  - {fileID: -4381575744005649164}
  m_RendererFeatureMap: 5fc8e42c28ca2380f191b78a556ec80a08b3ccff69df2d4b891f6fee174edc7ef44c134e138431c3
  postProcessData: {fileID: 11400000, guid: 41439944d30ece34e96484bdb6645b55, type: 2}
  xrSystemData: {fileID: 11400000, guid: 60e1133243b97e347b653163a8c01b64, type: 2}
  shaders:
    blitPS: {fileID: 4800000, guid: c17132b1f77d20942aa75f8429c0f8bc, type: 3}
    copyDepthPS: {fileID: 4800000, guid: d6dae50ee9e1bfa4db75f19f99355220, type: 3}
    screenSpaceShadowPS: {fileID: 4800000, guid: 0f854b35a0cf61a429bd5dcfea30eddd, type: 3}
    samplingPS: {fileID: 4800000, guid: 04c410c9937594faa893a11dceb85f7e, type: 3}
    tileDepthInfoPS: {fileID: 0}
    tileDeferredPS: {fileID: 0}
    stencilDeferredPS: {fileID: 4800000, guid: e9155b26e1bc55942a41e518703fe304, type: 3}
    fallbackErrorPS: {fileID: 4800000, guid: e6e9a19c3678ded42a3bc431ebef7dbd, type: 3}
    materialErrorPS: {fileID: 4800000, guid: 5fd9a8feb75a4b5894c241777f519d4e, type: 3}
  m_OpaqueLayerMask:
    serializedVersion: 2
    m_Bits: 283279159
  m_TransparentLayerMask:
    serializedVersion: 2
    m_Bits: 820150071
  m_DefaultStencilState:
    overrideStencilState: 0
    stencilReference: 0
    stencilCompareFunction: 8
    passOperation: 0
    failOperation: 0
    zFailOperation: 0
  m_ShadowTransparentReceive: 1
  m_RenderingMode: 0
  m_AccurateGbufferNormals: 0
--- !u!114 &776992249399972337
MonoBehaviour:
  m_ObjectHideFlags: 0
  m_CorrespondingSourceObject: {fileID: 0}
  m_PrefabInstance: {fileID: 0}
  m_PrefabAsset: {fileID: 0}
  m_GameObject: {fileID: 0}
  m_Enabled: 1
  m_EditorHideFlags: 0
  m_Script: {fileID: 11500000, guid: 9dea88b8bfbd93941b433ee338a4192d, type: 3}
  m_Name: GaussBlur
  m_EditorClassIdentifier: 
  m_Active: 1
  settings:
    Event: 550
    blitMaterial: {fileID: 2100000, guid: 967c739dfd99003418906a0a832256d4, type: 2}
    blitMaterialPassIndex: 0
    setInverseViewMatrix: 0
    srcType: 0
    srcTextureId: _CameraColorTexture
    srcTextureObject: {fileID: 0}
    dstType: 0
    dstTextureId: _BlitPassTexture
    dstTextureObject: {fileID: 0}
--- !u!114 &5417231573152740104
MonoBehaviour:
  m_ObjectHideFlags: 0
  m_CorrespondingSourceObject: {fileID: 0}
  m_PrefabInstance: {fileID: 0}
  m_PrefabAsset: {fileID: 0}
  m_GameObject: {fileID: 0}
  m_Enabled: 1
  m_EditorHideFlags: 0
  m_Script: {fileID: 11500000, guid: f62c9c65cf3354c93be831c8bc075510, type: 3}
  m_Name: ScreenSpaceAmbientOcclusion
  m_EditorClassIdentifier: 
  m_Active: 1
  m_Shader: {fileID: 4800000, guid: 0849e84e3d62649e8882e9d6f056a017, type: 3}
  m_Settings:
    Downsample: 1
    Source: 0
    NormalSamples: 2
    Intensity: 0.4
    DirectLightingStrength: 0.27
    Radius: 0.51
    SampleCount: 5
--- !u!114 &9141267208346738569
MonoBehaviour:
  m_ObjectHideFlags: 0
  m_CorrespondingSourceObject: {fileID: 0}
  m_PrefabInstance: {fileID: 0}
  m_PrefabAsset: {fileID: 0}
  m_GameObject: {fileID: 0}
  m_Enabled: 1
  m_EditorHideFlags: 0
  m_Script: {fileID: 11500000, guid: 19856148909805a408fd73cb9beb3431, type: 3}
  m_Name: NewGrabScreenFeature
  m_EditorClassIdentifier: 
  m_Active: 1
  settings:
    TextureName: _GrabPassTransparent
    LayerMask:
      serializedVersion: 2
      m_Bits: 1048576
