%YAML 1.1
%TAG !u! tag:unity3d.com,2011:
--- !u!21 &2100000
Material:
  serializedVersion: 6
  m_ObjectHideFlags: 0
  m_CorrespondingSourceObject: {fileID: 0}
  m_PrefabInstance: {fileID: 0}
  m_PrefabAsset: {fileID: 0}
  m_Name: "vfx_\u5C4F\u969C\u4E3B\u9AD4_\u5713\u7403"
  m_Shader: {fileID: -6465566751694194690, guid: 5e5dced0b767c9744bc9595e62555e06, type: 3}
  m_ShaderKeywords: 
  m_LightmapFlags: 4
  m_EnableInstancingVariants: 0
  m_DoubleSidedGI: 0
  m_CustomRenderQueue: -1
  stringTagMap: {}
  disabledShaderPasses: []
  m_SavedProperties:
    serializedVersion: 3
    m_TexEnvs:
    - Texture2D_75b5bd3108f746b096f01b4ca532035f:
        m_Texture: {fileID: 2800000, guid: 198813f984458dc4bb5e97ee3d9145be, type: 3}
        m_Scale: {x: 1, y: 1}
        m_Offset: {x: 0, y: 0}
    - Texture2D_c78e33197f524a84a8473c4bc6a792ae:
        m_Texture: {fileID: 2800000, guid: 8a19dbfd4504990479933ba766e8eabe, type: 3}
        m_Scale: {x: 1, y: 1}
        m_Offset: {x: 0, y: 0}
    - Texture2D_d044b5e49fb44edf96243c554246ca72:
        m_Texture: {fileID: 0}
        m_Scale: {x: 1, y: 1}
        m_Offset: {x: 0, y: 0}
    - Texture2D_fecbd05f69ec4d80a744d0beeebebde9:
        m_Texture: {fileID: 2800000, guid: 981bd09ffc17ec44fb7b0928e299772b, type: 3}
        m_Scale: {x: 1, y: 1}
        m_Offset: {x: 0, y: 0}
    - unity_Lightmaps:
        m_Texture: {fileID: 0}
        m_Scale: {x: 1, y: 1}
        m_Offset: {x: 0, y: 0}
    - unity_LightmapsInd:
        m_Texture: {fileID: 0}
        m_Scale: {x: 1, y: 1}
        m_Offset: {x: 0, y: 0}
    - unity_ShadowMasks:
        m_Texture: {fileID: 0}
        m_Scale: {x: 1, y: 1}
        m_Offset: {x: 0, y: 0}
    m_Floats:
    - Vector1_011ae4df9acf45b6b1c422bf96e3016d: 0.91
    - Vector1_06be5aae7cdd4e9bbaf60a1fb3f0bf1e: -0.24
    - Vector1_2454ff3cc231461b9703f6fe63d51608: 2.12
    - Vector1_b1a6da3602414f3cb48a2f464adc5753: 1
    m_Colors:
    - Color_ac70c0d5deb2448aa1c458f89bba91e0: {r: 1.6055588, g: 0.23536988, b: 0.23536988, a: 1}
    - Color_b10e26afd8af4985a189bf57ef4e2a14: {r: 24.251461, g: 13.538453, b: 0, a: 0}
    - Vector4_51c8063d4d90414a8d511ce717c0329f: {r: 2, g: 4, b: 0, a: 0.33}
    - Vector4_5b4476571883459bae08a8e4919246e8: {r: 5, g: 3, b: 0.5, a: 0}
    - Vector4_eda1fa322b3b4145aa5511915e97eafd: {r: 1, g: 1, b: 0, a: 0}
    - Vector4_faf2eaf2f351488089c4fdecadae1d03: {r: 3, g: 3, b: 0.25, a: 0.48}
  m_BuildTextureStacks: []
