%YAML 1.1
%TAG !u! tag:unity3d.com,2011:
--- !u!181963792 &2655988077585873504
Preset:
  m_ObjectHideFlags: 0
  m_CorrespondingSourceObject: {fileID: 0}
  m_PrefabInstance: {fileID: 0}
  m_PrefabAsset: {fileID: 0}
  m_Name: "\u9AD4\u7A4D\u8056\u514901"
  m_TargetType:
    m_NativeTypeID: 114
    m_ManagedTypePPtr: {fileID: 11500000, guid: 7b69c542c9a8f4f44a3123e3fa103d13, type: 3}
    m_ManagedTypeFallback: 
  m_Properties:
  - target: {fileID: 0}
    propertyPath: m_Enabled
    value: 1
    objectReference: {fileID: 0}
  - target: {fileID: 0}
    propertyPath: m_EditorHideFlags
    value: 0
    objectReference: {fileID: 0}
  - target: {fileID: 0}
    propertyPath: m_EditorClassIdentifier
    value: 
    objectReference: {fileID: 0}
  - target: {fileID: 0}
    propertyPath: colorFromLight
    value: 1
    objectReference: {fileID: 0}
  - target: {fileID: 0}
    propertyPath: colorMode
    value: 1
    objectReference: {fileID: 0}
  - target: {fileID: 0}
    propertyPath: color.r
    value: 0.8113208
    objectReference: {fileID: 0}
  - target: {fileID: 0}
    propertyPath: color.g
    value: 0.57392997
    objectReference: {fileID: 0}
  - target: {fileID: 0}
    propertyPath: color.b
    value: 0.37045214
    objectReference: {fileID: 0}
  - target: {fileID: 0}
    propertyPath: color.a
    value: 1
    objectReference: {fileID: 0}
  - target: {fileID: 0}
    propertyPath: colorGradient.key0.r
    value: 1
    objectReference: {fileID: 0}
  - target: {fileID: 0}
    propertyPath: colorGradient.key0.g
    value: 0.5880302
    objectReference: {fileID: 0}
  - target: {fileID: 0}
    propertyPath: colorGradient.key0.b
    value: 0.2584905
    objectReference: {fileID: 0}
  - target: {fileID: 0}
    propertyPath: colorGradient.key0.a
    value: 0
    objectReference: {fileID: 0}
  - target: {fileID: 0}
    propertyPath: colorGradient.key1.r
    value: 1
    objectReference: {fileID: 0}
  - target: {fileID: 0}
    propertyPath: colorGradient.key1.g
    value: 0.5880302
    objectReference: {fileID: 0}
  - target: {fileID: 0}
    propertyPath: colorGradient.key1.b
    value: 0.2584905
    objectReference: {fileID: 0}
  - target: {fileID: 0}
    propertyPath: colorGradient.key1.a
    value: 0.77254903
    objectReference: {fileID: 0}
  - target: {fileID: 0}
    propertyPath: colorGradient.key2.r
    value: 0
    objectReference: {fileID: 0}
  - target: {fileID: 0}
    propertyPath: colorGradient.key2.g
    value: 0
    objectReference: {fileID: 0}
  - target: {fileID: 0}
    propertyPath: colorGradient.key2.b
    value: 0
    objectReference: {fileID: 0}
  - target: {fileID: 0}
    propertyPath: colorGradient.key2.a
    value: 0
    objectReference: {fileID: 0}
  - target: {fileID: 0}
    propertyPath: colorGradient.key3.r
    value: 0
    objectReference: {fileID: 0}
  - target: {fileID: 0}
    propertyPath: colorGradient.key3.g
    value: 0
    objectReference: {fileID: 0}
  - target: {fileID: 0}
    propertyPath: colorGradient.key3.b
    value: 0
    objectReference: {fileID: 0}
  - target: {fileID: 0}
    propertyPath: colorGradient.key3.a
    value: 0
    objectReference: {fileID: 0}
  - target: {fileID: 0}
    propertyPath: colorGradient.key4.r
    value: 0
    objectReference: {fileID: 0}
  - target: {fileID: 0}
    propertyPath: colorGradient.key4.g
    value: 0
    objectReference: {fileID: 0}
  - target: {fileID: 0}
    propertyPath: colorGradient.key4.b
    value: 0
    objectReference: {fileID: 0}
  - target: {fileID: 0}
    propertyPath: colorGradient.key4.a
    value: 0
    objectReference: {fileID: 0}
  - target: {fileID: 0}
    propertyPath: colorGradient.key5.r
    value: 0
    objectReference: {fileID: 0}
  - target: {fileID: 0}
    propertyPath: colorGradient.key5.g
    value: 0
    objectReference: {fileID: 0}
  - target: {fileID: 0}
    propertyPath: colorGradient.key5.b
    value: 0
    objectReference: {fileID: 0}
  - target: {fileID: 0}
    propertyPath: colorGradient.key5.a
    value: 0
    objectReference: {fileID: 0}
  - target: {fileID: 0}
    propertyPath: colorGradient.key6.r
    value: 0
    objectReference: {fileID: 0}
  - target: {fileID: 0}
    propertyPath: colorGradient.key6.g
    value: 0
    objectReference: {fileID: 0}
  - target: {fileID: 0}
    propertyPath: colorGradient.key6.b
    value: 0
    objectReference: {fileID: 0}
  - target: {fileID: 0}
    propertyPath: colorGradient.key6.a
    value: 0
    objectReference: {fileID: 0}
  - target: {fileID: 0}
    propertyPath: colorGradient.key7.r
    value: 0
    objectReference: {fileID: 0}
  - target: {fileID: 0}
    propertyPath: colorGradient.key7.g
    value: 0
    objectReference: {fileID: 0}
  - target: {fileID: 0}
    propertyPath: colorGradient.key7.b
    value: 0
    objectReference: {fileID: 0}
  - target: {fileID: 0}
    propertyPath: colorGradient.key7.a
    value: 0
    objectReference: {fileID: 0}
  - target: {fileID: 0}
    propertyPath: colorGradient.ctime0
    value: 0
    objectReference: {fileID: 0}
  - target: {fileID: 0}
    propertyPath: colorGradient.ctime1
    value: 65535
    objectReference: {fileID: 0}
  - target: {fileID: 0}
    propertyPath: colorGradient.ctime2
    value: 0
    objectReference: {fileID: 0}
  - target: {fileID: 0}
    propertyPath: colorGradient.ctime3
    value: 0
    objectReference: {fileID: 0}
  - target: {fileID: 0}
    propertyPath: colorGradient.ctime4
    value: 0
    objectReference: {fileID: 0}
  - target: {fileID: 0}
    propertyPath: colorGradient.ctime5
    value: 0
    objectReference: {fileID: 0}
  - target: {fileID: 0}
    propertyPath: colorGradient.ctime6
    value: 0
    objectReference: {fileID: 0}
  - target: {fileID: 0}
    propertyPath: colorGradient.ctime7
    value: 0
    objectReference: {fileID: 0}
  - target: {fileID: 0}
    propertyPath: colorGradient.atime0
    value: 0
    objectReference: {fileID: 0}
  - target: {fileID: 0}
    propertyPath: colorGradient.atime1
    value: 38090
    objectReference: {fileID: 0}
  - target: {fileID: 0}
    propertyPath: colorGradient.atime2
    value: 0
    objectReference: {fileID: 0}
  - target: {fileID: 0}
    propertyPath: colorGradient.atime3
    value: 0
    objectReference: {fileID: 0}
  - target: {fileID: 0}
    propertyPath: colorGradient.atime4
    value: 0
    objectReference: {fileID: 0}
  - target: {fileID: 0}
    propertyPath: colorGradient.atime5
    value: 0
    objectReference: {fileID: 0}
  - target: {fileID: 0}
    propertyPath: colorGradient.atime6
    value: 0
    objectReference: {fileID: 0}
  - target: {fileID: 0}
    propertyPath: colorGradient.atime7
    value: 0
    objectReference: {fileID: 0}
  - target: {fileID: 0}
    propertyPath: colorGradient.m_Mode
    value: 0
    objectReference: {fileID: 0}
  - target: {fileID: 0}
    propertyPath: colorGradient.m_NumColorKeys
    value: 2
    objectReference: {fileID: 0}
  - target: {fileID: 0}
    propertyPath: colorGradient.m_NumAlphaKeys
    value: 2
    objectReference: {fileID: 0}
  - target: {fileID: 0}
    propertyPath: intensityFromLight
    value: 1
    objectReference: {fileID: 0}
  - target: {fileID: 0}
    propertyPath: intensityModeAdvanced
    value: 0
    objectReference: {fileID: 0}
  - target: {fileID: 0}
    propertyPath: intensityInside
    value: 5.5
    objectReference: {fileID: 0}
  - target: {fileID: 0}
    propertyPath: intensityOutside
    value: 5.5
    objectReference: {fileID: 0}
  - target: {fileID: 0}
    propertyPath: blendingMode
    value: 1
    objectReference: {fileID: 0}
  - target: {fileID: 0}
    propertyPath: spotAngleFromLight
    value: 1
    objectReference: {fileID: 0}
  - target: {fileID: 0}
    propertyPath: spotAngle
    value: 17
    objectReference: {fileID: 0}
  - target: {fileID: 0}
    propertyPath: coneRadiusStart
    value: 0.1
    objectReference: {fileID: 0}
  - target: {fileID: 0}
    propertyPath: shaderAccuracy
    value: 0
    objectReference: {fileID: 0}
  - target: {fileID: 0}
    propertyPath: geomMeshType
    value: 0
    objectReference: {fileID: 0}
  - target: {fileID: 0}
    propertyPath: geomCustomSides
    value: 18
    objectReference: {fileID: 0}
  - target: {fileID: 0}
    propertyPath: geomCustomSegments
    value: 5
    objectReference: {fileID: 0}
  - target: {fileID: 0}
    propertyPath: skewingLocalForwardDirection.x
    value: 0
    objectReference: {fileID: 0}
  - target: {fileID: 0}
    propertyPath: skewingLocalForwardDirection.y
    value: 0
    objectReference: {fileID: 0}
  - target: {fileID: 0}
    propertyPath: skewingLocalForwardDirection.z
    value: 1
    objectReference: {fileID: 0}
  - target: {fileID: 0}
    propertyPath: clippingPlaneTransform
    value: 
    objectReference: {fileID: 0}
  - target: {fileID: 0}
    propertyPath: geomCap
    value: 0
    objectReference: {fileID: 0}
  - target: {fileID: 0}
    propertyPath: fallOffEndFromLight
    value: 1
    objectReference: {fileID: 0}
  - target: {fileID: 0}
    propertyPath: attenuationEquation
    value: 1
    objectReference: {fileID: 0}
  - target: {fileID: 0}
    propertyPath: attenuationCustomBlending
    value: 0.5
    objectReference: {fileID: 0}
  - target: {fileID: 0}
    propertyPath: fallOffStart
    value: 0
    objectReference: {fileID: 0}
  - target: {fileID: 0}
    propertyPath: fallOffEnd
    value: 2.08
    objectReference: {fileID: 0}
  - target: {fileID: 0}
    propertyPath: depthBlendDistance
    value: 2
    objectReference: {fileID: 0}
  - target: {fileID: 0}
    propertyPath: cameraClippingDistance
    value: 0.5
    objectReference: {fileID: 0}
  - target: {fileID: 0}
    propertyPath: glareFrontal
    value: 0.53
    objectReference: {fileID: 0}
  - target: {fileID: 0}
    propertyPath: glareBehind
    value: 0
    objectReference: {fileID: 0}
  - target: {fileID: 0}
    propertyPath: fresnelPow
    value: 4.5
    objectReference: {fileID: 0}
  - target: {fileID: 0}
    propertyPath: noiseMode
    value: 0
    objectReference: {fileID: 0}
  - target: {fileID: 0}
    propertyPath: noiseIntensity
    value: 0.5
    objectReference: {fileID: 0}
  - target: {fileID: 0}
    propertyPath: noiseScaleUseGlobal
    value: 1
    objectReference: {fileID: 0}
  - target: {fileID: 0}
    propertyPath: noiseScaleLocal
    value: 0.5
    objectReference: {fileID: 0}
  - target: {fileID: 0}
    propertyPath: noiseVelocityUseGlobal
    value: 1
    objectReference: {fileID: 0}
  - target: {fileID: 0}
    propertyPath: noiseVelocityLocal.x
    value: 0.07
    objectReference: {fileID: 0}
  - target: {fileID: 0}
    propertyPath: noiseVelocityLocal.y
    value: 0.18
    objectReference: {fileID: 0}
  - target: {fileID: 0}
    propertyPath: noiseVelocityLocal.z
    value: 0.05
    objectReference: {fileID: 0}
  - target: {fileID: 0}
    propertyPath: dimensions
    value: 0
    objectReference: {fileID: 0}
  - target: {fileID: 0}
    propertyPath: tiltFactor.x
    value: 0
    objectReference: {fileID: 0}
  - target: {fileID: 0}
    propertyPath: tiltFactor.y
    value: 0
    objectReference: {fileID: 0}
  - target: {fileID: 0}
    propertyPath: pluginVersion
    value: 1890
    objectReference: {fileID: 0}
  - target: {fileID: 0}
    propertyPath: _TrackChangesDuringPlaytime
    value: 1
    objectReference: {fileID: 0}
  - target: {fileID: 0}
    propertyPath: _SortingLayerID
    value: 0
    objectReference: {fileID: 0}
  - target: {fileID: 0}
    propertyPath: _SortingOrder
    value: 0
    objectReference: {fileID: 0}
  - target: {fileID: 0}
    propertyPath: _FadeOutBegin
    value: 150
    objectReference: {fileID: 0}
  - target: {fileID: 0}
    propertyPath: _FadeOutEnd
    value: 200
    objectReference: {fileID: 0}
  m_ExcludedProperties: []
