%YAML 1.1
%TAG !u! tag:unity3d.com,2011:
--- !u!21 &2100000
Material:
  serializedVersion: 6
  m_ObjectHideFlags: 0
  m_CorrespondingSourceObject: {fileID: 0}
  m_PrefabInstance: {fileID: 0}
  m_PrefabAsset: {fileID: 0}
  m_Name: "To7_ToonWater_3\u5BA4\u5167\u6C60\u5858_\u6DFA"
  m_Shader: {fileID: 4800000, guid: 03bfd35d974195f4dacb7979d6c7f012, type: 3}
  m_ShaderKeywords: 
  m_LightmapFlags: 4
  m_EnableInstancingVariants: 0
  m_DoubleSidedGI: 0
  m_CustomRenderQueue: -1
  stringTagMap: {}
  disabledShaderPasses: []
  m_SavedProperties:
    serializedVersion: 3
    m_TexEnvs:
    - _Bump:
        m_Texture: {fileID: 0}
        m_Scale: {x: 1, y: 1}
        m_Offset: {x: 0, y: 0}
    - _CausticsMap:
        m_Texture: {fileID: 2800000, guid: d663d27896c87a44d9100f4ac464eaa8, type: 3}
        m_Scale: {x: 1, y: 1}
        m_Offset: {x: 0, y: 0}
    - _CubeMap:
        m_Texture: {fileID: 8900000, guid: 56b138433feae5847b109a59e4295fa2, type: 3}
        m_Scale: {x: 1, y: 1}
        m_Offset: {x: 0, y: 0}
    - _NormalMap:
        m_Texture: {fileID: 2800000, guid: e67cbb57d1280cb4f96af95dce0828a7, type: 3}
        m_Scale: {x: 1, y: 1}
        m_Offset: {x: 0, y: 0}
    - _ReflectionTex:
        m_Texture: {fileID: 8900000, guid: 56b138433feae5847b109a59e4295fa2, type: 3}
        m_Scale: {x: 1, y: 1}
        m_Offset: {x: 0, y: 0}
    - _SparklingTexture:
        m_Texture: {fileID: 0}
        m_Scale: {x: 1, y: 1}
        m_Offset: {x: 0, y: 0}
    - _TextureSample0:
        m_Texture: {fileID: 0}
        m_Scale: {x: 1, y: 1}
        m_Offset: {x: 0, y: 0}
    - _TextureSample1:
        m_Texture: {fileID: 0}
        m_Scale: {x: 1, y: 1}
        m_Offset: {x: 0, y: 0}
    - _texcoord:
        m_Texture: {fileID: 0}
        m_Scale: {x: 1, y: 1}
        m_Offset: {x: 0, y: 0}
    m_Floats:
    - _AllShoreSubstract: -2.52
    - _Alpha: 0.05
    - _AlphaCutoff: 0.5
    - _CausticsAlpha: 0.219
    - _CausticsDepth: 3.88
    - _CausticsPow: -0.22
    - _CausticsSacle: 4.73
    - _DeepRange: 3.55
    - _Depth: 0.66
    - _DepthAllCtrl: 2.68
    - _DistortNoiseSize: 3
    - _DistortNoiseStrengthX: 0
    - _DistortNoiseStrengthY: 0
    - _Float0: -2.97
    - _FoamBlend: 0.45
    - _FoamDissolve: 1.45
    - _FoamFreq: 15.77
    - _FoamRange: 0.3
    - _FoamSpeed: -2.5
    - _FoamWidth: 0.72
    - _FresnelPow: 10
    - _Gloss: 0.02
    - _LightDistortStrength: 0.32
    - _LightEdgeSmoothness: 0.01
    - _LightEdgeValue: 0.97
    - _LightSpecular: 44.14
    - _NormalScale: 39.63
    - _NormalSpeed: -2.4
    - _ReflectionDistortion: 5.37
    - _RefractionIncludeTransparent: 0
    - _RefractionNormalSize: 1.1
    - _RefractionReflectionEffect: 13.8
    - _SRPAdditionLightSmoothness: 1
    - _ShoreEdgeIntensity: 0.12
    - _ShoreEdgeWidth: 1
    - _ShoreRange: 16.16
    - _SparklingStep: 0.5
    - _TessPhongStrength: 0.5
    - _TessValue: 4.6
    - _UnderWaterDistortion: 10.29
    - _UseDirectionLight: 0
    - _UseFoam: 0
    - _UseVertexOffset: 0
    m_Colors:
    - _AllColor: {r: 0.5220363, g: 0.7615646, b: 0.9811321, a: 1}
    - _DeepColor: {r: 0.17757207, g: 0.32515866, b: 0.4056604, a: 1}
    - _EmissionColor: {r: 1, g: 1, b: 1, a: 1}
    - _FoamColor: {r: 3.6886053, g: 3.6886053, b: 3.6886053, a: 1}
    - _FoamDistortGenerate: {r: 6.7, g: 300, b: 0, a: 0}
    - _FoamNoiseSize: {r: 43.06, g: 66.85, b: 0, a: 0}
    - _FresnelColor: {r: 0.36862746, g: 0.7294118, b: 2, a: 0.77254903}
    - _LightColorBlend: {r: 766.9961, g: 241.7356, b: 0, a: 1}
    - _SRPAdditionSpecularColor: {r: 1, g: 1, b: 1, a: 1}
    - _ShallowColor: {r: 0.3944464, g: 0.5415293, b: 0.754717, a: 0}
    - _ShoreColor: {r: 0.254717, g: 0.254717, b: 0.254717, a: 0}
    - _SmoothOcclusion: {r: 0.95, g: 1, b: 0, a: 0}
    - _SmoothOcclusionFresnelScaleFresnelPow: {r: 1, g: 0.72, b: 1, a: 2.6}
    - _SparklingXYSpeedDistortXYSpeed: {r: 0, g: 0, b: 0, a: 0}
    - _Vector0: {r: 1, g: 1, b: 1, a: 0}
    - _WaveASpeedXYStepnesslength: {r: 1, g: -1.08, b: 0.36, a: 1.8}
    - _WaveBSpeedXYStepnesslength: {r: -0.5, g: -0.5, b: 0.09, a: 1.6}
    - _WaveCSpeedXYStepnesslength: {r: 0, g: 1, b: 7, a: 1.5}
    - _WaveColor: {r: 0.20688856, g: 0.5254112, b: 0.5566038, a: 1}
  m_BuildTextureStacks: []
