%YAML 1.1
%TAG !u! tag:unity3d.com,2011:
--- !u!114 &-7096791944130702651
MonoBehaviour:
  m_ObjectHideFlags: 11
  m_CorrespondingSourceObject: {fileID: 0}
  m_PrefabInstance: {fileID: 0}
  m_PrefabAsset: {fileID: 0}
  m_GameObject: {fileID: 0}
  m_Enabled: 1
  m_EditorHideFlags: 0
  m_Script: {fileID: 11500000, guid: d0353a89b1f911e48b9e16bdc9f2e058, type: 3}
  m_Name: 
  m_EditorClassIdentifier: 
  version: 4
--- !u!21 &2100000
Material:
  serializedVersion: 6
  m_ObjectHideFlags: 0
  m_CorrespondingSourceObject: {fileID: 0}
  m_PrefabInstance: {fileID: 0}
  m_PrefabAsset: {fileID: 0}
  m_Name: Berry_Fruit
  m_Shader: {fileID: 4800000, guid: 4affba2073882454dbe42678d2e68770, type: 3}
  m_ShaderKeywords: _DISSOLVEMODE_UV _MULTIPLYEMISSIONTEXTURE_ON _SHADOWREMAPTYPE_USESHADOWREMAPMAP
  m_LightmapFlags: 4
  m_EnableInstancingVariants: 0
  m_DoubleSidedGI: 0
  m_CustomRenderQueue: -1
  stringTagMap: {}
  disabledShaderPasses: []
  m_SavedProperties:
    serializedVersion: 3
    m_TexEnvs:
    - _3DTexture:
        m_Texture: {fileID: 2800000, guid: e025385ced9529246bb9a266feb0996d, type: 3}
        m_Scale: {x: 1, y: 1}
        m_Offset: {x: 0, y: 0}
    - _AlbedoMap:
        m_Texture: {fileID: 2800000, guid: 93eddbac4be62ef43b665c540d5e15f0, type: 3}
        m_Scale: {x: 1, y: 1}
        m_Offset: {x: 0, y: 0}
    - _BaseMap:
        m_Texture: {fileID: 0}
        m_Scale: {x: 1, y: 1}
        m_Offset: {x: 0, y: 0}
    - _BumpMap:
        m_Texture: {fileID: 0}
        m_Scale: {x: 1, y: 1}
        m_Offset: {x: 0, y: 0}
    - _DetailAlbedoMap:
        m_Texture: {fileID: 0}
        m_Scale: {x: 1, y: 1}
        m_Offset: {x: 0, y: 0}
    - _DetailMask:
        m_Texture: {fileID: 0}
        m_Scale: {x: 1, y: 1}
        m_Offset: {x: 0, y: 0}
    - _DetailNormalMap:
        m_Texture: {fileID: 0}
        m_Scale: {x: 1, y: 1}
        m_Offset: {x: 0, y: 0}
    - _EmissionMap:
        m_Texture: {fileID: 0}
        m_Scale: {x: 1, y: 1}
        m_Offset: {x: 0, y: 0}
    - _EmissionTexture:
        m_Texture: {fileID: 2800000, guid: a7dbc7395a48f1e4791f00ac6aefe037, type: 3}
        m_Scale: {x: 1, y: 1}
        m_Offset: {x: 0, y: 0}
    - _IndirectDiffuseLightNormal:
        m_Texture: {fileID: 2800000, guid: bd734c29baceb63499732f24fbaea45f, type: 3}
        m_Scale: {x: 1, y: 1}
        m_Offset: {x: 0, y: 0}
    - _MainTex:
        m_Texture: {fileID: 0}
        m_Scale: {x: 1, y: 1}
        m_Offset: {x: 0, y: 0}
    - _MetallicGlossMap:
        m_Texture: {fileID: 0}
        m_Scale: {x: 1, y: 1}
        m_Offset: {x: 0, y: 0}
    - _NormalMap:
        m_Texture: {fileID: 0}
        m_Scale: {x: 1, y: 1}
        m_Offset: {x: 0, y: 0}
    - _OcclusionMap:
        m_Texture: {fileID: 0}
        m_Scale: {x: 1, y: 1}
        m_Offset: {x: 0, y: 0}
    - _ParallaxMap:
        m_Texture: {fileID: 0}
        m_Scale: {x: 1, y: 1}
        m_Offset: {x: 0, y: 0}
    - _RampCelluloidNoiseTexture:
        m_Texture: {fileID: 0}
        m_Scale: {x: 1, y: 1}
        m_Offset: {x: 0, y: 0}
    - _ShadowRemapMap:
        m_Texture: {fileID: 2800000, guid: 5c17639b73e66a64eb1bf87957b3160a, type: 3}
        m_Scale: {x: 1, y: 1}
        m_Offset: {x: 0, y: 0}
    - _SpecGlossMap:
        m_Texture: {fileID: 0}
        m_Scale: {x: 1, y: 1}
        m_Offset: {x: 0, y: 0}
    - _SpecularMap:
        m_Texture: {fileID: 0}
        m_Scale: {x: 1, y: 1}
        m_Offset: {x: 0, y: 0}
    - _texcoord:
        m_Texture: {fileID: 0}
        m_Scale: {x: 1, y: 1}
        m_Offset: {x: 0, y: 0}
    - unity_Lightmaps:
        m_Texture: {fileID: 0}
        m_Scale: {x: 1, y: 1}
        m_Offset: {x: 0, y: 0}
    - unity_LightmapsInd:
        m_Texture: {fileID: 0}
        m_Scale: {x: 1, y: 1}
        m_Offset: {x: 0, y: 0}
    - unity_ShadowMasks:
        m_Texture: {fileID: 0}
        m_Scale: {x: 1, y: 1}
        m_Offset: {x: 0, y: 0}
    m_Floats:
    - _AlphaClip: 0
    - _AlphaCutoff: 0.5
    - _Blend: 0
    - _BumpScale: 1
    - _ClearCoatMask: 0
    - _ClearCoatSmoothness: 0
    - _ClipEdge: 0.99
    - _ClipEdgeSoftness: 0.01
    - _ClipNoiseScale: 10
    - _ClipNoiseTiling: 1
    - _Cull: 2
    - _Cutoff: 0.5
    - _DeadClip: 0
    - _DetailAlbedoMapScale: 1
    - _DetailNormalMapScale: 1
    - _DiffuseLightStrength: 0
    - _DirLightIntensity: 1
    - _DirLightNormalScale: 0.6
    - _DissolveMode: 0
    - _DstBlend: 0
    - _EmissionStrength: 1
    - _EnvironmentReflections: 1
    - _GenerateDither: 1
    - _GlossMapScale: 0
    - _Glossiness: 0
    - _GlossyReflections: 0
    - _LightAttSoft: 0
    - _LightAttValue: -0.3
    - _Metallic: 0
    - _MultiplyEmissionTexture: 1
    - _NormalStrength: 0
    - _OcclusionStrength: 1
    - _OutlineMax: 0.04
    - _OutlineWidth: 0.1
    - _Parallax: 0.005
    - _QueueOffset: 0
    - _RampAddincludePower: 0
    - _RampAddwithoutPower: 0
    - _RampCelluloidNoiseSoftness: 1
    - _RampCelluloidNoiseValue: 0
    - _RampPower: 0.76
    - _ReceiveShadows: 1
    - _RimOffset: 0
    - _ShadowRemapType: 1
    - _Smoothness: 0.5
    - _SmoothnessTextureChannel: 0
    - _SpecularHighlights: 1
    - _SpecularIntensity: 0
    - _SpecularPow: 4
    - _SpecularSRPLightSampler1: 5
    - _Sprint: 0
    - _SrcBlend: 1
    - _Surface: 0
    - _Use3SSimulation: 1
    - _WorkflowMode: 1
    - _ZWrite: 1
    m_Colors:
    - _3SColor: {r: 2.1402533, g: 2.1402533, b: 2.1402533, a: 0}
    - _AlbedoEmissionColor: {r: 0.3301887, g: 0.3301887, b: 0.3301887, a: 0}
    - _BaseColor: {r: 1, g: 1, b: 1, a: 1}
    - _ClipEdgeColor: {r: 7.464264, g: 1.717473, b: 0, a: 0}
    - _Color: {r: 1, g: 1, b: 1, a: 1}
    - _EmissionColor: {r: 0.03327561, g: 0.52131796, b: 2.1850986, a: 1}
    - _IndirectDiffuseLightColorMul: {r: 0, g: 0, b: 0, a: 0}
    - _OutlineColor: {r: 2.0329676, g: 0.9745422, b: 7.7090664, a: 0}
    - _RimColor: {r: 0, g: 0, b: 0, a: 0}
    - _RimSmoothStepMinMax: {r: 0, g: 1, b: 0, a: 0}
    - _SpecColor: {r: 0.19999996, g: 0.19999996, b: 0.19999996, a: 1}
    - _SpecularColor: {r: 1, g: 1, b: 1, a: 0}
    - _SpecularDirLightSRPLightIntensity: {r: 1, g: 1, b: 0, a: 0}
    - _SpecularSRPLightSmoothstep1: {r: 0, g: 1, b: 0, a: 0}
    - _SpecularSmoothStepMinMax: {r: 0, g: 0.01, b: 0, a: 0}
    - _SprintColor: {r: 2.297397, g: 0.9640058, b: 0.2072162, a: 0}
  m_BuildTextureStacks: []
