%YAML 1.1
%TAG !u! tag:unity3d.com,2011:
--- !u!21 &2100000
Material:
  serializedVersion: 6
  m_ObjectHideFlags: 0
  m_CorrespondingSourceObject: {fileID: 0}
  m_PrefabInstance: {fileID: 0}
  m_PrefabAsset: {fileID: 0}
  m_Name: Shader Graphs_Grass
  m_Shader: {fileID: -6465566751694194690, guid: 1eb04c7c3f47f334db72d6b2c795c457, type: 3}
  m_ShaderKeywords: 
  m_LightmapFlags: 4
  m_EnableInstancingVariants: 1
  m_DoubleSidedGI: 0
  m_CustomRenderQueue: -1
  stringTagMap: {}
  disabledShaderPasses: []
  m_SavedProperties:
    serializedVersion: 3
    m_TexEnvs:
    - unity_Lightmaps:
        m_Texture: {fileID: 0}
        m_Scale: {x: 1, y: 1}
        m_Offset: {x: 0, y: 0}
    - unity_LightmapsInd:
        m_Texture: {fileID: 0}
        m_Scale: {x: 1, y: 1}
        m_Offset: {x: 0, y: 0}
    - unity_ShadowMasks:
        m_Texture: {fileID: 0}
        m_Scale: {x: 1, y: 1}
        m_Offset: {x: 0, y: 0}
    m_Floats:
    - Boolean_08bb201294d04e40a5a4057a24f3d3a7: 0
    - Boolean_5b04bc412f4a4d5e940982cb61b1258e: 0
    - Vector1_28912f6bc697404799e4d99ee891c292: 0.56
    - Vector1_29a61701824b4394aeecf66741d310fc: 0.78
    - Vector1_2dd53b2ddfcb48a187b1d4395cfed07c: 0
    - Vector1_52dbec1bea6441a4b6ba64a9823aa141: 0.18
    - Vector1_6bbae9579f7d4abead8ae6523f7d0631: 0.32
    - Vector1_a5c1e06a1ea14850b09440de4aa1bc64: 0.34
    - Vector1_af5ff406f7e44b83bfb891edede7463a: -0.3
    - Vector1_b6acc337fbac4070a3524d91597c6ab8: 0.54
    - Vector1_f92bb0c319ce48749318a048e1157de3: 0.09
    - _CloudMaskStrengh: -0.04
    - _CloudScale: 0.23
    - _WindSpeed: 1.2
    m_Colors:
    - Color_632c1e6cfad64a35a92e659beba61a44: {r: 1.1872504, g: 3.901525, b: 0.12514299, a: 1}
    - Color_6424aee8b2224db9ab48b052e4aa0bc0: {r: 0.78381777, g: 1.2072597, b: 0.46848878, a: 0}
    - Color_d692313820394f6fa241fff5bcd64ba2: {r: 0.10849054, g: 0.11320752, b: 0, a: 0}
    - Vector2_58ba710bf3a94436b2161debffbcffbe: {r: 0, g: 10, b: 0, a: 0}
    - Vector3_eb7a3d7fbb2342209bf5d0f02afdd501: {r: 0.1, g: -0.46, b: 0.5, a: 0}
    - _PlayerLocation: {r: 0, g: 0.07, b: -3.4, a: 0}
    - _TerriainPosition: {r: 0, g: 0, b: 0, a: 0}
    - _WindDirection: {r: 21.82, g: 90.47, b: 0, a: 0}
  m_BuildTextureStacks: []
