var random = Math.floor(Math.random() * 10 /* max length */)
            var ppchar = "="
            var ppstart = "8"
           var ppend = "D"
            var pp_parts = ["="]
            var number = random
           var countdown = 1
                if(number != 0){
                   while(number > 0){
                   pp_parts[0] += ppchar
                   number -= countdown
                   if(number == 0){
                   break;
              }
           }

           message.channel.send(`${ppstart}${pp_parts}${ppend}` + message.author.username + '... Y-Your... uh.. Pp is... nice?') 