%YAML 1.1
%TAG !u! tag:unity3d.com,2011:
--- !u!162 &1
EditorUserSettings:
  m_ObjectHideFlags: 0
  serializedVersion: 4
  m_ConfigSettings:
    RecentlyUsedSceneGuid-0:
      value: 5a08575f5207595a0f5d59741173094444164f7d7d2a23317c7a4465bbe1646d
      flags: 0
    RecentlyUsedSceneGuid-1:
      value: 5b0503545c500c5f0c59587a43770f14464e4d7f7b7973327b284863e0b36368
      flags: 0
    RecentlyUsedSceneGuid-2:
      value: 0203040552035d0f59585f2413740e44474f1a2f7d792568797e496abbb5616d
      flags: 0
    RecentlyUsedSceneGuid-3:
      value: 5054505f07015e0e5b085a7016760c444f4f1a287b2d70687a2a4937e0b4606c
      flags: 0
    RecentlyUsedSceneGuid-4:
      value: 5355075e06560d5e5f5f5d2445215a44424e487a797e7366782f4c67e1b1623e
      flags: 0
    vcSharedLogLevel:
      value: 0d5e400f0650
      flags: 0
  m_VCAutomaticAdd: 1
  m_VCDebugCom: 0
  m_VCDebugCmd: 0
  m_VCDebugOut: 0
  m_SemanticMergeMode: 2
  m_DesiredImportWorkerCount: 2
  m_StandbyImportWorkerCount: 2
  m_IdleImportWorkerShutdownDelay: 60000
  m_VCShowFailedCheckout: 1
  m_VCOverwriteFailedCheckoutAssets: 1
  m_VCProjectOverlayIcons: 1
  m_VCHierarchyOverlayIcons: 1
  m_VCOtherOverlayIcons: 1
  m_VCAllowAsyncUpdate: 1
  m_ArtifactGarbageCollection: 1
