// Jest Snapshot v1, https://goo.gl/fbAQLP

exports[`Header component should render 1`] = `
<div
  class="header"
>
  <div
    class="header__text"
  >
    Buy
  </div>
  <img
    alt="black knife"
    class="header__logo"
    src="img/header-logo.svg"
  />
  <div
    class="header__text"
  >
    Knifes
  </div>
</div>
`;
