[
	{
		"name": "IPhone 8 64Gb",
		"price": 320,
		"url": "./img/iphone8.jpg",
		"SKU": "SK3002",
		"color": "red"
	},
	{
		"name": "IPhone 13 124Gb",
		"price": 1099,
		"url": "./img/iphone13.jpeg",
		"SKU": "SK2144",
		"color": "grey"
	},
	{
		"name": "Samsung Galaxy A52",
		"price": 399,
		"url": "./img/samsung-galaxy-a52.jpg",
		"SKU": "SK1222",
		"color": "grey"
	},
	{
		"name": "Xiaomi Redmi Note 11",
		"price": 500,
		"url": "./img/xiaomi-redmi-note-11.jpg",
		"SKU": "SK4356",
		"color": "black"
	},
	{
		"name": "Xiaomi Redmi 9A",
		"price": 390,
		"url": "./img/xiaomi-redmi-9a.jpg",
		"SKU": "SK3021",
		"color": "blue"
	},
	{
		"name": "Apple iPad 32Gb",
		"price": 570,
		"url": "./img/apple-ipad.jpeg",
		"SKU": "SK2344",
		"color": "pink"
	},
	{
		"name": "Huawei MatePad Pro",
		"price": 659,
		"url": "./img/huawei-matepad-pro.jpeg",
		"SKU": "SK9932",
		"color": "blue"
	},
	{
		"name": "Apple IPad Pro 11",
		"price": 711,
		"url": "./img/apple-ipad-pro-11.jpg",
		"SKU": "SK4991",
		"color": "white"
	},
	{
		"name": "Microsoft Surface Pro 7 i5",
		"price": 597,
		"url": "./img/microsoft-surface-pro-7.jpeg",
		"SKU": "SK1772",
		"color": "white"
	},
	{
		"name": "Samsung Galaxy Tab A7",
		"price": 600,
		"url": "./img/samsung-galaxy-tab-a7.jpeg",
		"SKU": "SK2222",
		"color": "grey"
	},
	{
		"name": "Huawei MatePad Pro",
		"price": 672,
		"url": "./img/huawei-matepad-pro.jpeg",
		"SKU": "SK6190",
		"color": "black"
	},
	{
		"name": "Samsung Galaxy Tab",
		"price": 470,
		"url": "./img/samsung-galaxy-tab.jpg",
		"SKU": "SK3012",
		"color": "grey"
	}
]