<svg width="429" height="429" viewBox="0 0 429 429" fill="none" xmlns="http://www.w3.org/2000/svg">
<g filter="url(#filter0_d_301_26)">
<path fill-rule="evenodd" clip-rule="evenodd" d="M126.759 1.13361C105.81 4.66 81.5198 20.6468 68.2519 39.644C47.6497 69.1416 44.2911 105.921 59.1835 138.973C66.5243 155.27 71.5118 161.085 140.815 234.165L214.625 312L288.431 234.049C357.499 161.101 362.737 154.99 370.005 138.857C397.195 78.506 359.868 8.17715 296.658 0.661583C271.328 -2.35112 242.25 7.8532 224.194 26.0891L214.568 35.8098L204.942 26.0891C185.442 6.39313 154.397 -3.51503 126.759 1.13361ZM235.243 75.0305C238.14 76.2014 238.715 80.9958 238.715 103.954V131.474H264.823C286.604 131.474 291.153 132.08 292.263 135.134C292.997 137.147 293.596 147.523 293.596 158.192C293.596 182.211 293.374 182.38 261.91 182.38H238.715V208.909C238.715 240.255 238.735 240.227 214.568 240.227C190.401 240.227 190.42 240.255 190.42 208.909V182.38H166.429C136.19 182.38 135.54 181.845 135.54 156.95C135.54 146.965 136.139 137.147 136.872 135.134C137.983 132.08 142.532 131.474 164.313 131.474H190.42V103.899C190.42 84.0062 191.184 76.0001 193.164 75.1578C197.129 73.4733 231.135 73.3691 235.243 75.0305Z" fill="#F9F9F9"/>
</g>
<path d="M40.128 406.152C34.944 406.152 30.112 405.32 25.632 403.656C21.216 401.928 17.376 399.496 14.112 396.36C10.848 393.224 8.288 389.544 6.432 385.32C4.64 381.096 3.744 376.456 3.744 371.4C3.744 366.344 4.64 361.704 6.432 357.48C8.288 353.256 10.848 349.576 14.112 346.44C17.44 343.304 21.312 340.904 25.728 339.24C30.144 337.512 34.976 336.648 40.224 336.648C46.048 336.648 51.296 337.672 55.968 339.72C60.704 341.704 64.672 344.648 67.872 348.552L57.888 357.768C55.584 355.144 53.024 353.192 50.208 351.912C47.392 350.568 44.32 349.896 40.992 349.896C37.856 349.896 34.976 350.408 32.352 351.432C29.728 352.456 27.456 353.928 25.536 355.848C23.616 357.768 22.112 360.04 21.024 362.664C20 365.288 19.488 368.2 19.488 371.4C19.488 374.6 20 377.512 21.024 380.136C22.112 382.76 23.616 385.032 25.536 386.952C27.456 388.872 29.728 390.344 32.352 391.368C34.976 392.392 37.856 392.904 40.992 392.904C44.32 392.904 47.392 392.264 50.208 390.984C53.024 389.64 55.584 387.624 57.888 384.936L67.872 394.152C64.672 398.056 60.704 401.032 55.968 403.08C51.296 405.128 46.016 406.152 40.128 406.152ZM78.3743 405V337.8H93.9263V392.328H127.622V405H78.3743ZM127.855 405L157.807 337.8H173.167L203.215 405H186.895L162.319 345.672H168.463L143.791 405H127.855ZM142.831 390.6L146.959 378.792H181.519L185.743 390.6H142.831ZM210.187 405V337.8H239.275C245.291 337.8 250.475 338.792 254.827 340.776C259.179 342.696 262.539 345.48 264.907 349.128C267.275 352.776 268.459 357.128 268.459 362.184C268.459 367.176 267.275 371.496 264.907 375.144C262.539 378.728 259.179 381.48 254.827 383.4C250.475 385.32 245.291 386.28 239.275 386.28H218.827L225.739 379.464V405H210.187ZM252.907 405L236.107 380.616H252.715L269.707 405H252.907ZM225.739 381.192L218.827 373.896H238.411C243.211 373.896 246.795 372.872 249.163 370.824C251.531 368.712 252.715 365.832 252.715 362.184C252.715 358.472 251.531 355.592 249.163 353.544C246.795 351.496 243.211 350.472 238.411 350.472H218.827L225.739 343.08V381.192ZM280.781 405V337.8H296.333V405H280.781ZM326.201 405V350.472H304.697V337.8H363.257V350.472H341.753V405H326.201ZM387.016 405V377.544L390.568 386.952L361 337.8H377.512L400.168 375.528H390.664L413.416 337.8H428.68L399.112 386.952L402.568 377.544V405H387.016Z" fill="#F9F9F9"/>
<defs>
<filter id="filter0_d_301_26" x="46" y="0" width="337" height="320" filterUnits="userSpaceOnUse" color-interpolation-filters="sRGB">
<feFlood flood-opacity="0" result="BackgroundImageFix"/>
<feColorMatrix in="SourceAlpha" type="matrix" values="0 0 0 0 0 0 0 0 0 0 0 0 0 0 0 0 0 0 127 0" result="hardAlpha"/>
<feOffset dy="4"/>
<feGaussianBlur stdDeviation="2"/>
<feComposite in2="hardAlpha" operator="out"/>
<feColorMatrix type="matrix" values="0 0 0 0 0 0 0 0 0 0 0 0 0 0 0 0 0 0 0.25 0"/>
<feBlend mode="normal" in2="BackgroundImageFix" result="effect1_dropShadow_301_26"/>
<feBlend mode="normal" in="SourceGraphic" in2="effect1_dropShadow_301_26" result="shape"/>
</filter>
</defs>
</svg>
