// let inputName = document.createElement('input')
// document.body.append(inputName)
// const createElement = event => {
//     if (event.key === 'Enter') {
//         let ulItem = document.createElement('ol')
//         let listElem = document.createElement('li')
//         listElem.innerText = inputName.value;
//         inputName.value = '';
//         document.body.append(ulItem)
//         ulItem.append(listElem)
//     }
// }
// inputName.addEventListener('keydown', createElement)
//
// let array = ["hello", "world", "Kiev", "Kharkiv", "Odessa", "Lviv"];
// console.log(array.map(function x () {
//     let ol = document.createElement('ol');
//     let li = document.createElement('li');
//     document.body.append(ol)
//     ol.append(li)
//     array.slice(0)
// }));





// function str(strings, ...values) {
//     let str = "";
//     for(let i=0; i<values.length; i++) {
//         str += strings[i];
//         str += values[i];
//     }

    // последний кусок строки
    // str += strings[strings.length-1];
    // return str;
// }

// const arr = ['str', 'str2', 'str3']
// const newArr = arr.map(el => `<li>${el}</li>`).join().slice(0)
//
// console.log(newArr);
// let olList = document.createElement("ol")
// let listItem = document.createElement('li')
// listItem.innerHTML = newArr
// document.body.append(olList)
// olList.append(listItem)

// const createList = (arr, parent = document.body) => {
    // arr.map(element => {
        // `<li>${element}</li>`
        // console.log(arr)
        // let ulList = document.createElement("ol")
        // if (Array.isArray(element)) {
        //     parent.append(ulList)
        //     createList(element, ulList)
        // } else {
        //     ulList.innerHTML = ``
        //     parent.append(ulList)
        // }
    // ulList.innerHTML= arr.map(element => `<li>${element}</li>`)
    // ulList.insertAdjacentHTML("afterend", ``);
    // }).join()
//
// }
// createList(["hello", "world", ["Kiev", "Kharkiv"], "Odessa", "Lviv"])
    // newArr = ['<li>str</li>', '<li>str2</li>', '<li>str3</li>']


createList = (arr, element = document.body) => {
    arr.map(function (value){
        let list = document.createElement('ul')
        let item = document.createElement('li')
        if (Array.isArray(value)){
            element.append(list)
            createList(value, list)
        } else {
            item.innerText = value;
            element.append(item)
        }

    })
}
createList(["hello", "world", ["Kiev","Kharkiv"], "Odessa", "Lviv"])


// const list = (array, parents = document.body) => {
//     array.map(function (value){
//         let olList = document.createElement("ol")
//         let listItem = document.createElement('li')
//         if (Array.isArray(value)){
//             parents.append(olList)
//             list(value, olList)
//         }else{
//             listItem.innerText = value;
//             parents.append(listItem)
//         }
//     }).join()
// }
// list(["hello", "world",["Kiev", "Kharkiv"], "Odessa", "Lviv"])


// creteList = (arr, parent = document.body) => {
//     arr.map(function (currentValue){
//         let nestedList = document.createElement('ul')
//         let listPoint = document.createElement('li')
//         if (Array.isArray(currentValue)){
//             parent.append(nestedList)
//             creteList(currentValue, nestedList)
//         } else {
//             listPoint.innerText = currentValue;
//             parent.append(listPoint)
//         }
//
//     })
// }
// creteList(["hello", "world", ["Kiev", "Kharkiv"], "Odessa", "Lviv"])






    let timer;
    let x = 4;
    function countDown(){
        document.getElementById('timer').innerHTML = `timer:${x}`;
        x--;
        if (x<0){
            clearTimeout(timer);
        }
        else {
            timer = setTimeout(countDown, 1000);
        }
    }
    countDown()
}
