[
	{
		"name": "Adventure",
		"price": 899,
		"url": "img/Adventure.jpg",
		"SKU": "SK001",
		"color": "black"
	},
	{
		"name": "Boy",
		"price": 999,
		"url": "img/Boy.jpg",
		"SKU": "SK002",
		"color": "green"
	},
	{
		"name": "Cutter",
		"price": 1199,
		"url": "img/Cutter.jpg",
		"SKU": "SK003",
		"color": "orange"
	},
	{
		"name": "Defender",
		"price": 799,
		"url": "img/Defender.jpg",
		"SKU": "SK004",
		"color": "green"
	},
	{
		"name": "Pocket",
		"price": 1111,
		"url": "img/Pocket.jpg",
		"SKU": "SK005",
		"color": "orange"
	},
	{
		"name": "Shark",
		"price": 1300,
		"url": "img/Shark.jpg",
		"SKU": "SK006",
		"color": "orange"
	},
	{
		"name": "Spyke",
		"price": 999,
		"url": "img/Spyke.jpg",
		"SKU": "SK007",
		"color": "black"
	},
	{
		"name": "T-Rex",
		"price": 1299,
		"url": "img/T-Rex.jpg",
		"SKU": "SK008",
		"color": "green"
	},
	{
		"name": "Urbanite",
		"price": 1222,
		"url": "img/Urbanite.jpg",
		"SKU": "SK009",
		"color": "black"
	},
	{
		"name": "Whaler",
		"price": 1500,
		"url": "img/Whaler.jpg",
		"SKU": "SK010",
		"color": "black"
	}
]