%YAML 1.1
%TAG !u! tag:unity3d.com,2011:
--- !u!114 &11400000
MonoBehaviour:
  m_ObjectHideFlags: 0
  m_CorrespondingSourceObject: {fileID: 0}
  m_PrefabInstance: {fileID: 0}
  m_PrefabAsset: {fileID: 0}
  m_GameObject: {fileID: 0}
  m_Enabled: 1
  m_EditorHideFlags: 0
  m_Script: {fileID: 11500000, guid: db42ea77b5104db198b22d79291dea4e, type: 3}
  m_Name: level_6
  m_EditorClassIdentifier: 
  LevelKey: level_6
  TimeOfLevel:
    Value: 45
  LevelTransferTriggerDataset:
    PositionTrigger:
      X: 0.94
      Y: 4.61
      Z: -20.57
    rotationTriggerTrigger:
      X: -0
      Y: 0
      Z: 0
    ColliderCenter:
      X: 0
      Y: 0
      Z: 0
    ColliderSize:
      X: 10
      Y: 10
      Z: 3
  StarsProgress:
    SnakeLenghtOnLevel: 11
  SpawnEnemySnakeDataset:
  - LenghtTile: 15
    SpeedSnake: 5.5
    CurrentTarget: 0
    DistanceToChangedTargetPoint: 1
    Points:
    - X: 3.0602043
      Y: 4.2777796
      Z: 17.208733
    - X: 5.9905524
      Y: 4.921627
      Z: 23.986229
    - X: 1.4993536
      Y: 6.788274
      Z: 33.010075
    - X: -4.3818913
      Y: 12.644561
      Z: 37.612404
    - X: 0.6279392
      Y: 19.036608
      Z: 43.609074
    - X: 7.135028
      Y: 24.057907
      Z: 42.410458
    - X: 7.135028
      Y: 28.992382
      Z: 33.550205
    - X: 4.4086657
      Y: 29.481216
      Z: 27.125244
    - X: -2.483522
      Y: 26.239012
      Z: 19.486153
    - X: -6.3654118
      Y: 14.72425
      Z: 13.928687
  - LenghtTile: 15
    SpeedSnake: 5.5
    CurrentTarget: 0
    DistanceToChangedTargetPoint: 1
    Points:
    - X: 10.411752
      Y: 13.981945
      Z: 15.844034
    - X: 10.600151
      Y: 17.49329
      Z: 31.233713
    - X: 4.4240627
      Y: 25.382553
      Z: 40.9736
    - X: -4.8098173
      Y: 26.13102
      Z: 42.210808
    - X: -10.496115
      Y: 20.673054
      Z: 35.464993
    - X: -9.543586
      Y: 19.07993
      Z: 24.986794
    - X: -5.3512073
      Y: 17.077553
      Z: 13.990545
  - LenghtTile: 15
    SpeedSnake: 5.5
    CurrentTarget: 0
    DistanceToChangedTargetPoint: 1
    Points:
    - X: 8.631426
      Y: 15.4
      Z: 72.656746
    - X: 7.276288
      Y: 15.4
      Z: 79.99785
    - X: -4.00459
      Y: 15.4
      Z: 79.99785
    - X: -6.788224
      Y: 15.4
      Z: 72.420815
    - X: 1.5675154
      Y: 15.4
      Z: 65.37947
  - LenghtTile: 15
    SpeedSnake: 5.5
    CurrentTarget: 0
    DistanceToChangedTargetPoint: 1
    Points:
    - X: -2.6374865
      Y: 6.295121
      Z: 14.9872675
    - X: -9.257481
      Y: 12.298798
      Z: 22.19436
    - X: -12.423396
      Y: 16.196304
      Z: 30.85486
    - X: -9.447208
      Y: 18.666428
      Z: 42.542046
    - X: 4.117511
      Y: 22.749563
      Z: 42.542046
    - X: 13.434227
      Y: 20.565464
      Z: 31.398582
    - X: 11.965062
      Y: 16.360874
      Z: 16.291178
  - LenghtTile: 15
    SpeedSnake: 5.5
    CurrentTarget: 0
    DistanceToChangedTargetPoint: 1
    Points:
    - X: 1.129212
      Y: 23.482658
      Z: 70.36075
    - X: 0.8791965
      Y: 20.605116
      Z: 82.55388
    - X: 1.9453989
      Y: 9.028664
      Z: 83.77908
    - X: 1.579683
      Y: 5.46183
      Z: 71.015755
    - X: 1.1292125
      Y: 15.552489
      Z: 63.21525
  - LenghtTile: 15
    SpeedSnake: 5.5
    CurrentTarget: 0
    DistanceToChangedTargetPoint: 1
    Points:
    - X: -0.9225854
      Y: 3.2831354
      Z: 26.58715
    - X: 0.3074121
      Y: 4.7125206
      Z: 36.430904
    - X: -1.0202332
      Y: 9.20259
      Z: 42.720753
    - X: -1.9921361
      Y: 17.481026
      Z: 35.514885
    - X: 0.23371053
      Y: 16.398436
      Z: 25.785675
    - X: -0.47785902
      Y: 12.393131
      Z: 16.742882
  - LenghtTile: 15
    SpeedSnake: 5.5
    CurrentTarget: 0
    DistanceToChangedTargetPoint: 1
    Points:
    - X: -5.0394917
      Y: 27.500935
      Z: 18.43732
    - X: -4.43259
      Y: 23.388565
      Z: 28.72858
    - X: -2.0352206
      Y: 18.011604
      Z: 33.134495
    - X: 5.5308647
      Y: 11.901173
      Z: 39.014553
    - X: 13.99858
      Y: 15.76892
      Z: 37.822224
    - X: 14.368291
      Y: 15.733034
      Z: 27.953674
    - X: 8.508592
      Y: 15.733034
      Z: 21.777924
    - X: 3.704136
      Y: 19.348198
      Z: 16.220741
  SpawnerCollectibleObjects: []
  ApplePositions:
  - Position:
      X: -15.5
      Y: 2.900001
      Z: 42.58
  - Position:
      X: -15.5
      Y: 2.9
      Z: 16.5
  - Position:
      X: -9
      Y: 9.95
      Z: 62.21
  - Position:
      X: 13.74
      Y: 25.99
      Z: 11.51
  - Position:
      X: 10.78
      Y: 21.36
      Z: 61.99
  - Position:
      X: 14.36
      Y: 27.34
      Z: 42.58
  - Position:
      X: 17.440002
      Y: 27.34
      Z: 29.5
  - Position:
      X: 13.4
      Y: 26.36
      Z: 47.52
  - Position:
      X: 14.36
      Y: 27.34
      Z: 16.5
  - Position:
      X: -12.42
      Y: 2.900001
      Z: 29.5
  - Position:
      X: -12.95
      Y: 4.26
      Z: 11.41
  BadApplePositions:
  - Position:
      X: -9.14
      Y: 6.08
      Z: 61.81
  - Position:
      X: -15.57
      Y: 26.87
      Z: 35.44
  - Position:
      X: 16.490002
      Y: 28.25
      Z: 23.03
  - Position:
      X: -10.389999
      Y: 31.51
      Z: 23.78
  - Position:
      X: 18.72
      Y: 1.4500008
      Z: 35.44
  - Position:
      X: 13.789999
      Y: 6.2700005
      Z: 35.44
  - Position:
      X: -14.660001
      Y: 3.730001
      Z: 34.92
  - Position:
      X: -10.389999
      Y: 31.51
      Z: 35.44
  - Position:
      X: 13.79
      Y: 6.2700005
      Z: 23.78
  - Position:
      X: 10.7
      Y: 17.43
      Z: 62.14
  - Position:
      X: 10.63
      Y: 26.29
      Z: 62.14
  - Position:
      X: -15.57
      Y: 26.87
      Z: 23.78
  - Position:
      X: 18.72
      Y: 1.45
      Z: 23.78
  - Position:
      X: -9.14
      Y: 14.94
      Z: 61.81
  - Position:
      X: -13.370001
      Y: 3.8100028
      Z: 23.03
  - Position:
      X: 15.2
      Y: 28.17
      Z: 34.92
  ScopePositions: []
  SkullPositions:
  - Position:
      X: 16.19
      Y: 4.9799995
      Z: 42.33
  - Position:
      X: 16.19
      Y: 4.9799995
      Z: 15.57
  - Position:
      X: -13.83
      Y: 28.43
      Z: 15.57
  - Position:
      X: 2.99
      Y: 15.98
      Z: 54.25
  - Position:
      X: -1.39
      Y: 15.98
      Z: 54.66
  - Position:
      X: -13.83
      Y: 28.43
      Z: 42.33
