%YAML 1.1
%TAG !u! tag:unity3d.com,2011:
--- !u!114 &11400000
MonoBehaviour:
  m_ObjectHideFlags: 0
  m_CorrespondingSourceObject: {fileID: 0}
  m_PrefabInstance: {fileID: 0}
  m_PrefabAsset: {fileID: 0}
  m_GameObject: {fileID: 0}
  m_Enabled: 1
  m_EditorHideFlags: 0
  m_Script: {fileID: 11500000, guid: db42ea77b5104db198b22d79291dea4e, type: 3}
  m_Name: MarkerTesting
  m_EditorClassIdentifier: 
  LevelKey: MarkerTesting
  LevelTransferTriggerDataset:
    PositionTrigger:
      X: 0
      Y: 0
      Z: 0
    rotationTriggerTrigger:
      X: 0
      Y: 0
      Z: 0
    ColliderCenter:
      X: 0
      Y: 0
      Z: 0
    ColliderSize:
      X: 0
      Y: 0
      Z: 0
  StarsProgress:
    SnakeLenghtOnLevel: 0
  SpawnEnemySnakeDataset: []
  SpawnerCollectibleObjects: []
  ApplePositions:
  - Position:
      X: -8
      Y: 6.76
      Z: 10.86
  - Position:
      X: -13.58
      Y: 6.76
      Z: 10.86
  - Position:
      X: -11.03
      Y: 6.76
      Z: 10.86
  BadApplePositions:
  - Position:
      X: -4
      Y: 6.76
      Z: 10.86
  ScopePositions:
  - Position:
      X: 0
      Y: 6.76
      Z: 10.86
  SkullPositions:
  - Position:
      X: 4
      Y: 6.76
      Z: 10.86
