%YAML 1.1
%TAG !u! tag:unity3d.com,2011:
--- !u!114 &11400000
MonoBehaviour:
  m_ObjectHideFlags: 0
  m_CorrespondingSourceObject: {fileID: 0}
  m_PrefabInstance: {fileID: 0}
  m_PrefabAsset: {fileID: 0}
  m_GameObject: {fileID: 0}
  m_Enabled: 1
  m_EditorHideFlags: 0
  m_Script: {fileID: 11500000, guid: db42ea77b5104db198b22d79291dea4e, type: 3}
  m_Name: Level2
  m_EditorClassIdentifier: 
  LevelKey: Level2
  LevelTransferTriggerDataset:
    PositionTrigger:
      X: 1.78
      Y: 7.28
      Z: 75.97
    rotationTriggerTrigger:
      X: -0
      Y: 0
      Z: 0
    ColliderCenter:
      X: -0.4597392
      Y: 0.4937997
      Z: 0
    ColliderSize:
      X: 9.220578
      Y: 8.764481
      Z: 3
  StarsProgress:
    SnakeLenghtOnLevel: 30
  SpawnEnemySnakeDataset:
  - LenghtTile: 20
    SpeedSnake: 5
    CurrentTarget: 0
    DistanceToChangedTargetPoint: 1
    Points:
    - X: -8.905886
      Y: 6.1567593
      Z: 44.543583
    - X: 15.195797
      Y: 0.009508133
      Z: 44.922585
    - X: 15.81526
      Y: 6.86355
      Z: 16.397854
    - X: -8.597269
      Y: 6.86355
      Z: 16.776335
  SpawnerCollectibleObjects: []
  ApplePositions:
  - Position:
      X: 2.52
      Y: 4.36
      Z: 34.54
  - Position:
      X: -0.08
      Y: 6.29
      Z: 32.18
  - Position:
      X: -6.63
      Y: 10.48
      Z: 28.34
  - Position:
      X: -1.96
      Y: 4.36
      Z: 36.41
  - Position:
      X: 8.92
      Y: 8.97
      Z: 27.15
  - Position:
      X: 1.55
      Y: 6.29
      Z: 14.43
  - Position:
      X: 1.57
      Y: 11.35
      Z: 24.25
  - Position:
      X: 1.55
      Y: 6.29
      Z: 19.03
  - Position:
      X: -4.93
      Y: 4.36
      Z: 38.89
  - Position:
      X: 7.13
      Y: 4.36
      Z: 35.22
  - Position:
      X: 6.89
      Y: 10.43
      Z: 25.5
  - Position:
      X: 10.43
      Y: 7.62
      Z: 29.21
  - Position:
      X: 1.55
      Y: 4.63
      Z: 9.83
  - Position:
      X: 1.55
      Y: 6.29
      Z: 24.32
  - Position:
      X: 4.58
      Y: 4.36
      Z: 35.64
  - Position:
      X: 1.55
      Y: 6.29
      Z: 22.12
  - Position:
      X: 0.78
      Y: 4.36
      Z: 43.76
  - Position:
      X: -5.98
      Y: 9.16
      Z: 31.04
  - Position:
      X: 10.32
      Y: 6.1
      Z: 31.51
  - Position:
      X: 1.55
      Y: 6.29
      Z: 29.25
  - Position:
      X: 1.55
      Y: 6.29
      Z: 26.67
  - Position:
      X: 4.05
      Y: 10.43
      Z: 24.39
  - Position:
      X: 1.55
      Y: 6.29
      Z: 16.69
  - Position:
      X: 0.2
      Y: 4.36
      Z: 34.44
  - Position:
      X: -2.61
      Y: 4.36
      Z: 43.02
  - Position:
      X: -1.95
      Y: 11.38
      Z: 24.25
  - Position:
      X: 9.32
      Y: 4.36
      Z: 33.67
  - Position:
      X: 1.55
      Y: 5.89
      Z: 12.17
  - Position:
      X: -5.2
      Y: 11.27
      Z: 26.01
  - Position:
      X: -3.1
      Y: 7.64
      Z: 33.31
  BadApplePositions: []
  ScopePositions: []
  SkullPositions: []
