%YAML 1.1
%TAG !u! tag:unity3d.com,2011:
--- !u!1 &8633073110302300376
GameObject:
  m_ObjectHideFlags: 0
  m_CorrespondingSourceObject: {fileID: 0}
  m_PrefabInstance: {fileID: 0}
  m_PrefabAsset: {fileID: 0}
  serializedVersion: 6
  m_Component:
  - component: {fileID: 7003369867951830527}
  m_Layer: 0
  m_Name: pr_Plane_16x16
  m_TagString: Untagged
  m_Icon: {fileID: 0}
  m_NavMeshLayer: 0
  m_StaticEditorFlags: 0
  m_IsActive: 1
--- !u!4 &7003369867951830527
Transform:
  m_ObjectHideFlags: 0
  m_CorrespondingSourceObject: {fileID: 0}
  m_PrefabInstance: {fileID: 0}
  m_PrefabAsset: {fileID: 0}
  m_GameObject: {fileID: 8633073110302300376}
  m_LocalRotation: {x: 0, y: 0, z: 0, w: 1}
  m_LocalPosition: {x: 0, y: 0, z: 0}
  m_LocalScale: {x: 1, y: 1, z: 1}
  m_Children:
  - {fileID: 9162284062670938207}
  m_Father: {fileID: 0}
  m_RootOrder: 0
  m_LocalEulerAnglesHint: {x: 0, y: 0, z: 0}
--- !u!65 &1192530373161958711
BoxCollider:
  m_ObjectHideFlags: 0
  m_CorrespondingSourceObject: {fileID: 0}
  m_PrefabInstance: {fileID: 0}
  m_PrefabAsset: {fileID: 0}
  m_GameObject: {fileID: 8389406087535213285}
  m_Material: {fileID: 0}
  m_IsTrigger: 0
  m_Enabled: 1
  serializedVersion: 2
  m_Size: {x: 16, y: 0, z: 16}
  m_Center: {x: 0, y: 0, z: 0}
--- !u!1001 &8695397216929712052
PrefabInstance:
  m_ObjectHideFlags: 0
  serializedVersion: 2
  m_Modification:
    m_TransformParent: {fileID: 7003369867951830527}
    m_Modifications:
    - target: {fileID: -8679921383154817045, guid: 152c56d5172f1b64fb781135396954e6,
        type: 3}
      propertyPath: m_LocalPosition.x
      value: 0
      objectReference: {fileID: 0}
    - target: {fileID: -8679921383154817045, guid: 152c56d5172f1b64fb781135396954e6,
        type: 3}
      propertyPath: m_LocalPosition.y
      value: 0
      objectReference: {fileID: 0}
    - target: {fileID: -8679921383154817045, guid: 152c56d5172f1b64fb781135396954e6,
        type: 3}
      propertyPath: m_LocalPosition.z
      value: 0
      objectReference: {fileID: 0}
    - target: {fileID: -8679921383154817045, guid: 152c56d5172f1b64fb781135396954e6,
        type: 3}
      propertyPath: m_LocalRotation.x
      value: -0
      objectReference: {fileID: 0}
    - target: {fileID: -8679921383154817045, guid: 152c56d5172f1b64fb781135396954e6,
        type: 3}
      propertyPath: m_LocalRotation.y
      value: -0
      objectReference: {fileID: 0}
    - target: {fileID: -8679921383154817045, guid: 152c56d5172f1b64fb781135396954e6,
        type: 3}
      propertyPath: m_LocalRotation.z
      value: -0
      objectReference: {fileID: 0}
    - target: {fileID: -8679921383154817045, guid: 152c56d5172f1b64fb781135396954e6,
        type: 3}
      propertyPath: m_LocalRotation.w
      value: 1
      objectReference: {fileID: 0}
    - target: {fileID: -8679921383154817045, guid: 152c56d5172f1b64fb781135396954e6,
        type: 3}
      propertyPath: m_RootOrder
      value: 0
      objectReference: {fileID: 0}
    - target: {fileID: -8679921383154817045, guid: 152c56d5172f1b64fb781135396954e6,
        type: 3}
      propertyPath: m_LocalEulerAnglesHint.x
      value: 0
      objectReference: {fileID: 0}
    - target: {fileID: -8679921383154817045, guid: 152c56d5172f1b64fb781135396954e6,
        type: 3}
      propertyPath: m_LocalEulerAnglesHint.y
      value: 0
      objectReference: {fileID: 0}
    - target: {fileID: -8679921383154817045, guid: 152c56d5172f1b64fb781135396954e6,
        type: 3}
      propertyPath: m_LocalEulerAnglesHint.z
      value: 0
      objectReference: {fileID: 0}
    - target: {fileID: 919132149155446097, guid: 152c56d5172f1b64fb781135396954e6,
        type: 3}
      propertyPath: m_Name
      value: Plane_16x16
      objectReference: {fileID: 0}
    m_RemovedComponents: []
  m_SourcePrefab: {fileID: 100100000, guid: 152c56d5172f1b64fb781135396954e6, type: 3}
--- !u!1 &8389406087535213285 stripped
GameObject:
  m_CorrespondingSourceObject: {fileID: 919132149155446097, guid: 152c56d5172f1b64fb781135396954e6,
    type: 3}
  m_PrefabInstance: {fileID: 8695397216929712052}
  m_PrefabAsset: {fileID: 0}
--- !u!4 &9162284062670938207 stripped
Transform:
  m_CorrespondingSourceObject: {fileID: -8679921383154817045, guid: 152c56d5172f1b64fb781135396954e6,
    type: 3}
  m_PrefabInstance: {fileID: 8695397216929712052}
  m_PrefabAsset: {fileID: 0}
