%YAML 1.1
%TAG !u! tag:unity3d.com,2011:
--- !u!114 &11400000
MonoBehaviour:
  m_ObjectHideFlags: 0
  m_CorrespondingSourceObject: {fileID: 0}
  m_PrefabInstance: {fileID: 0}
  m_PrefabAsset: {fileID: 0}
  m_GameObject: {fileID: 0}
  m_Enabled: 1
  m_EditorHideFlags: 0
  m_Script: {fileID: 11500000, guid: db42ea77b5104db198b22d79291dea4e, type: 3}
  m_Name: level_22
  m_EditorClassIdentifier: 
  LevelKey: level_22
  TimeOfLevel:
    Value: 65
  LevelTransferTriggerDataset:
    PositionTrigger:
      X: -16.97
      Y: -0.32
      Z: 38.32
    rotationTriggerTrigger:
      X: -0
      Y: 0
      Z: 0
    ColliderCenter:
      X: 0
      Y: 0
      Z: 0
    ColliderSize:
      X: 9
      Y: 9
      Z: 9
  StarsProgress:
    SnakeLenghtOnLevel: 49
  SpawnEnemySnakeDataset:
  - LenghtTile: 25
    SpeedSnake: 8
    CurrentTarget: 0
    DistanceToChangedTargetPoint: 1
    Points:
    - X: -77.55252
      Y: 19.7146
      Z: 16.802458
    - X: -67.12144
      Y: 19.7146
      Z: 33.005028
    - X: -56.560673
      Y: 19.7146
      Z: 14.973199
  - LenghtTile: 25
    SpeedSnake: 8
    CurrentTarget: 0
    DistanceToChangedTargetPoint: 1
    Points:
    - X: -89.026405
      Y: 19.7146
      Z: 18.270008
    - X: -103.77395
      Y: 19.7146
      Z: 29.38587
    - X: -106.08064
      Y: 19.7146
      Z: 11.226738
  - LenghtTile: 25
    SpeedSnake: 8
    CurrentTarget: 0
    DistanceToChangedTargetPoint: 1
    Points:
    - X: -82.980606
      Y: 13.969175
      Z: 3.2082543
    - X: -65.11894
      Y: 13.969175
      Z: 21.204067
    - X: -83.62199
      Y: 13.969175
      Z: 39.846863
    - X: -100.88294
      Y: 13.969175
      Z: 20.616856
  SpawnerCollectibleObjects: []
  ApplePositions:
  - Position:
      X: -44.24
      Y: 0.63
      Z: 39.19
  - Position:
      X: -48.53
      Y: 3.47
      Z: 45.65
  - Position:
      X: -53.78
      Y: 5.26
      Z: 50.19
  - Position:
      X: -55.38
      Y: 1.66
      Z: 59.84
  - Position:
      X: -60.1
      Y: -0.32
      Z: 64.16
  - Position:
      X: -65.86
      Y: -0.32
      Z: 61.19
  - Position:
      X: -70.52
      Y: -0.32
      Z: 64.44
  - Position:
      X: -76.76
      Y: -0.32
      Z: 62.04
  - Position:
      X: -75.08
      Y: 2.76
      Z: 56.15
  - Position:
      X: -70.48
      Y: 3.56
      Z: 50.78
  - Position:
      X: -69.2
      Y: 6.57
      Z: 43.38
  - Position:
      X: -64.22
      Y: 7.57
      Z: 37.94
  - Position:
      X: -66.12
      Y: 9.17
      Z: 33.18
  - Position:
      X: -72.44
      Y: 11.54
      Z: 32.26
  - Position:
      X: -77.22
      Y: 13.18
      Z: 34.29
  - Position:
      X: -80.25
      Y: 14.01
      Z: 38.09
  - Position:
      X: -84.76
      Y: 12.440001
      Z: 37.72
  - Position:
      X: -86.78
      Y: 10.8
      Z: 31.45
  - Position:
      X: -85.92
      Y: 9.05
      Z: 25.53
  - Position:
      X: -81.94
      Y: 11.43
      Z: 21.89
  - Position:
      X: -76.66
      Y: 13.2
      Z: 21.97
  - Position:
      X: -74.2
      Y: 15.35
      Z: 25.1
  - Position:
      X: -69.56
      Y: 17.06
      Z: 26.34
  - Position:
      X: -66.01
      Y: 18.85
      Z: 23.66
  - Position:
      X: -66.532
      Y: 18.85
      Z: 18.998
  - Position:
      X: -71.33
      Y: 20.39
      Z: 17.06
  - Position:
      X: -75.27
      Y: 22.3
      Z: 21.62
  - Position:
      X: -88.43
      Y: 22.3
      Z: 21.62
  - Position:
      X: -92.77
      Y: 19.64
      Z: 22.74
  - Position:
      X: -97.82
      Y: 18.43
      Z: 25.4
  - Position:
      X: -100.68
      Y: 16.66
      Z: 20.531
  - Position:
      X: -96.07
      Y: 14.8
      Z: 17.46
  - Position:
      X: -92.96
      Y: 12.65
      Z: 13.35
  - Position:
      X: -95.43
      Y: 11.17
      Z: 9.74
  - Position:
      X: -100.38
      Y: 9.79
      Z: 8.51
  - Position:
      X: -100.26
      Y: 7.75
      Z: 1.65
  - Position:
      X: -95.21
      Y: 6.21
      Z: -4.93
  - Position:
      X: -87.59
      Y: 6.92
      Z: -1.6
  - Position:
      X: -82.77
      Y: 5.58
      Z: -6.38
  - Position:
      X: -79.43
      Y: 3.12
      Z: -13.85
  - Position:
      X: -82.59
      Y: 1.72
      Z: -17.83
  - Position:
      X: -94.47
      Y: 1.16
      Z: -17.98
  - Position:
      X: -106.03
      Y: 1.79
      Z: -18.63
  - Position:
      X: -111.16
      Y: 0.72
      Z: -24.99
  - Position:
      X: -117.63999
      Y: -0.13
      Z: -23.039999
  - Position:
      X: -121.09
      Y: 0.71
      Z: -13.69
  - Position:
      X: -128.6
      Y: 0.03
      Z: -11.6
  - Position:
      X: -132.61
      Y: -3.42
      Z: -4.17
  - Position:
      X: -133.18
      Y: -3.6
      Z: 8.040001
  BadApplePositions:
  - Position:
      X: -36.08
      Y: 0.35
      Z: 39.15
  - Position:
      X: -41.98
      Y: 1.31
      Z: 36.77
  - Position:
      X: -45.51
      Y: 3.16
      Z: 44.41
  - Position:
      X: -53.77
      Y: 3.57
      Z: 50.36
  - Position:
      X: -66.27
      Y: 0.39
      Z: 64.12
  - Position:
      X: -75.71
      Y: 0.39
      Z: 65.68
  - Position:
      X: -71.09
      Y: 3.78
      Z: 54.88
  - Position:
      X: -72.38
      Y: 22.34
      Z: 22.9
  - Position:
      X: -61.52
      Y: 7.4
      Z: 35.37
  - Position:
      X: -82.6
      Y: 13.740001
      Z: 40.65
  - Position:
      X: -78.34
      Y: 12.93
      Z: 24.25
  - Position:
      X: -63.7
      Y: 19.71
      Z: 21.41
  - Position:
      X: -91.05
      Y: 14.88
      Z: 16.81
  - Position:
      X: -93.63
      Y: 17.34
      Z: 19.05
  - Position:
      X: -102.3
      Y: 8.16
      Z: -0.94000006
  - Position:
      X: -94.74
      Y: 6.62
      Z: -1.6399997
  - Position:
      X: -88.04
      Y: 7.33
      Z: -4.49
  - Position:
      X: -75.97
      Y: 4.63
      Z: -7.85
  - Position:
      X: -76.11
      Y: 1.85
      Z: -18.21
  - Position:
      X: -87.96
      Y: 3.65
      Z: -18.21
  - Position:
      X: -101.03
      Y: 1.62
      Z: -18.21
  - Position:
      X: -115.6
      Y: 0.31
      Z: -20.6
  - Position:
      X: -137.07
      Y: -2.76
      Z: -3.5699997
  - Position:
      X: -136.77
      Y: -2.76
      Z: 8.050001
  ScopePositions: []
  SkullPositions:
  - Position:
      X: -107.04
      Y: 2.64
      Z: -13.75
  - Position:
      X: -121.93
      Y: -0.42
      Z: -17.8
