%YAML 1.1
%TAG !u! tag:unity3d.com,2011:
--- !u!1 &5564202677059110342
GameObject:
  m_ObjectHideFlags: 0
  m_CorrespondingSourceObject: {fileID: 0}
  m_PrefabInstance: {fileID: 0}
  m_PrefabAsset: {fileID: 0}
  serializedVersion: 6
  m_Component:
  - component: {fileID: 1868606208364804852}
  m_Layer: 0
  m_Name: pr_Plane_4x4
  m_TagString: Untagged
  m_Icon: {fileID: 0}
  m_NavMeshLayer: 0
  m_StaticEditorFlags: 0
  m_IsActive: 1
--- !u!4 &1868606208364804852
Transform:
  m_ObjectHideFlags: 0
  m_CorrespondingSourceObject: {fileID: 0}
  m_PrefabInstance: {fileID: 0}
  m_PrefabAsset: {fileID: 0}
  m_GameObject: {fileID: 5564202677059110342}
  m_LocalRotation: {x: 0, y: 0, z: 0, w: 1}
  m_LocalPosition: {x: 0, y: 0, z: 0}
  m_LocalScale: {x: 1, y: 1, z: 1}
  m_Children:
  - {fileID: 6856054392989225031}
  m_Father: {fileID: 0}
  m_RootOrder: 0
  m_LocalEulerAnglesHint: {x: 0, y: 0, z: 0}
--- !u!65 &1963064534384059113
BoxCollider:
  m_ObjectHideFlags: 0
  m_CorrespondingSourceObject: {fileID: 0}
  m_PrefabInstance: {fileID: 0}
  m_PrefabAsset: {fileID: 0}
  m_GameObject: {fileID: 6083881002140257021}
  m_Material: {fileID: 0}
  m_IsTrigger: 0
  m_Enabled: 1
  serializedVersion: 2
  m_Size: {x: 4, y: 0, z: 4}
  m_Center: {x: 0, y: 0, z: 0}
--- !u!1001 &6390361959671035820
PrefabInstance:
  m_ObjectHideFlags: 0
  serializedVersion: 2
  m_Modification:
    m_TransformParent: {fileID: 1868606208364804852}
    m_Modifications:
    - target: {fileID: -8679921383154817045, guid: b5b7303317380a44e9044f8a17bb85b4,
        type: 3}
      propertyPath: m_LocalPosition.x
      value: 0
      objectReference: {fileID: 0}
    - target: {fileID: -8679921383154817045, guid: b5b7303317380a44e9044f8a17bb85b4,
        type: 3}
      propertyPath: m_LocalPosition.y
      value: 0
      objectReference: {fileID: 0}
    - target: {fileID: -8679921383154817045, guid: b5b7303317380a44e9044f8a17bb85b4,
        type: 3}
      propertyPath: m_LocalPosition.z
      value: 0
      objectReference: {fileID: 0}
    - target: {fileID: -8679921383154817045, guid: b5b7303317380a44e9044f8a17bb85b4,
        type: 3}
      propertyPath: m_LocalRotation.x
      value: -0
      objectReference: {fileID: 0}
    - target: {fileID: -8679921383154817045, guid: b5b7303317380a44e9044f8a17bb85b4,
        type: 3}
      propertyPath: m_LocalRotation.y
      value: -0
      objectReference: {fileID: 0}
    - target: {fileID: -8679921383154817045, guid: b5b7303317380a44e9044f8a17bb85b4,
        type: 3}
      propertyPath: m_LocalRotation.z
      value: -0
      objectReference: {fileID: 0}
    - target: {fileID: -8679921383154817045, guid: b5b7303317380a44e9044f8a17bb85b4,
        type: 3}
      propertyPath: m_LocalRotation.w
      value: 1
      objectReference: {fileID: 0}
    - target: {fileID: -8679921383154817045, guid: b5b7303317380a44e9044f8a17bb85b4,
        type: 3}
      propertyPath: m_RootOrder
      value: 0
      objectReference: {fileID: 0}
    - target: {fileID: -8679921383154817045, guid: b5b7303317380a44e9044f8a17bb85b4,
        type: 3}
      propertyPath: m_LocalEulerAnglesHint.x
      value: 0
      objectReference: {fileID: 0}
    - target: {fileID: -8679921383154817045, guid: b5b7303317380a44e9044f8a17bb85b4,
        type: 3}
      propertyPath: m_LocalEulerAnglesHint.y
      value: 0
      objectReference: {fileID: 0}
    - target: {fileID: -8679921383154817045, guid: b5b7303317380a44e9044f8a17bb85b4,
        type: 3}
      propertyPath: m_LocalEulerAnglesHint.z
      value: 0
      objectReference: {fileID: 0}
    - target: {fileID: 919132149155446097, guid: b5b7303317380a44e9044f8a17bb85b4,
        type: 3}
      propertyPath: m_Name
      value: Plane_4x4
      objectReference: {fileID: 0}
    m_RemovedComponents: []
  m_SourcePrefab: {fileID: 100100000, guid: b5b7303317380a44e9044f8a17bb85b4, type: 3}
--- !u!1 &6083881002140257021 stripped
GameObject:
  m_CorrespondingSourceObject: {fileID: 919132149155446097, guid: b5b7303317380a44e9044f8a17bb85b4,
    type: 3}
  m_PrefabInstance: {fileID: 6390361959671035820}
  m_PrefabAsset: {fileID: 0}
--- !u!4 &6856054392989225031 stripped
Transform:
  m_CorrespondingSourceObject: {fileID: -8679921383154817045, guid: b5b7303317380a44e9044f8a17bb85b4,
    type: 3}
  m_PrefabInstance: {fileID: 6390361959671035820}
  m_PrefabAsset: {fileID: 0}
