%YAML 1.1
%TAG !u! tag:unity3d.com,2011:
--- !u!1001 &2574313510063345574
PrefabInstance:
  m_ObjectHideFlags: 0
  serializedVersion: 2
  m_Modification:
    m_TransformParent: {fileID: 0}
    m_Modifications:
    - target: {fileID: -8679921383154817045, guid: 3a4757753d8c0674cb192e8c8f957ea7,
        type: 3}
      propertyPath: m_LocalPosition.x
      value: 46.835
      objectReference: {fileID: 0}
    - target: {fileID: -8679921383154817045, guid: 3a4757753d8c0674cb192e8c8f957ea7,
        type: 3}
      propertyPath: m_LocalPosition.y
      value: 42.465
      objectReference: {fileID: 0}
    - target: {fileID: -8679921383154817045, guid: 3a4757753d8c0674cb192e8c8f957ea7,
        type: 3}
      propertyPath: m_LocalPosition.z
      value: 66.152
      objectReference: {fileID: 0}
    - target: {fileID: -8679921383154817045, guid: 3a4757753d8c0674cb192e8c8f957ea7,
        type: 3}
      propertyPath: m_LocalRotation.x
      value: 0
      objectReference: {fileID: 0}
    - target: {fileID: -8679921383154817045, guid: 3a4757753d8c0674cb192e8c8f957ea7,
        type: 3}
      propertyPath: m_LocalRotation.y
      value: 0
      objectReference: {fileID: 0}
    - target: {fileID: -8679921383154817045, guid: 3a4757753d8c0674cb192e8c8f957ea7,
        type: 3}
      propertyPath: m_LocalRotation.z
      value: 0
      objectReference: {fileID: 0}
    - target: {fileID: -8679921383154817045, guid: 3a4757753d8c0674cb192e8c8f957ea7,
        type: 3}
      propertyPath: m_LocalRotation.w
      value: 1
      objectReference: {fileID: 0}
    - target: {fileID: -8679921383154817045, guid: 3a4757753d8c0674cb192e8c8f957ea7,
        type: 3}
      propertyPath: m_RootOrder
      value: 0
      objectReference: {fileID: 0}
    - target: {fileID: -8679921383154817045, guid: 3a4757753d8c0674cb192e8c8f957ea7,
        type: 3}
      propertyPath: m_LocalEulerAnglesHint.x
      value: 0
      objectReference: {fileID: 0}
    - target: {fileID: -8679921383154817045, guid: 3a4757753d8c0674cb192e8c8f957ea7,
        type: 3}
      propertyPath: m_LocalEulerAnglesHint.y
      value: 0
      objectReference: {fileID: 0}
    - target: {fileID: -8679921383154817045, guid: 3a4757753d8c0674cb192e8c8f957ea7,
        type: 3}
      propertyPath: m_LocalEulerAnglesHint.z
      value: 0
      objectReference: {fileID: 0}
    - target: {fileID: -8679921383154817045, guid: 3a4757753d8c0674cb192e8c8f957ea7,
        type: 3}
      propertyPath: m_LocalScale.z
      value: 1.2505426
      objectReference: {fileID: 0}
    - target: {fileID: -8679921383154817045, guid: 3a4757753d8c0674cb192e8c8f957ea7,
        type: 3}
      propertyPath: m_LocalScale.x
      value: 1.0207545
      objectReference: {fileID: 0}
    - target: {fileID: 919132149155446097, guid: 3a4757753d8c0674cb192e8c8f957ea7,
        type: 3}
      propertyPath: m_Name
      value: box_2 (7)
      objectReference: {fileID: 0}
    m_RemovedComponents: []
  m_SourcePrefab: {fileID: 100100000, guid: 3a4757753d8c0674cb192e8c8f957ea7, type: 3}
