%YAML 1.1
%TAG !u! tag:unity3d.com,2011:
--- !u!114 &11400000
MonoBehaviour:
  m_ObjectHideFlags: 0
  m_CorrespondingSourceObject: {fileID: 0}
  m_PrefabInstance: {fileID: 0}
  m_PrefabAsset: {fileID: 0}
  m_GameObject: {fileID: 0}
  m_Enabled: 1
  m_EditorHideFlags: 0
  m_Script: {fileID: 11500000, guid: db42ea77b5104db198b22d79291dea4e, type: 3}
  m_Name: level_9
  m_EditorClassIdentifier: 
  LevelKey: level_9
  TimeOfLevel:
    Value: 45
  LevelTransferTriggerDataset:
    PositionTrigger:
      X: 23.71
      Y: 26.38
      Z: -15.69
    rotationTriggerTrigger:
      X: -0
      Y: 0
      Z: 0
    ColliderCenter:
      X: 0
      Y: 0
      Z: 0
    ColliderSize:
      X: 9
      Y: 9
      Z: 3
  StarsProgress:
    SnakeLenghtOnLevel: 20
  SpawnEnemySnakeDataset:
  - LenghtTile: 15
    SpeedSnake: 5.5
    CurrentTarget: 0
    DistanceToChangedTargetPoint: 1
    Points:
    - X: 14.829592
      Y: 27
      Z: 7.5196857
    - X: 15.087748
      Y: 27
      Z: 14.667242
    - X: 20.039236
      Y: 27
      Z: 20.644745
    - X: 30.807138
      Y: 27
      Z: 18.919384
    - X: 35.18677
      Y: 27
      Z: 10.303298
    - X: 30.574934
      Y: 27
      Z: 2.9969368
    - X: 21.594059
      Y: 27
      Z: 1.2620041
  - LenghtTile: 10
    SpeedSnake: 5
    CurrentTarget: 0
    DistanceToChangedTargetPoint: 1
    Points:
    - X: 17.016388
      Y: 3
      Z: 9.51732
    - X: 18.629818
      Y: 3
      Z: 15.211578
    - X: 23.94596
      Y: 3
      Z: 17.775454
    - X: 29.341217
      Y: 3
      Z: 15.774066
    - X: 31.806017
      Y: 3
      Z: 10.731028
    - X: 28.688301
      Y: 3
      Z: 5.3720865
    - X: 21.347536
      Y: 3
      Z: 4.9910574
  - LenghtTile: 15
    SpeedSnake: 5.5
    CurrentTarget: 0
    DistanceToChangedTargetPoint: 1
    Points:
    - X: 14.889699
      Y: 13
      Z: 5.0924025
    - X: 14.593539
      Y: 13
      Z: 13.268597
    - X: 18.202862
      Y: 13
      Z: 22.824003
    - X: 29.88287
      Y: 13
      Z: 21.077072
    - X: 36.635548
      Y: 13
      Z: 16.60049
    - X: 36.932392
      Y: 13
      Z: 7.321777
    - X: 29.879023
      Y: 13
      Z: -0.31087947
    - X: 20.246807
      Y: 13
      Z: -1.4646252
  SpawnerCollectibleObjects: []
  ApplePositions:
  - Position:
      X: 12.17
      Y: 13.09
      Z: 8.98
  - Position:
      X: 21.55
      Y: 25.21
      Z: 14.72
  - Position:
      X: 12.17
      Y: 13.09
      Z: 15.56
  - Position:
      X: 27.49
      Y: 19.29
      Z: 23.26
  - Position:
      X: 35.65
      Y: 15.02
      Z: 10.23
  - Position:
      X: 32.88
      Y: 14.16
      Z: 5.09
  - Position:
      X: 21.95
      Y: 21.97
      Z: 19.95
  - Position:
      X: 10.26
      Y: 13.78
      Z: 25.64
  - Position:
      X: 18.58
      Y: 4.614219
      Z: 2.12
  - Position:
      X: 28.96
      Y: 8.39
      Z: 25.35
  - Position:
      X: 32.28
      Y: 17.26
      Z: 21.08
  - Position:
      X: 37.8
      Y: 5.22
      Z: 23.71
  - Position:
      X: 10.02
      Y: 13.42
      Z: -2.08
  - Position:
      X: 25.98
      Y: 4.614219
      Z: -2.556
  - Position:
      X: 34.87
      Y: 15.81
      Z: 16.59
  - Position:
      X: 38.013
      Y: 4.614219
      Z: -2.556
  - Position:
      X: 14.33
      Y: 4.614219
      Z: 6.17
  - Position:
      X: 24.68
      Y: 13.42
      Z: -1.12
  - Position:
      X: 28.88
      Y: 13.5
      Z: 1.35
  - Position:
      X: 35.27
      Y: 4.614219
      Z: 11.77
  BadApplePositions:
  - Position:
      X: 21.24
      Y: 13.89
      Z: -4.11
  - Position:
      X: 40.22
      Y: 5.0307736
      Z: 9.35
  - Position:
      X: 21.5
      Y: 11.73
      Z: 26.47
  - Position:
      X: 6.99
      Y: 13.27
      Z: 12.56
  - Position:
      X: 20.67
      Y: 28.45
      Z: 4.84
  - Position:
      X: 29.26514
      Y: 32.331154
      Z: 7.1130905
  - Position:
      X: 23.404284
      Y: 32.331154
      Z: 18.221794
  - Position:
      X: 33.6
      Y: 5.0307736
      Z: 17.95
  - Position:
      X: 18.084335
      Y: 32.331154
      Z: 7.067359
  - Position:
      X: 29.85
      Y: 5.0307736
      Z: 3.97
  - Position:
      X: 19.7
      Y: 28.45
      Z: 17.16
  - Position:
      X: 38.32
      Y: 13.27
      Z: -3
  - Position:
      X: 21.65
      Y: 5.0307736
      Z: 17.77
  - Position:
      X: 30.33
      Y: 28.45
      Z: 10.47
  ScopePositions: []
  SkullPositions:
  - Position:
      X: 16.92
      Y: 27.888845
      Z: 10.59
  - Position:
      X: 17.711735
      Y: 31.77
      Z: 13.922005
  - Position:
      X: 28.28
      Y: 27.888845
      Z: 4.23
  - Position:
      X: 30.103565
      Y: 31.77
      Z: 14.065294
  - Position:
      X: 24.369793
      Y: 31.77
      Z: 2.734088
  - Position:
      X: 27.58
      Y: 27.888845
      Z: 16.91
