%YAML 1.1
%TAG !u! tag:unity3d.com,2011:
--- !u!1001 &3395198621983520795
PrefabInstance:
  m_ObjectHideFlags: 0
  serializedVersion: 2
  m_Modification:
    m_TransformParent: {fileID: 0}
    m_Modifications:
    - target: {fileID: 1705689381187392080, guid: db0b086d1d1913241a752bf2a5100a19,
        type: 3}
      propertyPath: m_Mesh
      value: 
      objectReference: {fileID: 0}
    - target: {fileID: 1740137050091446971, guid: db0b086d1d1913241a752bf2a5100a19,
        type: 3}
      propertyPath: m_Mesh
      value: 
      objectReference: {fileID: 0}
    - target: {fileID: 2312367696210832241, guid: db0b086d1d1913241a752bf2a5100a19,
        type: 3}
      propertyPath: m_Materials.Array.data[0]
      value: 
      objectReference: {fileID: 2100000, guid: 584d6a7e94ffed540b561967b784b8aa, type: 2}
    - target: {fileID: 3507695046555830352, guid: db0b086d1d1913241a752bf2a5100a19,
        type: 3}
      propertyPath: m_LocalPosition.x
      value: -125.645645
      objectReference: {fileID: 0}
    - target: {fileID: 3507695046555830352, guid: db0b086d1d1913241a752bf2a5100a19,
        type: 3}
      propertyPath: m_LocalPosition.y
      value: -3.5299075
      objectReference: {fileID: 0}
    - target: {fileID: 3507695046555830352, guid: db0b086d1d1913241a752bf2a5100a19,
        type: 3}
      propertyPath: m_LocalPosition.z
      value: -8.075521
      objectReference: {fileID: 0}
    - target: {fileID: 3507695046555830352, guid: db0b086d1d1913241a752bf2a5100a19,
        type: 3}
      propertyPath: m_LocalRotation.x
      value: 0
      objectReference: {fileID: 0}
    - target: {fileID: 3507695046555830352, guid: db0b086d1d1913241a752bf2a5100a19,
        type: 3}
      propertyPath: m_LocalRotation.y
      value: 0
      objectReference: {fileID: 0}
    - target: {fileID: 3507695046555830352, guid: db0b086d1d1913241a752bf2a5100a19,
        type: 3}
      propertyPath: m_LocalRotation.z
      value: 0
      objectReference: {fileID: 0}
    - target: {fileID: 3507695046555830352, guid: db0b086d1d1913241a752bf2a5100a19,
        type: 3}
      propertyPath: m_LocalRotation.w
      value: 1
      objectReference: {fileID: 0}
    - target: {fileID: 3507695046555830352, guid: db0b086d1d1913241a752bf2a5100a19,
        type: 3}
      propertyPath: m_RootOrder
      value: 0
      objectReference: {fileID: 0}
    - target: {fileID: 3507695046555830352, guid: db0b086d1d1913241a752bf2a5100a19,
        type: 3}
      propertyPath: m_LocalEulerAnglesHint.x
      value: 0
      objectReference: {fileID: 0}
    - target: {fileID: 3507695046555830352, guid: db0b086d1d1913241a752bf2a5100a19,
        type: 3}
      propertyPath: m_LocalEulerAnglesHint.y
      value: 0
      objectReference: {fileID: 0}
    - target: {fileID: 3507695046555830352, guid: db0b086d1d1913241a752bf2a5100a19,
        type: 3}
      propertyPath: m_LocalEulerAnglesHint.z
      value: 0
      objectReference: {fileID: 0}
    - target: {fileID: 6612808320000013595, guid: db0b086d1d1913241a752bf2a5100a19,
        type: 3}
      propertyPath: m_Mesh
      value: 
      objectReference: {fileID: 0}
    - target: {fileID: 8894713926952580484, guid: db0b086d1d1913241a752bf2a5100a19,
        type: 3}
      propertyPath: m_Name
      value: pr_box_10x10_rock
      objectReference: {fileID: 0}
    m_RemovedComponents: []
  m_SourcePrefab: {fileID: 100100000, guid: db0b086d1d1913241a752bf2a5100a19, type: 3}
