%YAML 1.1
%TAG !u! tag:unity3d.com,2011:
--- !u!1001 &7721307896015482320
PrefabInstance:
  m_ObjectHideFlags: 0
  serializedVersion: 2
  m_Modification:
    m_TransformParent: {fileID: 0}
    m_Modifications:
    - target: {fileID: 8525361657671571908, guid: 87e6eb3abd0fc9c4f803a1693989d454,
        type: 3}
      propertyPath: m_Name
      value: pr_box_34x10_stone
      objectReference: {fileID: 0}
    - target: {fileID: 8863963086223536472, guid: 87e6eb3abd0fc9c4f803a1693989d454,
        type: 3}
      propertyPath: m_LocalPosition.x
      value: 0
      objectReference: {fileID: 0}
    - target: {fileID: 8863963086223536472, guid: 87e6eb3abd0fc9c4f803a1693989d454,
        type: 3}
      propertyPath: m_LocalPosition.y
      value: 0
      objectReference: {fileID: 0}
    - target: {fileID: 8863963086223536472, guid: 87e6eb3abd0fc9c4f803a1693989d454,
        type: 3}
      propertyPath: m_LocalPosition.z
      value: 0
      objectReference: {fileID: 0}
    - target: {fileID: 8863963086223536472, guid: 87e6eb3abd0fc9c4f803a1693989d454,
        type: 3}
      propertyPath: m_LocalRotation.x
      value: 0
      objectReference: {fileID: 0}
    - target: {fileID: 8863963086223536472, guid: 87e6eb3abd0fc9c4f803a1693989d454,
        type: 3}
      propertyPath: m_LocalRotation.y
      value: 0
      objectReference: {fileID: 0}
    - target: {fileID: 8863963086223536472, guid: 87e6eb3abd0fc9c4f803a1693989d454,
        type: 3}
      propertyPath: m_LocalRotation.z
      value: 0
      objectReference: {fileID: 0}
    - target: {fileID: 8863963086223536472, guid: 87e6eb3abd0fc9c4f803a1693989d454,
        type: 3}
      propertyPath: m_LocalRotation.w
      value: 1
      objectReference: {fileID: 0}
    - target: {fileID: 8863963086223536472, guid: 87e6eb3abd0fc9c4f803a1693989d454,
        type: 3}
      propertyPath: m_RootOrder
      value: 0
      objectReference: {fileID: 0}
    - target: {fileID: 8863963086223536472, guid: 87e6eb3abd0fc9c4f803a1693989d454,
        type: 3}
      propertyPath: m_LocalEulerAnglesHint.x
      value: 0
      objectReference: {fileID: 0}
    - target: {fileID: 8863963086223536472, guid: 87e6eb3abd0fc9c4f803a1693989d454,
        type: 3}
      propertyPath: m_LocalEulerAnglesHint.y
      value: 0
      objectReference: {fileID: 0}
    - target: {fileID: 8863963086223536472, guid: 87e6eb3abd0fc9c4f803a1693989d454,
        type: 3}
      propertyPath: m_LocalEulerAnglesHint.z
      value: 0
      objectReference: {fileID: 0}
    m_RemovedComponents: []
  m_SourcePrefab: {fileID: 100100000, guid: 87e6eb3abd0fc9c4f803a1693989d454, type: 3}
