%YAML 1.1
%TAG !u! tag:unity3d.com,2011:
--- !u!114 &11400000
MonoBehaviour:
  m_ObjectHideFlags: 0
  m_CorrespondingSourceObject: {fileID: 0}
  m_PrefabInstance: {fileID: 0}
  m_PrefabAsset: {fileID: 0}
  m_GameObject: {fileID: 0}
  m_Enabled: 1
  m_EditorHideFlags: 0
  m_Script: {fileID: 11500000, guid: db42ea77b5104db198b22d79291dea4e, type: 3}
  m_Name: level_18
  m_EditorClassIdentifier: 
  LevelKey: level_18
  TimeOfLevel:
    Value: 65
  LevelTransferTriggerDataset:
    PositionTrigger:
      X: 5.29
      Y: 21.09
      Z: 132.48
    rotationTriggerTrigger:
      X: -0
      Y: 0
      Z: 0
    ColliderCenter:
      X: 0
      Y: 0
      Z: 0
    ColliderSize:
      X: 9
      Y: 9
      Z: 9
  StarsProgress:
    SnakeLenghtOnLevel: 60
  SpawnEnemySnakeDataset:
  - LenghtTile: 25
    SpeedSnake: 8
    CurrentTarget: 0
    DistanceToChangedTargetPoint: 1
    Points:
    - X: 5
      Y: 14
      Z: 14
  - LenghtTile: 25
    SpeedSnake: 8
    CurrentTarget: 0
    DistanceToChangedTargetPoint: 1
    Points:
    - X: 5
      Y: 14
      Z: 90
  - LenghtTile: 25
    SpeedSnake: 8
    CurrentTarget: 0
    DistanceToChangedTargetPoint: 1
    Points:
    - X: 5
      Y: 14
      Z: 111
  - LenghtTile: 25
    SpeedSnake: 8
    CurrentTarget: 0
    DistanceToChangedTargetPoint: 1
    Points:
    - X: 5
      Y: 14
      Z: 51
  SpawnerCollectibleObjects: []
  ApplePositions:
  - Position:
      X: -8.23
      Y: 6.36
      Z: 85.36
  - Position:
      X: 6.49
      Y: 16.6
      Z: 66.04
  - Position:
      X: 11.21
      Y: 17.88
      Z: 66.05
  - Position:
      X: 5.6
      Y: 16.6
      Z: 78.89
  - Position:
      X: 9.69
      Y: 18.52
      Z: 82.25
  - Position:
      X: -13.33
      Y: 4.75
      Z: 88.82
  - Position:
      X: -12.26
      Y: 2.32
      Z: 95.76
  - Position:
      X: 9.97
      Y: 22.01
      Z: 53.6
  - Position:
      X: 16.3
      Y: 4.43
      Z: 11.35
  - Position:
      X: 2.47
      Y: 23.54
      Z: 41.73
  - Position:
      X: -5.19
      Y: 21.24
      Z: 2.67
  - Position:
      X: -4.610001
      Y: 2.41
      Z: 7.68
  - Position:
      X: 3.01
      Y: 3.71
      Z: 96.89
  - Position:
      X: 9.66
      Y: 17.53
      Z: 87.73
  - Position:
      X: 1.9
      Y: 16.6
      Z: 68.79
  - Position:
      X: 4.93
      Y: 13.42
      Z: 111.15
  - Position:
      X: 6.48
      Y: 15.49
      Z: 20.83
  - Position:
      X: 14.68
      Y: 18.84
      Z: 61.7
  - Position:
      X: 5.42
      Y: 12.35
      Z: 50.89
  - Position:
      X: 4.94
      Y: 11.06
      Z: 90.5
  - Position:
      X: -4.87
      Y: 8.86
      Z: 44.18
  - Position:
      X: -0.88
      Y: 19.28
      Z: 6.35
  - Position:
      X: -12.4
      Y: 2.41
      Z: 20.18
  - Position:
      X: 2.01
      Y: 25.47
      Z: 46.94
  - Position:
      X: 5.01
      Y: 22.38
      Z: -3.39
  - Position:
      X: 0.73
      Y: 9.14
      Z: 52.07
  - Position:
      X: 1.34
      Y: 16.6
      Z: 74.12
  - Position:
      X: 0.92
      Y: 4.96
      Z: 26.34
  - Position:
      X: 7.1
      Y: 5.59
      Z: 100.25
  - Position:
      X: -11.9
      Y: 2.41
      Z: 10.79
  - Position:
      X: 0.6699991
      Y: 2.41
      Z: 8.88
  - Position:
      X: -4.06
      Y: 20.03
      Z: 20.37
  - Position:
      X: 10.87
      Y: 19.13
      Z: 42.75
  - Position:
      X: -2.91
      Y: 3.79
      Z: 22.8
  - Position:
      X: 7.69
      Y: 8.76
      Z: 16.67
  - Position:
      X: 10.4
      Y: 19.75
      Z: 6.02
  - Position:
      X: 14.18
      Y: 20.27
      Z: 56.57
  - Position:
      X: -3.21
      Y: 7.25
      Z: 87.13
  - Position:
      X: 12.78
      Y: 18.15
      Z: 10.66
  - Position:
      X: 10.41
      Y: 16.71
      Z: 16.01
  - Position:
      X: 1.3
      Y: 7.79
      Z: 36.51
  - Position:
      X: 5.83
      Y: 23.6
      Z: 51.05
  - Position:
      X: 12.95
      Y: 6.23
      Z: 15.47
  - Position:
      X: 5.33
      Y: 0.96
      Z: 4.67
  - Position:
      X: 14.47
      Y: 3.48
      Z: 6.54
  - Position:
      X: 0.75
      Y: 8.9
      Z: 89.38
  - Position:
      X: 7.89
      Y: 21.47
      Z: 1.59
  - Position:
      X: -10.77
      Y: 23.3
      Z: 2.77
  - Position:
      X: 6.87
      Y: 21.24
      Z: 38.95
  - Position:
      X: -2.43
      Y: 2.13
      Z: 97.28
  - Position:
      X: -14.31
      Y: 26.45
      Z: 10.3
  - Position:
      X: 0.5
      Y: 17.24
      Z: 23.68
  - Position:
      X: -8.31
      Y: 2.41
      Z: 23.03
  - Position:
      X: 9.65
      Y: 15.7
      Z: 47.76
  - Position:
      X: -8.1
      Y: 0.89
      Z: 100.02
  - Position:
      X: 3.41
      Y: 6.13
      Z: 31.45
  - Position:
      X: -2.18
      Y: 9.67
      Z: 40.16
  - Position:
      X: -9.24
      Y: 23.13
      Z: 15.8
  - Position:
      X: 10.97
      Y: 2.45
      Z: 3.18
  - Position:
      X: -3.14
      Y: 7.44
      Z: 49.06
  BadApplePositions:
  - Position:
      X: 10.81
      Y: 2.86
      Z: 5.83
  - Position:
      X: -11.584
      Y: 2.86
      Z: 15.46
  - Position:
      X: -4.98
      Y: 2.86
      Z: 10.609999
  - Position:
      X: 0.3
      Y: 2.86
      Z: 6.06
  ScopePositions: []
  SkullPositions: []
