%YAML 1.1
%TAG !u! tag:unity3d.com,2011:
--- !u!114 &11400000
MonoBehaviour:
  m_ObjectHideFlags: 0
  m_CorrespondingSourceObject: {fileID: 0}
  m_PrefabInstance: {fileID: 0}
  m_PrefabAsset: {fileID: 0}
  m_GameObject: {fileID: 0}
  m_Enabled: 1
  m_EditorHideFlags: 0
  m_Script: {fileID: 11500000, guid: db42ea77b5104db198b22d79291dea4e, type: 3}
  m_Name: level_48
  m_EditorClassIdentifier: 
  LevelKey: level_48
  TimeOfLevel:
    Value: 60
  LevelTransferTriggerDataset:
    PositionTrigger:
      X: 28.977678
      Y: 8.09
      Z: 68.38
    rotationTriggerTrigger:
      X: -0
      Y: 0
      Z: 0
    ColliderCenter:
      X: 0
      Y: 0
      Z: 0
    ColliderSize:
      X: 9
      Y: 9
      Z: 9
  StarsProgress:
    SnakeLenghtOnLevel: 55
  SpawnEnemySnakeDataset:
  - LenghtTile: 40
    SpeedSnake: 8
    CurrentTarget: 0
    DistanceToChangedTargetPoint: 1
    Points:
    - X: 41.691917
      Y: 1.0197983
      Z: 12.781149
    - X: 24.366556
      Y: 4.3532677
      Z: 26.392456
    - X: 10.720681
      Y: 5.986249
      Z: 13.099545
    - X: 24.970745
      Y: 5.2244964
      Z: 0.95875096
  - LenghtTile: 40
    SpeedSnake: 8
    CurrentTarget: 0
    DistanceToChangedTargetPoint: 1
    Points:
    - X: 54.145416
      Y: 8.098351
      Z: 12.781149
    - X: 41.63738
      Y: 6.1230927
      Z: 26.276115
    - X: 28.978453
      Y: 3.6710186
      Z: 12.05504
    - X: 43.121155
      Y: 7.2243943
      Z: -1.2676489
  - LenghtTile: 25
    SpeedSnake: 8
    CurrentTarget: 0
    DistanceToChangedTargetPoint: 1
    Points:
    - X: 51.485237
      Y: 21.661686
      Z: -4.40813
  - LenghtTile: 25
    SpeedSnake: 8
    CurrentTarget: 0
    DistanceToChangedTargetPoint: 1
    Points:
    - X: 50.310246
      Y: 25.491745
      Z: -7.401679
  - LenghtTile: 40
    SpeedSnake: 8
    CurrentTarget: 0
    DistanceToChangedTargetPoint: 1
    Points:
    - X: 8.215593
      Y: 15.412306
      Z: 15.146674
    - X: 18.788097
      Y: 20.190834
      Z: 27.79981
    - X: 31.833559
      Y: 20.533833
      Z: 15.25099
    - X: 22.193594
      Y: 17.464426
      Z: 0.6086113
  - LenghtTile: 25
    SpeedSnake: 8
    CurrentTarget: 0
    DistanceToChangedTargetPoint: 1
    Points:
    - X: 1.6703781
      Y: 23.190895
      Z: 12.465613
  - LenghtTile: 25
    SpeedSnake: 8
    CurrentTarget: 0
    DistanceToChangedTargetPoint: 1
    Points:
    - X: -1.3296219
      Y: 20.190895
      Z: 12.465613
  - LenghtTile: 40
    SpeedSnake: 8
    CurrentTarget: 0
    DistanceToChangedTargetPoint: 1
    Points:
    - X: 55.296482
      Y: 13.15497
      Z: 12.873097
    - X: 42.806404
      Y: 18.027008
      Z: 28.840738
    - X: 25.054256
      Y: 19.883102
      Z: 12.047793
    - X: 42.63903
      Y: 15.613306
      Z: -1.5369455
  - LenghtTile: 40
    SpeedSnake: 8
    CurrentTarget: 0
    DistanceToChangedTargetPoint: 1
    Points:
    - X: 14.502236
      Y: 10.156759
      Z: 13.243596
    - X: 29.46564
      Y: 14.320745
      Z: 31.514687
    - X: 44.32698
      Y: 15.217236
      Z: 13.558975
    - X: 24.85684
      Y: 12.017026
      Z: 0.56794256
  SpawnerCollectibleObjects: []
  ApplePositions:
  - Position:
      X: 28.67
      Y: 7.14
      Z: 49.52
  - Position:
      X: 25.96
      Y: 4.734
      Z: 44.77
  - Position:
      X: 28.55
      Y: 2.09
      Z: 41.23
  - Position:
      X: 33.68
      Y: 0.7
      Z: 40.6
  - Position:
      X: 37.71
      Y: 3.9
      Z: 37.05
  - Position:
      X: 36.15
      Y: 6.43
      Z: 32.72
  - Position:
      X: 31.06
      Y: 8.56
      Z: 33.01
  - Position:
      X: 27.98
      Y: 10.52
      Z: 28.98
  - Position:
      X: 29.56
      Y: 10.52
      Z: 23.33
  - Position:
      X: 33.98
      Y: 7.73
      Z: 20.38
  - Position:
      X: 36.93
      Y: 4.95
      Z: 17.58
  - Position:
      X: 41.69
      Y: 3.7
      Z: 6.88
  - Position:
      X: 45.98
      Y: 3.93
      Z: 11.62
  - Position:
      X: 50.85
      Y: 2.66
      Z: 12.77
  - Position:
      X: 55.97
      Y: 4.99
      Z: 10.73
  - Position:
      X: 60.89
      Y: 7.6
      Z: 10.36
  - Position:
      X: 63.72
      Y: 9.65
      Z: 4.88
  - Position:
      X: 59.93
      Y: 11.71
      Z: 1.31
  - Position:
      X: 55.54
      Y: 14.14
      Z: 2.33
  - Position:
      X: 51.53
      Y: 16.27
      Z: 0
  - Position:
      X: 47.67
      Y: 30.6
      Z: -9.7
  - Position:
      X: 45.45
      Y: 33.94
      Z: -11.85
  - Position:
      X: 40.87
      Y: 35.32
      Z: -16.25
  - Position:
      X: 37.68
      Y: 31.48
      Z: -20.62
  - Position:
      X: 33.629997
      Y: 28.31
      Z: -22.5
  - Position:
      X: 29.97
      Y: 25.41
      Z: -19.77
  - Position:
      X: 30.22
      Y: 22.42
      Z: -15.15
  - Position:
      X: 33.98
      Y: 20.060001
      Z: -12.1
  - Position:
      X: 33.68
      Y: 17.49
      Z: -6.99
  - Position:
      X: 28.86
      Y: 16.02
      Z: -4.15
  - Position:
      X: 26.78
      Y: 14.79
      Z: 1.04
  - Position:
      X: 29.34
      Y: 13.4
      Z: 6.5
  - Position:
      X: 28.51
      Y: 15.21
      Z: 11.42
  - Position:
      X: 24.78
      Y: 16.66
      Z: 15.85
  - Position:
      X: 19.7
      Y: 18.63
      Z: 15.42
  - Position:
      X: 16.77
      Y: 19.33
      Z: 20.29
  - Position:
      X: 19.42
      Y: 21.61
      Z: 24.61
  - Position:
      X: 18.75
      Y: 24.67
      Z: 29.86
  - Position:
      X: 14.35
      Y: 28.25
      Z: 31.87
  - Position:
      X: 10.81
      Y: 32.029
      Z: 28.54
  - Position:
      X: 9.07
      Y: 33.18
      Z: 23.04
  - Position:
      X: 9.93
      Y: 30.95
      Z: 17.39
  - Position:
      X: 6.77
      Y: 27.52
      Z: 12.53
  - Position:
      X: -1.25
      Y: 19.57
      Z: 12.25
  - Position:
      X: -6.2
      Y: 15.31
      Z: 11.1
  - Position:
      X: -10.3
      Y: 13.12
      Z: 7.3
  - Position:
      X: -12.89
      Y: 15.65
      Z: 3.51
  - Position:
      X: -9.92
      Y: 18.03
      Z: -1.18
  - Position:
      X: -6.49
      Y: 16.12
      Z: -4.21
  - Position:
      X: -1.8
      Y: 13.5
      Z: -5.37
  - Position:
      X: 3.44
      Y: 11.46
      Z: -1.33
  - Position:
      X: 3.32
      Y: 8.56
      Z: 3.31
  - Position:
      X: 10.76
      Y: 3.83
      Z: 1.65
  - Position:
      X: 7.71
      Y: 6.2
      Z: 5.77
  - Position:
      X: 7.2
      Y: 1.86
      Z: -2.74
  BadApplePositions:
  - Position:
      X: 28.137
      Y: 5.302
      Z: 45.27
  - Position:
      X: 34.39
      Y: 7.5
      Z: 34.53
  - Position:
      X: 37.38
      Y: 6.28
      Z: 20.89
  - Position:
      X: 44.29
      Y: 4.6
      Z: 13.99
  - Position:
      X: 61.74
      Y: 10
      Z: 5.62
  - Position:
      X: 41.35
      Y: 33.95
      Z: -15.93
  - Position:
      X: 32.12
      Y: 17.83
      Z: -8.74
  - Position:
      X: 24.68
      Y: 17.39
      Z: 13.63
  - Position:
      X: 18.650002
      Y: 19.89
      Z: 20.36
  - Position:
      X: -2.03
      Y: 14.132
      Z: -3.15
  - Position:
      X: 1.18
      Y: 11.79
      Z: -1.29
  - Position:
      X: 8.7
      Y: 4.37
      Z: 1.63
  ScopePositions: []
  SkullPositions: []
