%YAML 1.1
%TAG !u! tag:unity3d.com,2011:
--- !u!114 &11400000
MonoBehaviour:
  m_ObjectHideFlags: 0
  m_CorrespondingSourceObject: {fileID: 0}
  m_PrefabInstance: {fileID: 0}
  m_PrefabAsset: {fileID: 0}
  m_GameObject: {fileID: 0}
  m_Enabled: 1
  m_EditorHideFlags: 0
  m_Script: {fileID: 11500000, guid: db42ea77b5104db198b22d79291dea4e, type: 3}
  m_Name: level_36
  m_EditorClassIdentifier: 
  LevelKey: level_36
  TimeOfLevel:
    Value: 62
  LevelTransferTriggerDataset:
    PositionTrigger:
      X: 5.82
      Y: 3.77
      Z: 255.71
    rotationTriggerTrigger:
      X: -0
      Y: 0
      Z: 0
    ColliderCenter:
      X: 0
      Y: 0
      Z: 0
    ColliderSize:
      X: 9
      Y: 9
      Z: 9
  StarsProgress:
    SnakeLenghtOnLevel: 57
  SpawnEnemySnakeDataset:
  - LenghtTile: 30
    SpeedSnake: 9
    CurrentTarget: 0
    DistanceToChangedTargetPoint: 1
    Points:
    - X: 12.883934
      Y: 5.0179152
      Z: 214.3213
  - LenghtTile: 30
    SpeedSnake: 9
    CurrentTarget: 0
    DistanceToChangedTargetPoint: 1
    Points:
    - X: -1.7454826
      Y: 5.9283175
      Z: 19.262295
  - LenghtTile: 30
    SpeedSnake: 9
    CurrentTarget: 0
    DistanceToChangedTargetPoint: 1
    Points:
    - X: 12.247615
      Y: 5.5735674
      Z: 74.69714
  SpawnerCollectibleObjects: []
  ApplePositions:
  - Position:
      X: 17.15
      Y: 10.297
      Z: 168.35
  - Position:
      X: -6.12
      Y: 8.379
      Z: 17.99
  - Position:
      X: 10.86
      Y: 2.26
      Z: 87.75001
  - Position:
      X: 11.54
      Y: 1.87
      Z: 222.98
  - Position:
      X: -2.8
      Y: 5.4
      Z: 7.83
  - Position:
      X: 2.49
      Y: 3.64
      Z: 7.54
  - Position:
      X: 8.83
      Y: 1.56
      Z: 82.25
  - Position:
      X: 16.971
      Y: 6.32
      Z: 213.09
  - Position:
      X: -1.04
      Y: 3.77
      Z: 130.67
  - Position:
      X: 17.73
      Y: 5.58
      Z: 63.56
  - Position:
      X: 12.61
      Y: 2.95
      Z: 62.36
  - Position:
      X: -2.28
      Y: 6.4
      Z: 140.04
  - Position:
      X: 7.36
      Y: 1.76
      Z: 61.56
  - Position:
      X: 0.99999994
      Y: 0.64
      Z: 21.939999
  - Position:
      X: 20.78
      Y: 8.07
      Z: 163.39
  - Position:
      X: 18.73
      Y: 8.16
      Z: 69.07
  - Position:
      X: 7.7299995
      Y: 3.29
      Z: 92.810005
  - Position:
      X: 5.66
      Y: 5.67
      Z: 130.38
  - Position:
      X: -4.55
      Y: 5.28
      Z: 134.83
  - Position:
      X: 9.96
      Y: 0.86
      Z: 190.84
  - Position:
      X: -2.33
      Y: 5.2
      Z: 18.69
  - Position:
      X: 7.44
      Y: 2.68
      Z: 196.82
  - Position:
      X: -8.45
      Y: 9
      Z: 14.63
  - Position:
      X: 3.5300002
      Y: 0.79
      Z: 56.83
  - Position:
      X: 4.1
      Y: 8.53
      Z: 141.92
  - Position:
      X: 10.28
      Y: 3.3300002
      Z: 236.26
  - Position:
      X: 9.03
      Y: 11.35
      Z: 157.66
  - Position:
      X: 7.79
      Y: 0.92
      Z: 167.65
  - Position:
      X: 17.05
      Y: 6.03
      Z: 203.55
  - Position:
      X: 16.22
      Y: 4.74
      Z: 159.07
  - Position:
      X: -0.36000013
      Y: 3.5
      Z: 44.72
  - Position:
      X: 5.312068
      Y: 2.94
      Z: 3.53
  - Position:
      X: 14.88
      Y: 3.29
      Z: 124.1
  - Position:
      X: 8.29
      Y: 2.9
      Z: 229.84
  - Position:
      X: 6.83
      Y: 2.9
      Z: 178.341
  - Position:
      X: 10.86
      Y: 4.08
      Z: 99.23
  - Position:
      X: 2.77
      Y: 2.47
      Z: 39.66
  - Position:
      X: 7.63
      Y: 8.41
      Z: 164.56
  - Position:
      X: 7.5
      Y: 3.36
      Z: 113.69
  - Position:
      X: -7.034
      Y: 7.13
      Z: 9.756
  - Position:
      X: 10.44
      Y: 2.35
      Z: 161.22
  - Position:
      X: 10.61
      Y: 1.9
      Z: 118.42
  - Position:
      X: 8.87
      Y: 8.53
      Z: 140.64
  - Position:
      X: 10.25
      Y: 8.46
      Z: 152.47
  - Position:
      X: 11.64
      Y: 9.35
      Z: 168.83
  - Position:
      X: -0.29
      Y: 1.58
      Z: 34.32
  - Position:
      X: 19.77
      Y: 7.51
      Z: 208.5
  - Position:
      X: 11.35
      Y: 1.19
      Z: 216.18
  - Position:
      X: 10.54
      Y: 4.32
      Z: 129.1
  - Position:
      X: 11.28
      Y: 4.13
      Z: 201.66
  - Position:
      X: 2.77
      Y: 4.29
      Z: 51.14
  - Position:
      X: 2.43
      Y: 1.58
      Z: 28.27
  - Position:
      X: 9.96
      Y: 3.3300002
      Z: 184.761
  - Position:
      X: 15.87
      Y: 7.42
      Z: 73.48
  - Position:
      X: 10.94
      Y: 0.9
      Z: 76.58
  - Position:
      X: 7.42
      Y: 4.99
      Z: 106.35
  - Position:
      X: 9.96
      Y: 1.87
      Z: 173.281
  BadApplePositions:
  - Position:
      X: 9.73
      Y: 3.6
      Z: 93.51
  - Position:
      X: 8.139999
      Y: 2.1799998
      Z: 173.371
  - Position:
      X: -10.5
      Y: 9.46
      Z: 19.63
  - Position:
      X: 21.13
      Y: 8.83
      Z: 73.54
  - Position:
      X: 10.29
      Y: 3.21
      Z: 230.54
  - Position:
      X: 0.61
      Y: 4.6
      Z: 51.23
  - Position:
      X: 8.83
      Y: 3.21
      Z: 179.041
  - Position:
      X: -8.44
      Y: 7.22
      Z: 14.57
  - Position:
      X: 7.58
      Y: 3.64
      Z: 184.851
  - Position:
      X: 9.039999
      Y: 2.57
      Z: 87.840004
  - Position:
      X: 6.04
      Y: 6.24
      Z: 133.72
  - Position:
      X: 7.8999996
      Y: 3.64
      Z: 236.34999
  - Position:
      X: 0.95
      Y: 2.78
      Z: 39.75
  - Position:
      X: 4.99
      Y: 3.65
      Z: 116.13
  - Position:
      X: 13.64
      Y: 9.3
      Z: 153.82
  - Position:
      X: 8.48
      Y: 4.39
      Z: 99.32
  - Position:
      X: 3.12
      Y: 8.54
      Z: 145.54
  - Position:
      X: 8.88
      Y: 9.3
      Z: 157.59
  - Position:
      X: 1.64
      Y: 3.81
      Z: 45.42
  - Position:
      X: 7.45
      Y: 9.66
      Z: 168.67
  ScopePositions: []
  SkullPositions: []
