%YAML 1.1
%TAG !u! tag:unity3d.com,2011:
--- !u!114 &11400000
MonoBehaviour:
  m_ObjectHideFlags: 0
  m_CorrespondingSourceObject: {fileID: 0}
  m_PrefabInstance: {fileID: 0}
  m_PrefabAsset: {fileID: 0}
  m_GameObject: {fileID: 0}
  m_Enabled: 1
  m_EditorHideFlags: 0
  m_Script: {fileID: 11500000, guid: db42ea77b5104db198b22d79291dea4e, type: 3}
  m_Name: level_7
  m_EditorClassIdentifier: 
  LevelKey: level_7
  TimeOfLevel:
    Value: 50
  LevelTransferTriggerDataset:
    PositionTrigger:
      X: 0.94
      Y: 4.61
      Z: -20.57
    rotationTriggerTrigger:
      X: -0
      Y: 0
      Z: 0
    ColliderCenter:
      X: 0
      Y: 0
      Z: 0
    ColliderSize:
      X: 10
      Y: 10
      Z: 3
  StarsProgress:
    SnakeLenghtOnLevel: 24
  SpawnEnemySnakeDataset:
  - LenghtTile: 15
    SpeedSnake: 5.5
    CurrentTarget: 0
    DistanceToChangedTargetPoint: 1
    Points:
    - X: 23.041584
      Y: 13
      Z: 56.876366
    - X: 25.442116
      Y: 13
      Z: 63.385593
    - X: 21.642717
      Y: 13
      Z: 74.44226
    - X: 11.673208
      Y: 13
      Z: 81.73743
    - X: 2.6019986
      Y: 13
      Z: 85.42245
    - X: -4.42235
      Y: 13
      Z: 83.08627
    - X: -13.221001
      Y: 13
      Z: 76.82036
    - X: -19.514887
      Y: 13
      Z: 68.03224
    - X: -19.840235
      Y: 13
      Z: 53.974583
    - X: -13.096715
      Y: 13
      Z: 43.431347
    - X: -3.3168535
      Y: 13
      Z: 37.79661
    - X: 5.4767847
      Y: 13
      Z: 36.57828
    - X: 15.117083
      Y: 13
      Z: 36.864677
  - LenghtTile: 15
    SpeedSnake: 5.5
    CurrentTarget: 0
    DistanceToChangedTargetPoint: 1
    Points:
    - X: -19.556984
      Y: 20
      Z: 56.876366
    - X: -19.972164
      Y: 20
      Z: 67.43688
    - X: -12.32702
      Y: 20
      Z: 77.5732
    - X: -2.9930725
      Y: 20
      Z: 84.42985
    - X: 3.592834
      Y: 20
      Z: 85.41061
    - X: 11.851292
      Y: 20
      Z: 81.78816
    - X: 21.383204
      Y: 20
      Z: 73.95483
    - X: 24.613508
      Y: 20
      Z: 63.623104
    - X: 21.366331
      Y: 20
      Z: 48.623997
    - X: 13.155127
      Y: 20
      Z: 40.9406
    - X: 2.549429
      Y: 20
      Z: 38.579163
    - X: -9.640727
      Y: 20
      Z: 43.61499
  SpawnerCollectibleObjects: []
  ApplePositions:
  - Position:
      X: -11.958872
      Y: 13.4180565
      Z: 42.05045
  - Position:
      X: -8.509872
      Y: 12.404057
      Z: 20.23045
  - Position:
      X: -11.078873
      Y: 17.588057
      Z: 4.2304487
  - Position:
      X: -15.808872
      Y: 16.468058
      Z: 73.70045
  - Position:
      X: 12.171127
      Y: 16.318058
      Z: 15.65045
  - Position:
      X: -11.328873
      Y: 15.328057
      Z: 32.52045
  - Position:
      X: -17.638872
      Y: 14.458057
      Z: 55.290447
  - Position:
      X: 22.321129
      Y: 15.018057
      Z: 64.82045
  - Position:
      X: 7.4511275
      Y: 14.438057
      Z: 29.780449
  - Position:
      X: -10.188873
      Y: 16.918056
      Z: 9.430449
  - Position:
      X: 9.281128
      Y: 11.568057
      Z: 3.2104492
  - Position:
      X: -9.368872
      Y: 15.708057
      Z: 14.520449
  - Position:
      X: 21.731129
      Y: 17.458057
      Z: 54.66045
  - Position:
      X: -10.278872
      Y: 14.438057
      Z: 26.15045
  - Position:
      X: 11.641128
      Y: 18.858057
      Z: 21.780449
  - Position:
      X: 18.711128
      Y: 19.418056
      Z: 48.83045
  - Position:
      X: 8.091127
      Y: 15.318057
      Z: 35.01045
  - Position:
      X: -14.188873
      Y: 12.248057
      Z: 49.240448
  - Position:
      X: 9.161127
      Y: 13.888057
      Z: 82.93045
  - Position:
      X: 9.711127
      Y: 14.058057
      Z: 8.560449
  - Position:
      X: -19.658873
      Y: 16.818058
      Z: 63.11045
  - Position:
      X: -7.7488728
      Y: 17.918056
      Z: 81.730446
  - Position:
      X: 12.491127
      Y: 16.938057
      Z: 42.060448
  - Position:
      X: 21.181128
      Y: 12.358057
      Z: 74.730446
  BadApplePositions:
  - Position:
      X: 21.551128
      Y: 16.978058
      Z: 59.32045
  - Position:
      X: -0.4088726
      Y: 10.118057
      Z: 29.41045
  - Position:
      X: 8.2211275
      Y: 17.248056
      Z: 38.98045
  - Position:
      X: -17.988873
      Y: 15.948057
      Z: 68.730446
  - Position:
      X: 15.061128
      Y: 12.988057
      Z: 78.40045
  - Position:
      X: 1.2811275
      Y: 25.858057
      Z: 13.780449
  - Position:
      X: -11.478872
      Y: 18.208057
      Z: 21.780449
  - Position:
      X: -0.4088726
      Y: 10.3780575
      Z: 5.780449
  - Position:
      X: -7.1588726
      Y: 12.618057
      Z: 39.540447
  - Position:
      X: -12.518873
      Y: 20.908058
      Z: 78.74045
  - Position:
      X: -2.3988724
      Y: 17.388058
      Z: 85.620445
  - Position:
      X: -19.038872
      Y: 18.498056
      Z: 57.470448
  - Position:
      X: 9.211127
      Y: 13.388057
      Z: 21.780449
  - Position:
      X: 6.111128
      Y: 6.4580574
      Z: 13.780449
  - Position:
      X: -2.3688726
      Y: 17.958057
      Z: 13.780449
  - Position:
      X: 0.35112762
      Y: 11.338057
      Z: 21.780449
  ScopePositions: []
  SkullPositions: []
