%YAML 1.1
%TAG !u! tag:unity3d.com,2011:
--- !u!114 &11400000
MonoBehaviour:
  m_ObjectHideFlags: 0
  m_CorrespondingSourceObject: {fileID: 0}
  m_PrefabInstance: {fileID: 0}
  m_PrefabAsset: {fileID: 0}
  m_GameObject: {fileID: 0}
  m_Enabled: 1
  m_EditorHideFlags: 0
  m_Script: {fileID: 11500000, guid: db42ea77b5104db198b22d79291dea4e, type: 3}
  m_Name: level_44
  m_EditorClassIdentifier: 
  LevelKey: level_44
  TimeOfLevel:
    Value: 65
  LevelTransferTriggerDataset:
    PositionTrigger:
      X: 24.19
      Y: 5.41
      Z: 108.67
    rotationTriggerTrigger:
      X: -0
      Y: 0
      Z: 0
    ColliderCenter:
      X: 0
      Y: 0
      Z: 0
    ColliderSize:
      X: 9
      Y: 9
      Z: 9
  StarsProgress:
    SnakeLenghtOnLevel: 68
  SpawnEnemySnakeDataset:
  - LenghtTile: 40
    SpeedSnake: 8
    CurrentTarget: 0
    DistanceToChangedTargetPoint: 1
    Points:
    - X: 26.269062
      Y: 2.452448
      Z: -4.7377157
    - X: 13.697121
      Y: 3.7691193
      Z: 14.951659
    - X: -1.5479937
      Y: 7.553221
      Z: 2.2154706
    - X: 4.721899
      Y: 3.3834987
      Z: -12.442745
  - LenghtTile: 25
    SpeedSnake: 8
    CurrentTarget: 0
    DistanceToChangedTargetPoint: 1
    Points:
    - X: 0.15779352
      Y: 9.106537
      Z: 39.582985
  - LenghtTile: 40
    SpeedSnake: 8
    CurrentTarget: 0
    DistanceToChangedTargetPoint: 1
    Points:
    - X: -9.499403
      Y: 3.4727192
      Z: -1.221036
    - X: 3.305633
      Y: 4.8109207
      Z: 17.612823
    - X: 20.959305
      Y: 6.9071674
      Z: 9.822818
    - X: 21.235256
      Y: 5.005231
      Z: -4.7569695
    - X: 5.918705
      Y: 5.005231
      Z: -12.51214
  - LenghtTile: 40
    SpeedSnake: 8
    CurrentTarget: 0
    DistanceToChangedTargetPoint: 1
    Points:
    - X: 42.040283
      Y: 6.6443396
      Z: -0.26985836
    - X: 29.620667
      Y: 8.309567
      Z: 12.524384
    - X: 13.2585
      Y: 10.073823
      Z: 8.388536
    - X: 8.520054
      Y: 5.554164
      Z: -4.900706
    - X: 27.84193
      Y: 2.904086
      Z: -12.594461
  - LenghtTile: 25
    SpeedSnake: 8
    CurrentTarget: 0
    DistanceToChangedTargetPoint: 1
    Points:
    - X: -2.8422065
      Y: 6.1065364
      Z: 39.582985
  - LenghtTile: 25
    SpeedSnake: 8
    CurrentTarget: 0
    DistanceToChangedTargetPoint: 1
    Points:
    - X: 19.437885
      Y: 10.218506
      Z: 39.368362
  - LenghtTile: 45
    SpeedSnake: 8
    CurrentTarget: 0
    DistanceToChangedTargetPoint: 1
    Points:
    - X: 18.186897
      Y: 9.575068
      Z: 71.281525
    - X: 3.4187584
      Y: 5.5914955
      Z: 82.70262
    - X: -13.867199
      Y: 0.9402622
      Z: 71.31356
    - X: 1.5264363
      Y: 4.6412005
      Z: 56.845066
  - LenghtTile: 25
    SpeedSnake: 8
    CurrentTarget: 0
    DistanceToChangedTargetPoint: 1
    Points:
    - X: 16.437885
      Y: 13.218506
      Z: 40.368362
  - LenghtTile: 40
    SpeedSnake: 8
    CurrentTarget: 0
    DistanceToChangedTargetPoint: 1
    Points:
    - X: 18.640793
      Y: 3.9018717
      Z: 61.95868
    - X: 30.341873
      Y: 7.7070255
      Z: 74.77582
    - X: 44.290794
      Y: 3.1316395
      Z: 61.200176
    - X: 30.98725
      Y: 1.7900715
      Z: 49.89892
  - LenghtTile: 25
    SpeedSnake: 8
    CurrentTarget: 0
    DistanceToChangedTargetPoint: 1
    Points:
    - X: 3.1577935
      Y: 12.106537
      Z: 38.582985
  - LenghtTile: 25
    SpeedSnake: 8
    CurrentTarget: 0
    DistanceToChangedTargetPoint: 1
    Points:
    - X: 21.437885
      Y: 7.218506
      Z: 37.368362
  SpawnerCollectibleObjects: []
  ApplePositions:
  - Position:
      X: 8.25
      Y: 6.58
      Z: 86.34
  - Position:
      X: 17.67
      Y: 6.68
      Z: -5.69
  - Position:
      X: 19.44
      Y: 9.79
      Z: 39.46
  - Position:
      X: 11.2
      Y: 15.96
      Z: 36.67
  - Position:
      X: 18.74
      Y: 4.57
      Z: 16.6
  - Position:
      X: 12.37
      Y: 3.21
      Z: 32.57
  - Position:
      X: 32.55
      Y: 2.57
      Z: 15.11
  - Position:
      X: 33.83
      Y: 3.98
      Z: 46.57
  - Position:
      X: 39.54
      Y: 3.47
      Z: 8.52
  - Position:
      X: 7.34
      Y: 1.75
      Z: -9.28
  - Position:
      X: 3.07
      Y: 2.45
      Z: -5.1
  - Position:
      X: 21.44
      Y: 6.79
      Z: 37.46
  - Position:
      X: 1.87
      Y: 8.08
      Z: 78.42
  - Position:
      X: -9.07
      Y: 5.92
      Z: 69.51
  - Position:
      X: 27.87
      Y: 4.3
      Z: 11.8
  - Position:
      X: 25.53
      Y: 5.25
      Z: 78.93
  - Position:
      X: 41.52
      Y: 8.31
      Z: -6.03
  - Position:
      X: 5.44
      Y: 2.13
      Z: 70.45
  - Position:
      X: 27.79
      Y: 2.29
      Z: 43.98
  - Position:
      X: 33.33
      Y: 6.36
      Z: 51.59
  - Position:
      X: 12.43
      Y: 4.98
      Z: 52.34
  - Position:
      X: -6.4
      Y: 7.7
      Z: 74.09
  - Position:
      X: 21.62
      Y: 5.24
      Z: -9.91
  - Position:
      X: 0.2
      Y: 8.6
      Z: 39.61
  - Position:
      X: 7.74
      Y: 2.13
      Z: 65.8
  - Position:
      X: -6.81
      Y: 3.7
      Z: 27.29
  - Position:
      X: 23.49
      Y: 4.29
      Z: 48.89
  - Position:
      X: 36.74
      Y: 5.76
      Z: -8.14
  - Position:
      X: 20.05
      Y: 2.79
      Z: 75.55
  - Position:
      X: 17.72
      Y: 1.54
      Z: 29.08
  - Position:
      X: 18.52
      Y: 2.77
      Z: 50.23
  - Position:
      X: 28.01
      Y: 3.19
      Z: 61.44
  - Position:
      X: -3.96
      Y: 3.62
      Z: 67.12
  - Position:
      X: 22.26
      Y: 7.99
      Z: 67.81
  - Position:
      X: 35.9
      Y: 6.13
      Z: 56.29
  - Position:
      X: 22.4
      Y: 3.25
      Z: 32.65
  - Position:
      X: -0.53
      Y: 2.13
      Z: 70.87
  - Position:
      X: 23.34
      Y: 5.83
      Z: 63
  - Position:
      X: 39.97
      Y: 7.69
      Z: -0.39
  - Position:
      X: -4.9
      Y: 4.47
      Z: 16.12
  - Position:
      X: 3.2
      Y: 11.6
      Z: 38.61
  - Position:
      X: 13.24
      Y: 4.22
      Z: 64.86
  - Position:
      X: 37.08
      Y: 5.48
      Z: 4.29
  - Position:
      X: 16.73
      Y: 6.16
      Z: 69.06
  - Position:
      X: 23.02
      Y: 5.98
      Z: 12.94
  - Position:
      X: 15.48
      Y: 1.6
      Z: 78.34
  - Position:
      X: 26.93
      Y: 1.94
      Z: -8.16
  - Position:
      X: -1.89
      Y: 9.54
      Z: 75.49
  - Position:
      X: -0.82
      Y: 3.78
      Z: 12.54
  - Position:
      X: 12.9
      Y: 4.96
      Z: 83.28
  - Position:
      X: 12.95
      Y: 4.07
      Z: -6.41
  - Position:
      X: -4.59
      Y: 6.01
      Z: 22.35
  - Position:
      X: 30.65
      Y: 3.32
      Z: -4.8
  - Position:
      X: -1.94
      Y: 5.2
      Z: -1.05
  - Position:
      X: 6.16
      Y: 15.31
      Z: 35.81
  - Position:
      X: 3.85
      Y: 1.74
      Z: 12.51
  - Position:
      X: -9.44
      Y: 1.46
      Z: 30.6
  - Position:
      X: 14.24
      Y: 4.97
      Z: 13.42
  - Position:
      X: 8.7
      Y: 6.72
      Z: 47.1
  - Position:
      X: 23.31
      Y: 2.53
      Z: 89.62
  - Position:
      X: -7.14
      Y: 2.06
      Z: 36.43
  - Position:
      X: 16.44
      Y: 12.79
      Z: 40.46
  - Position:
      X: 8.86
      Y: 2.45
      Z: 10.28
  - Position:
      X: 37.62
      Y: 1.83
      Z: 12.94
  - Position:
      X: -2.8
      Y: 5.6
      Z: 39.61
  - Position:
      X: 3.34
      Y: 8.38
      Z: 83.55
  - Position:
      X: 23.67
      Y: 3.81
      Z: 83.88
  - Position:
      X: 33.69
      Y: 4.02
      Z: 61.98
  BadApplePositions:
  - Position:
      X: 6.6
      Y: 6.64
      Z: 53.08
  - Position:
      X: 30.98
      Y: 3.7
      Z: -7.23
  - Position:
      X: 15.51
      Y: 5.5
      Z: 84.55
  - Position:
      X: 11.88
      Y: 5.5
      Z: 54.79
  - Position:
      X: 28.19
      Y: 2.71
      Z: 46.25
  - Position:
      X: 19.92
      Y: 7.44
      Z: 65.46
  - Position:
      X: 34.15
      Y: 6.43
      Z: 56.55
  ScopePositions: []
  SkullPositions: []
