%YAML 1.1
%TAG !u! tag:unity3d.com,2011:
--- !u!114 &11400000
MonoBehaviour:
  m_ObjectHideFlags: 0
  m_CorrespondingSourceObject: {fileID: 0}
  m_PrefabInstance: {fileID: 0}
  m_PrefabAsset: {fileID: 0}
  m_GameObject: {fileID: 0}
  m_Enabled: 1
  m_EditorHideFlags: 0
  m_Script: {fileID: 11500000, guid: 468a46d0ae32c3544b7d98094e6448a9, type: 3}
  m_Name: AddressableAssetSettings
  m_EditorClassIdentifier: 
  m_DefaultGroup: eba0dab25f4189943a48c58cde6182f5
  m_OptimizeCatalogSize: 0
  m_BuildRemoteCatalog: 0
  m_BundleLocalCatalog: 0
  m_DisableCatalogUpdateOnStart: 0
  m_IgnoreUnsupportedFilesInBuild: 0
  m_UniqueBundleIds: 0
  m_maxConcurrentWebRequests: 500
  m_ContiguousBundles: 0
  m_ShaderBundleNaming: 0
  m_ShaderBundleCustomNaming: 
  m_RemoteCatalogBuildPath:
    m_Id: 
  m_RemoteCatalogLoadPath:
    m_Id: 
  m_ContentStateBuildPath: 
  m_overridePlayerVersion: 
  m_GroupAssets:
  - {fileID: 11400000, guid: b49cf6349c2f49e419a46a7e4d3710b3, type: 2}
  - {fileID: 11400000, guid: a991e1fcdd26e8248aa45f288e20c1e6, type: 2}
  - {fileID: 11400000, guid: 87775bbfd84a6c7489f4db128c60b1ca, type: 2}
  m_BuildSettings:
    m_CompileScriptsInVirtualMode: 0
    m_CleanupStreamingAssetsAfterBuilds: 1
    m_LogResourceManagerExceptions: 1
    m_BundleBuildPath: Temp/com.unity.addressables/AssetBundles
  m_ProfileSettings:
    m_Profiles:
    - m_InheritedParent: 
      m_Id: 97c627f827507ea4ba2b73b141f2b75e
      m_ProfileName: Default
      m_Values:
      - m_Id: 5640238404759f542bc7c4af22a1abad
        m_Value: '[UnityEditor.EditorUserBuildSettings.activeBuildTarget]'
      - m_Id: 0e56b5abd8aa56f45b183d95e37fede4
        m_Value: '[UnityEngine.AddressableAssets.Addressables.BuildPath]/[BuildTarget]'
      - m_Id: 5794b168bd6321e40b8d3bec0b424c25
        m_Value: '{UnityEngine.AddressableAssets.Addressables.RuntimePath}/[BuildTarget]'
      - m_Id: 8a045ba0d3b6e9e4b98096c7add78b7c
        m_Value: ServerData/[BuildTarget]
      - m_Id: 4757a140f7ba93247806176404d31956
        m_Value: http://localhost/[BuildTarget]
    m_ProfileEntryNames:
    - m_Id: 5640238404759f542bc7c4af22a1abad
      m_Name: BuildTarget
      m_InlineUsage: 0
    - m_Id: 0e56b5abd8aa56f45b183d95e37fede4
      m_Name: LocalBuildPath
      m_InlineUsage: 0
    - m_Id: 5794b168bd6321e40b8d3bec0b424c25
      m_Name: LocalLoadPath
      m_InlineUsage: 0
    - m_Id: 8a045ba0d3b6e9e4b98096c7add78b7c
      m_Name: RemoteBuildPath
      m_InlineUsage: 0
    - m_Id: 4757a140f7ba93247806176404d31956
      m_Name: RemoteLoadPath
      m_InlineUsage: 0
    m_ProfileVersion: 1
  m_LabelTable:
    m_LabelNames:
    - default
  m_SchemaTemplates: []
  m_GroupTemplateObjects:
  - {fileID: 11400000, guid: e0ef51ae121ebfd4495a49a3987342a6, type: 2}
  m_InitializationObjects: []
  m_CertificateHandlerType:
    m_AssemblyName: 
    m_ClassName: 
  m_ActivePlayerDataBuilderIndex: 3
  m_DataBuilders:
  - {fileID: 11400000, guid: feff2c05884e7ea4bbf0992362d2ecab, type: 2}
  - {fileID: 11400000, guid: f5ceb3426ecd8f042b056984389d1b9e, type: 2}
  - {fileID: 11400000, guid: 8bc6871964808fc408cc795be218ff01, type: 2}
  - {fileID: 11400000, guid: 1f98a7c0829820948b28bb3193d40824, type: 2}
  m_ActiveProfileId: 97c627f827507ea4ba2b73b141f2b75e
  m_HostingServicesManager:
    m_HostingServiceInfos: []
    m_Settings: {fileID: 11400000}
    m_NextInstanceId: 0
    m_RegisteredServiceTypeRefs: []
