%YAML 1.1
%TAG !u! tag:unity3d.com,2011:
--- !u!114 &11400000
MonoBehaviour:
  m_ObjectHideFlags: 0
  m_CorrespondingSourceObject: {fileID: 0}
  m_PrefabInstance: {fileID: 0}
  m_PrefabAsset: {fileID: 0}
  m_GameObject: {fileID: 0}
  m_Enabled: 1
  m_EditorHideFlags: 0
  m_Script: {fileID: 11500000, guid: db42ea77b5104db198b22d79291dea4e, type: 3}
  m_Name: level_31
  m_EditorClassIdentifier: 
  LevelKey: level_31
  TimeOfLevel:
    Value: 67
  LevelTransferTriggerDataset:
    PositionTrigger:
      X: -0.53
      Y: 4.918844
      Z: 270.6
    rotationTriggerTrigger:
      X: -0
      Y: 0
      Z: 0
    ColliderCenter:
      X: 0
      Y: 0
      Z: 0
    ColliderSize:
      X: 9
      Y: 9
      Z: 9
  StarsProgress:
    SnakeLenghtOnLevel: 54
  SpawnEnemySnakeDataset:
  - LenghtTile: 25
    SpeedSnake: 8
    CurrentTarget: 0
    DistanceToChangedTargetPoint: 1
    Points:
    - X: -14.846719
      Y: 2.1739826
      Z: 206.16208
    - X: -1.0390568
      Y: 7.9043574
      Z: 219.70267
    - X: 11.427301
      Y: 1.842782
      Z: 206.05537
    - X: -2.0810013
      Y: 7.02782
      Z: 192.59186
  - LenghtTile: 25
    SpeedSnake: 8
    CurrentTarget: 0
    DistanceToChangedTargetPoint: 1
    Points:
    - X: 10.426696
      Y: 1.8827801
      Z: 206.16208
    - X: -1.096801
      Y: 6.461044
      Z: 219.50432
    - X: -14.138811
      Y: 2.2304716
      Z: 206.5941
    - X: -2.0810013
      Y: 6.4610443
      Z: 192.74385
  - LenghtTile: 25
    SpeedSnake: 8
    CurrentTarget: 0
    DistanceToChangedTargetPoint: 1
    Points:
    - X: 10.44278
      Y: 6.446193
      Z: 171.87144
    - X: -1.3330932
      Y: 1.6704221
      Z: 184.86462
    - X: -13.41269
      Y: 6.1522713
      Z: 171.10953
    - X: -1.7800541
      Y: 1.6588464
      Z: 157.15245
  - LenghtTile: 25
    SpeedSnake: 8
    CurrentTarget: 0
    DistanceToChangedTargetPoint: 1
    Points:
    - X: -13.345966
      Y: 7
      Z: 171.87144
    - X: -1.3330932
      Y: 0.5
      Z: 184.86462
    - X: 11.227492
      Y: 7
      Z: 171.10953
    - X: -1.7800541
      Y: 0.5
      Z: 157.15245
  - LenghtTile: 25
    SpeedSnake: 8
    CurrentTarget: 0
    DistanceToChangedTargetPoint: 1
    Points:
    - X: -12.951664
      Y: 1.0191522
      Z: 136.59418
    - X: -1.1677847
      Y: 1.7294564
      Z: 148.96107
    - X: 10.875094
      Y: 6.1590424
      Z: 136.5815
    - X: -1.010622
      Y: 6.4601145
      Z: 123.33241
  - LenghtTile: 25
    SpeedSnake: 8
    CurrentTarget: 0
    DistanceToChangedTargetPoint: 1
    Points:
    - X: 10.857757
      Y: 3.9075499
      Z: 102.39878
    - X: -1.1677847
      Y: 3.9075499
      Z: 114.54938
    - X: -14.236618
      Y: 4.498473
      Z: 103.09591
    - X: -1.010622
      Y: 2.7775187
      Z: 88.47006
  - LenghtTile: 25
    SpeedSnake: 9
    CurrentTarget: 0
    DistanceToChangedTargetPoint: 1
    Points:
    - X: 5.2384434
      Y: 3.9075499
      Z: -9.098733
    - X: 0.83941317
      Y: 0.6857214
      Z: 6.745305
    - X: -7.733675
      Y: 5.561185
      Z: 23.770906
    - X: 3.487924
      Y: 9.777265
      Z: 32.628242
    - X: -10.093671
      Y: 5.918414
      Z: 4.4459114
  SpawnerCollectibleObjects: []
  ApplePositions:
  - Position:
      X: -5.42
      Y: 1.71
      Z: 247.51
  - Position:
      X: -0.8
      Y: 3.63
      Z: 243.52
  - Position:
      X: 3.84
      Y: 6.09
      Z: 247.89
  - Position:
      X: -0.75
      Y: 8.38
      Z: 252.09
  - Position:
      X: -3.46
      Y: 10.6
      Z: 245.67
  - Position:
      X: -0.11000013
      Y: 8.6
      Z: 239.70001
  - Position:
      X: -2.9
      Y: 5.6
      Z: 232.59001
  - Position:
      X: -0.49
      Y: 2.73
      Z: 225.35
  - Position:
      X: -3.88
      Y: 0.99
      Z: 219
  - Position:
      X: 2.88
      Y: 4.11
      Z: 210.41
  - Position:
      X: 8.77
      Y: 6.66
      Z: 211.26
  - Position:
      X: 10.68
      Y: 7.5
      Z: 205.5
  - Position:
      X: 5.43
      Y: 4.81
      Z: 201.46
  - Position:
      X: 0.79
      Y: 2.67
      Z: 198.63
  - Position:
      X: -0.69
      Y: 0.76
      Z: 193.23
  - Position:
      X: 1.13
      Y: 5.03
      Z: 186.16
  - Position:
      X: -1.89
      Y: 7.66
      Z: 182.33
  - Position:
      X: -6.93
      Y: 5.77
      Z: 176.59
  - Position:
      X: -13.28
      Y: 3.4
      Z: 173.05
  - Position:
      X: -12.05
      Y: 1.09
      Z: 166.94
  - Position:
      X: -5.99
      Y: 3.45
      Z: 164
  - Position:
      X: -2.61
      Y: 4.96
      Z: 160.57
  - Position:
      X: -0.53
      Y: 4.57
      Z: 155.76
  - Position:
      X: -3.29
      Y: 5.15
      Z: 151.51
  - Position:
      X: -1.46
      Y: 2.93
      Z: 146.43
  - Position:
      X: 3.3
      Y: 0.83
      Z: 143.57
  - Position:
      X: 9.5
      Y: 1.86
      Z: 141.36
  - Position:
      X: 9.34
      Y: 4.11
      Z: 133.83
  - Position:
      X: 3.32
      Y: 0.65
      Z: 128.38
  - Position:
      X: -3.82
      Y: 1.77
      Z: 127.56
  - Position:
      X: -6.98
      Y: 3.72
      Z: 121.88
  - Position:
      X: -4.72
      Y: 6.48
      Z: 116.52
  - Position:
      X: -6.36
      Y: 4.52
      Z: 110.87
  - Position:
      X: -11.01
      Y: 2.36
      Z: 108.78
  - Position:
      X: -11.81
      Y: 1.52
      Z: 100.16
  - Position:
      X: -5.89
      Y: 5.14
      Z: 96.87
  - Position:
      X: -0.76
      Y: 6.04
      Z: 93.93
  - Position:
      X: 1.78
      Y: 4.16
      Z: 87.82
  - Position:
      X: -1.05
      Y: 2.58
      Z: 82.89
  - Position:
      X: 1.19
      Y: 1.75
      Z: 77.23
  - Position:
      X: 7.51
      Y: 3.75
      Z: 74.41
  - Position:
      X: 10.912
      Y: 4.6
      Z: 67.93
  - Position:
      X: 3.86
      Y: 1.18
      Z: 60.93
  - Position:
      X: 1.0699999
      Y: 4.25
      Z: 55.27
  - Position:
      X: -2.73
      Y: 6.23
      Z: 49.339996
  - Position:
      X: 0.23
      Y: 4.59
      Z: 42.8
  - Position:
      X: -0.6999999
      Y: 1.98
      Z: 35.81
  - Position:
      X: 2.62
      Y: 1.98
      Z: 29.21
  - Position:
      X: -0.3
      Y: 1.98
      Z: 23.11
  - Position:
      X: -2.8
      Y: 0.72
      Z: 16.85
  - Position:
      X: 1.94
      Y: 2.67
      Z: 12.16
  - Position:
      X: 4.78
      Y: 0.96
      Z: 7.83
  - Position:
      X: 0.17
      Y: 2.62
      Z: 2.32
  - Position:
      X: -2.68
      Y: 4.97
      Z: -2.07
  BadApplePositions:
  - Position:
      X: -2.22
      Y: 8.81
      Z: 239.75
  - Position:
      X: -0.87
      Y: 5.81
      Z: 232.64
  - Position:
      X: -2.6
      Y: 2.94
      Z: 225.4
  - Position:
      X: -0.12
      Y: 3.91
      Z: 202.21
  - Position:
      X: -3.08
      Y: 5.22
      Z: 156.24
  - Position:
      X: 1.78
      Y: 3.06
      Z: -5.67
  - Position:
      X: 3.41
      Y: 2.75
      Z: 78.57
  - Position:
      X: 4.62
      Y: 1.85
      Z: 66.21
  - Position:
      X: -0.11
      Y: 4.03
      Z: -2.61
  - Position:
      X: -0.91
      Y: 4.69
      Z: 55.33
  - Position:
      X: -0.9100001
      Y: 6.69
      Z: 49.41
  - Position:
      X: 0.13
      Y: 2.86
      Z: 42.72
  - Position:
      X: 1.32
      Y: 2.44
      Z: 35.88
  - Position:
      X: 0.6899999
      Y: 2.44
      Z: 29.28
  ScopePositions: []
  SkullPositions:
  - Position:
      X: 2.17
      Y: 9.45
      Z: 245.31
  - Position:
      X: -5.85
      Y: 4.69
      Z: 68.98
  - Position:
      X: -0.3
      Y: 4.69
      Z: 68.98
  - Position:
      X: 4.55
      Y: 4.69
      Z: 68.98
