%YAML 1.1
%TAG !u! tag:unity3d.com,2011:
--- !u!1001 &3835851921466287684
PrefabInstance:
  m_ObjectHideFlags: 0
  serializedVersion: 2
  m_Modification:
    m_TransformParent: {fileID: 0}
    m_Modifications:
    - target: {fileID: 4457325306352721058, guid: fc68e56ecd38b884ca950a542003d8f6,
        type: 3}
      propertyPath: m_Name
      value: pr_Plane_32x32_grass
      objectReference: {fileID: 0}
    - target: {fileID: 5837601171007995386, guid: fc68e56ecd38b884ca950a542003d8f6,
        type: 3}
      propertyPath: m_Materials.Array.data[0]
      value: 
      objectReference: {fileID: 2100000, guid: b6c2300f978a6b94c9abfd802a3f507c, type: 2}
    - target: {fileID: 6712288256902934736, guid: fc68e56ecd38b884ca950a542003d8f6,
        type: 3}
      propertyPath: m_LocalPosition.x
      value: 0
      objectReference: {fileID: 0}
    - target: {fileID: 6712288256902934736, guid: fc68e56ecd38b884ca950a542003d8f6,
        type: 3}
      propertyPath: m_LocalPosition.y
      value: 0
      objectReference: {fileID: 0}
    - target: {fileID: 6712288256902934736, guid: fc68e56ecd38b884ca950a542003d8f6,
        type: 3}
      propertyPath: m_LocalPosition.z
      value: 0
      objectReference: {fileID: 0}
    - target: {fileID: 6712288256902934736, guid: fc68e56ecd38b884ca950a542003d8f6,
        type: 3}
      propertyPath: m_LocalRotation.x
      value: 0
      objectReference: {fileID: 0}
    - target: {fileID: 6712288256902934736, guid: fc68e56ecd38b884ca950a542003d8f6,
        type: 3}
      propertyPath: m_LocalRotation.y
      value: 0
      objectReference: {fileID: 0}
    - target: {fileID: 6712288256902934736, guid: fc68e56ecd38b884ca950a542003d8f6,
        type: 3}
      propertyPath: m_LocalRotation.z
      value: 0
      objectReference: {fileID: 0}
    - target: {fileID: 6712288256902934736, guid: fc68e56ecd38b884ca950a542003d8f6,
        type: 3}
      propertyPath: m_LocalRotation.w
      value: 1
      objectReference: {fileID: 0}
    - target: {fileID: 6712288256902934736, guid: fc68e56ecd38b884ca950a542003d8f6,
        type: 3}
      propertyPath: m_RootOrder
      value: 0
      objectReference: {fileID: 0}
    - target: {fileID: 6712288256902934736, guid: fc68e56ecd38b884ca950a542003d8f6,
        type: 3}
      propertyPath: m_LocalEulerAnglesHint.x
      value: 0
      objectReference: {fileID: 0}
    - target: {fileID: 6712288256902934736, guid: fc68e56ecd38b884ca950a542003d8f6,
        type: 3}
      propertyPath: m_LocalEulerAnglesHint.y
      value: 0
      objectReference: {fileID: 0}
    - target: {fileID: 6712288256902934736, guid: fc68e56ecd38b884ca950a542003d8f6,
        type: 3}
      propertyPath: m_LocalEulerAnglesHint.z
      value: 0
      objectReference: {fileID: 0}
    m_RemovedComponents: []
  m_SourcePrefab: {fileID: 100100000, guid: fc68e56ecd38b884ca950a542003d8f6, type: 3}
