%YAML 1.1
%TAG !u! tag:unity3d.com,2011:
--- !u!114 &11400000
MonoBehaviour:
  m_ObjectHideFlags: 0
  m_CorrespondingSourceObject: {fileID: 0}
  m_PrefabInstance: {fileID: 0}
  m_PrefabAsset: {fileID: 0}
  m_GameObject: {fileID: 0}
  m_Enabled: 1
  m_EditorHideFlags: 0
  m_Script: {fileID: 11500000, guid: db42ea77b5104db198b22d79291dea4e, type: 3}
  m_Name: level_33
  m_EditorClassIdentifier: 
  LevelKey: level_33
  TimeOfLevel:
    Value: 82
  LevelTransferTriggerDataset:
    PositionTrigger:
      X: -1.36
      Y: 4.11
      Z: 92.49
    rotationTriggerTrigger:
      X: -0
      Y: 0
      Z: 0
    ColliderCenter:
      X: 0
      Y: 0
      Z: 0
    ColliderSize:
      X: 9
      Y: 9
      Z: 9
  StarsProgress:
    SnakeLenghtOnLevel: 74
  SpawnEnemySnakeDataset:
  - LenghtTile: 40
    SpeedSnake: 8
    CurrentTarget: 0
    DistanceToChangedTargetPoint: 1
    Points:
    - X: -12.207556
      Y: 20
      Z: -28.447693
    - X: 0.44578528
      Y: 20
      Z: -15.743776
    - X: 11.729653
      Y: 20
      Z: -28.624784
    - X: 0.18612403
      Y: 20
      Z: -40.348118
  - LenghtTile: 40
    SpeedSnake: 8
    CurrentTarget: 0
    DistanceToChangedTargetPoint: 1
    Points:
    - X: 11.744619
      Y: 15.861297
      Z: -28.447693
    - X: 0.14184356
      Y: 15.861297
      Z: -15.914846
    - X: -12.304679
      Y: 15.861297
      Z: -28.500353
    - X: 0.19769156
      Y: 15.861297
      Z: -40.248283
  - LenghtTile: 30
    SpeedSnake: 8
    CurrentTarget: 0
    DistanceToChangedTargetPoint: 1
    Points:
    - X: 14.608435
      Y: 15.861297
      Z: 0.10919571
    - X: 0.5447991
      Y: 13.616075
      Z: 16.540554
    - X: -14.363431
      Y: 14.355213
      Z: -0.23560596
    - X: 0.15091133
      Y: 15.861297
      Z: -12.116642
  - LenghtTile: 30
    SpeedSnake: 8
    CurrentTarget: 0
    DistanceToChangedTargetPoint: 1
    Points:
    - X: -23.651358
      Y: -3.710681
      Z: -9.276098
    - X: -11.434969
      Y: -2.6833372
      Z: 9.943939
    - X: 14.015024
      Y: -3.710681
      Z: -8.803246
    - X: 1.1883258
      Y: -4.959739
      Z: -28.27641
    - X: -18.29852
      Y: -3.6077018
      Z: -26.137814
  - LenghtTile: 30
    SpeedSnake: 8
    CurrentTarget: 0
    DistanceToChangedTargetPoint: 1
    Points:
    - X: 8.341839
      Y: 7.648837
      Z: -7.134329
    - X: -0.9654021
      Y: 5.7158422
      Z: 14.186672
    - X: -21.274794
      Y: 0.6283922
      Z: -0.0034656525
    - X: -21.274794
      Y: 0.6283922
      Z: -0.0034656525
    - X: -12.688321
      Y: -2.0941467
      Z: -22.844671
    - X: 4.117143
      Y: 2.23559
      Z: -15.990049
  - LenghtTile: 30
    SpeedSnake: 8
    CurrentTarget: 0
    DistanceToChangedTargetPoint: 1
    Points:
    - X: 24.387098
      Y: -1.3659697
      Z: -26.660213
    - X: 35.112865
      Y: -4.6459675
      Z: -10.287111
    - X: 22.389292
      Y: -0.98802376
      Z: 8.518946
    - X: 7.285449
      Y: 2.1004734
      Z: -1.2049999
    - X: 12.863156
      Y: -0.14336014
      Z: -21.672838
  SpawnerCollectibleObjects: []
  ApplePositions:
  - Position:
      X: -5.58
      Y: 0.85
      Z: 72.85
  - Position:
      X: -2.14
      Y: 4.12
      Z: 67.87
  - Position:
      X: 3.05
      Y: 7.16
      Z: 67.41
  - Position:
      X: 6.95
      Y: 9.46
      Z: 69.98
  - Position:
      X: 8.48
      Y: 12.43
      Z: 74.49
  - Position:
      X: 6.508
      Y: 15.14
      Z: 78.659
  - Position:
      X: 1.62
      Y: 17.51
      Z: 78.44
  - Position:
      X: 0.23000002
      Y: 23.04
      Z: 64.23
  - Position:
      X: 0.23
      Y: 18.95
      Z: 58.86
  - Position:
      X: 0.9899999
      Y: 15.76
      Z: 52.750004
  - Position:
      X: -1.62
      Y: 16.43
      Z: 46.74
  - Position:
      X: 0.77
      Y: 16.43
      Z: 41.12
  - Position:
      X: 0.77
      Y: 14.15
      Z: 34.11
  - Position:
      X: 0.77
      Y: 16.62
      Z: 28.22
  - Position:
      X: -9.95
      Y: 15.48
      Z: 10.48
  - Position:
      X: 6.53
      Y: 16.49
      Z: 10.48
  - Position:
      X: 11.24
      Y: 19.87
      Z: 3.53
  - Position:
      X: 17.39
      Y: 17.95
      Z: 2.62
  - Position:
      X: 21.32
      Y: 15.78
      Z: -1.82
  - Position:
      X: 20.489998
      Y: 13.8
      Z: -7.26
  - Position:
      X: 16.48
      Y: 16.31
      Z: -10.88
  - Position:
      X: 16.25
      Y: 18.41
      Z: -16.16
  - Position:
      X: 19.866
      Y: 20.28
      Z: -20.41
  - Position:
      X: 19.47
      Y: 17.96
      Z: -25.33
  - Position:
      X: 14.87
      Y: 16.63
      Z: -28.56
  - Position:
      X: -22.04
      Y: 16.63
      Z: -25.63
  - Position:
      X: -25.28
      Y: 15.96
      Z: -20.78
  - Position:
      X: -23.45
      Y: 13.65
      Z: -15.737
  - Position:
      X: -18.73
      Y: 14.3
      Z: -14.02
  - Position:
      X: -14.99
      Y: 16.8
      Z: -9.06
  - Position:
      X: -17.07
      Y: 18.67
      Z: -4.31
  - Position:
      X: -21.59
      Y: 20.19
      Z: -1.47
  - Position:
      X: -23.76
      Y: 18.6
      Z: 3.57
  - Position:
      X: -18.22
      Y: 16.84
      Z: 6.74
  - Position:
      X: -13.29
      Y: 16.84
      Z: 6.88
  - Position:
      X: -4.67
      Y: 15.48
      Z: 7.67
  - Position:
      X: -5.07
      Y: 12.55
      Z: 2.18
  - Position:
      X: -4.34
      Y: 9.32
      Z: -2.85
  - Position:
      X: 1.66
      Y: 5.98
      Z: -4.08
  - Position:
      X: 4.89
      Y: 3.47
      Z: 0.53
  - Position:
      X: 2.35
      Y: 0.77
      Z: 4.7
  - Position:
      X: -3.69
      Y: -0.01
      Z: 6.12
  - Position:
      X: -7.4
      Y: 2.17
      Z: 2.95
  - Position:
      X: -11.68
      Y: 4.18
      Z: 4.5
  - Position:
      X: -16.12
      Y: 2.24
      Z: 2.51
  - Position:
      X: -17.880001
      Y: 2.24
      Z: -2.82
  - Position:
      X: -14.6
      Y: 2.24
      Z: -7.3
  - Position:
      X: -14.38
      Y: 1.09
      Z: -12.01
  - Position:
      X: -17.74
      Y: -0.49
      Z: -15.01
  - Position:
      X: -18.8
      Y: -2.32
      Z: -20.91
  - Position:
      X: -14.09
      Y: -2.27
      Z: -24.42
  - Position:
      X: -8.52
      Y: -0.15
      Z: -22.19
  - Position:
      X: -5.02
      Y: 2.34
      Z: -17.54
  - Position:
      X: -0.44
      Y: 0.36
      Z: -14.57
  - Position:
      X: 5.43
      Y: -1.84
      Z: -14.46
  - Position:
      X: 10.06
      Y: -3.08
      Z: -16.22
  - Position:
      X: 14.78
      Y: -3.08
      Z: -12.84
  - Position:
      X: 14.03
      Y: -1.85
      Z: -6.88
  - Position:
      X: 12.62
      Y: -1.8
      Z: -1.03
  - Position:
      X: 16.61
      Y: -2.57
      Z: 2.5
  - Position:
      X: 21.64
      Y: -5.36
      Z: 1.65
  - Position:
      X: 24.32
      Y: -4.04
      Z: -2.77
  - Position:
      X: 23.58
      Y: -2.17
      Z: -7.56
  - Position:
      X: 27.03
      Y: -1.68
      Z: -11.23
  - Position:
      X: 32.05
      Y: -0.79
      Z: -12.28
  - Position:
      X: 35.1
      Y: 0.58
      Z: -16.01
  - Position:
      X: 33.72
      Y: 1.63
      Z: -20.55
  - Position:
      X: 28.59
      Y: 0.04
      Z: -23.71
  - Position:
      X: 23.95
      Y: -1.83
      Z: -24.37
  - Position:
      X: 19.01
      Y: -2.77
      Z: -24.34
  - Position:
      X: 15.95
      Y: -3.88
      Z: -27.74
  - Position:
      X: 10.77
      Y: -5.32
      Z: -28.43
  - Position:
      X: 4.06
      Y: -1.61
      Z: -29.66
  - Position:
      X: -0.31
      Y: -2.68
      Z: -33.06
  BadApplePositions:
  - Position:
      X: -22.54
      Y: 17.14
      Z: -29.66
  - Position:
      X: 0.2600001
      Y: 17.46
      Z: 58.9
  - Position:
      X: -0.98
      Y: 16.16
      Z: 52.86
  - Position:
      X: 0.46
      Y: 16.83
      Z: 46.85
  - Position:
      X: 0.82
      Y: 14.64
      Z: 41.2
  - Position:
      X: 0.82
      Y: 16.92
      Z: 34.21
  - Position:
      X: 7.95
      Y: 17.23
      Z: -31.34
  - Position:
      X: 11.67
      Y: 14.09
      Z: -27.94
  - Position:
      X: -0.52
      Y: 18.45
      Z: -33.01
  - Position:
      X: -0.46
      Y: 18.45
      Z: -21.81
  - Position:
      X: -10.32
      Y: 21.19
      Z: -25.19
  - Position:
      X: -11.73
      Y: 17.14
      Z: -28.93
  - Position:
      X: -18.82
      Y: 17.19
      Z: 4.62
  - Position:
      X: 10.42
      Y: 0.25
      Z: 0.87
  - Position:
      X: 22.69
      Y: -1.38
      Z: -11.68
  - Position:
      X: -14.5
      Y: 16.92
      Z: 9.88
  - Position:
      X: -16
      Y: 2.61
      Z: -2.8
  - Position:
      X: -16.25
      Y: 1.32
      Z: -11.75
  ScopePositions: []
  SkullPositions:
  - Position:
      X: 9.34
      Y: 21.99
      Z: -31.61
  - Position:
      X: 9.34
      Y: 17.89
      Z: -25.02
  - Position:
      X: -8.59
      Y: 15.62
      Z: -16.23
  - Position:
      X: -8.19
      Y: 22.84
      Z: -30.82
  - Position:
      X: -10.66
      Y: 17.89
      Z: -24.77
  - Position:
      X: 6.49
      Y: -1.99
      Z: -23.88
  - Position:
      X: 0.06
      Y: -0.94
      Z: -24.47
  - Position:
      X: -5.1
      Y: -0.25
      Z: -26.19
  - Position:
      X: -13.35
      Y: 0.03
      Z: -18.6
  - Position:
      X: 19.03
      Y: -1.99
      Z: -19.31
