%YAML 1.1
%TAG !u! tag:unity3d.com,2011:
--- !u!114 &11400000
MonoBehaviour:
  m_ObjectHideFlags: 0
  m_CorrespondingSourceObject: {fileID: 0}
  m_PrefabInstance: {fileID: 0}
  m_PrefabAsset: {fileID: 0}
  m_GameObject: {fileID: 0}
  m_Enabled: 1
  m_EditorHideFlags: 0
  m_Script: {fileID: 11500000, guid: db42ea77b5104db198b22d79291dea4e, type: 3}
  m_Name: level_26
  m_EditorClassIdentifier: 
  LevelKey: level_26
  TimeOfLevel:
    Value: 70
  LevelTransferTriggerDataset:
    PositionTrigger:
      X: 107.47
      Y: 18.91
      Z: 93.83
    rotationTriggerTrigger:
      X: -0
      Y: 0
      Z: 0
    ColliderCenter:
      X: 0
      Y: 0
      Z: 0
    ColliderSize:
      X: 9
      Y: 9
      Z: 9
  StarsProgress:
    SnakeLenghtOnLevel: 66
  SpawnEnemySnakeDataset:
  - LenghtTile: 25
    SpeedSnake: 8
    CurrentTarget: 0
    DistanceToChangedTargetPoint: 1
    Points:
    - X: 162.9632
      Y: 12.278132
      Z: 49.030045
    - X: 153.97899
      Y: 16.948092
      Z: 63.21626
    - X: 143.30026
      Y: 14.05241
      Z: 44.746414
  - LenghtTile: 25
    SpeedSnake: 8
    CurrentTarget: 0
    DistanceToChangedTargetPoint: 1
    Points:
    - X: 160.60368
      Y: 14.777422
      Z: 27.29277
    - X: 151.0173
      Y: 15.754218
      Z: 43.90174
    - X: 141.69574
      Y: 15.625626
      Z: 27.212784
  SpawnerCollectibleObjects: []
  ApplePositions:
  - Position:
      X: 109.03
      Y: 19.69
      Z: 75.799995
  - Position:
      X: 111.32
      Y: 19.56
      Z: 70.369995
  - Position:
      X: 108
      Y: 21.21
      Z: 66.04
  - Position:
      X: 107.6
      Y: 24.63
      Z: 60.59
  - Position:
      X: 111.06
      Y: 25.79
      Z: 56.83
  - Position:
      X: 115.68
      Y: 23.33
      Z: 54.74
  - Position:
      X: 120.549995
      Y: 21.05
      Z: 54.69
  - Position:
      X: 124.304
      Y: 18.94
      Z: 58.807
  - Position:
      X: 128.22
      Y: 17.11
      Z: 62.44
  - Position:
      X: 133.9
      Y: 17.11
      Z: 61.25
  - Position:
      X: 139.92
      Y: 15.5
      Z: 57.47
  - Position:
      X: 148.13
      Y: 16.6
      Z: 65.31
  - Position:
      X: 143.05
      Y: 17.609999
      Z: 61.83
  - Position:
      X: 158.97
      Y: 16.18
      Z: 65.21
  - Position:
      X: 161.79
      Y: 15.53
      Z: 60.22
  - Position:
      X: 164.06
      Y: 14.26
      Z: 56.21
  - Position:
      X: 168.21
      Y: 16.22
      Z: 52.24
  - Position:
      X: 173.81
      Y: 17.59
      Z: 52.32
  - Position:
      X: 178.95
      Y: 19.12
      Z: 55.8
  - Position:
      X: 184.04
      Y: 20.84
      Z: 55.35
  - Position:
      X: 186.54
      Y: 22.59
      Z: 50.11
  - Position:
      X: 190.83
      Y: 23.56
      Z: 46.3
  - Position:
      X: 196.14
      Y: 25.01
      Z: 44.2
  - Position:
      X: 200.46
      Y: 27.01
      Z: 46.39
  - Position:
      X: 205.41
      Y: 27.58
      Z: 46.98
  - Position:
      X: 207.46
      Y: 25.2
      Z: 50.25
  - Position:
      X: 204.1
      Y: 23.28
      Z: 53.37
  - Position:
      X: 200.58
      Y: 20.85
      Z: 50.28
  - Position:
      X: 199.67
      Y: 19.14
      Z: 45.22
  - Position:
      X: 201.99
      Y: 17.57
      Z: 40.76
  - Position:
      X: 207.02
      Y: 16.62
      Z: 38.21
  - Position:
      X: 205.89
      Y: 17.43
      Z: 32.75
  - Position:
      X: 199.69
      Y: 20.33
      Z: 30.12
  - Position:
      X: 195.15
      Y: 21.46
      Z: 28.36
  - Position:
      X: 192.8
      Y: 22.19
      Z: 24.16
  - Position:
      X: 191.76999
      Y: 19.46
      Z: 18.94
  - Position:
      X: 187.26
      Y: 17.48
      Z: 16.62
  - Position:
      X: 182.56
      Y: 16.09
      Z: 17.66
  - Position:
      X: 177.76
      Y: 17.48
      Z: 15.23
  - Position:
      X: 172.17
      Y: 18.86
      Z: 19.63
  - Position:
      X: 174.52
      Y: 20.14
      Z: 25.15
  - Position:
      X: 176.2
      Y: 21.31
      Z: 30.15
  - Position:
      X: 172.47
      Y: 22.12
      Z: 34.06
  - Position:
      X: 165.4
      Y: 19.69
      Z: 31.6
  - Position:
      X: 160.57
      Y: 17.23
      Z: 29.160002
  - Position:
      X: 154.73
      Y: 14.4
      Z: 30.2
  - Position:
      X: 148.13
      Y: 12.38
      Z: 29.160002
  - Position:
      X: 143.22
      Y: 12.38
      Z: 32.12
  - Position:
      X: 137.29
      Y: 14.18
      Z: 30.81
  - Position:
      X: 131.888
      Y: 17.29
      Z: 33.978
  - Position:
      X: 127.78
      Y: 19.84
      Z: 38.43
  - Position:
      X: 122.07
      Y: 22.05
      Z: 40.44
  - Position:
      X: 117.36
      Y: 24.58
      Z: 38.66
  - Position:
      X: 112.39
      Y: 25.76
      Z: 36.5
  - Position:
      X: 105.83
      Y: 25.76
      Z: 37.94
  - Position:
      X: 101.63
      Y: 25.76
      Z: 34.16
  - Position:
      X: 97.69
      Y: 23.81
      Z: 32.73
  - Position:
      X: 92.28
      Y: 22.13
      Z: 34.64
  - Position:
      X: 87.53
      Y: 19.91
      Z: 30.63
  - Position:
      X: 88.5
      Y: 18.24
      Z: 24.88
  - Position:
      X: 96.02
      Y: 18.24
      Z: 24.55
  - Position:
      X: 102.02
      Y: 20.41
      Z: 26.72
  - Position:
      X: 108.27
      Y: 22.06
      Z: 27.49
  - Position:
      X: 112.56
      Y: 19.31
      Z: 23.89
  - Position:
      X: 113.82
      Y: 17.26
      Z: 18.47
  - Position:
      X: 110.49
      Y: 15.94
      Z: 13.45
  BadApplePositions:
  - Position:
      X: 110.81
      Y: 26.29
      Z: 54.360004
  - Position:
      X: 116.14
      Y: 23.619999
      Z: 52.48
  - Position:
      X: 120.56
      Y: 19.25
      Z: 54.59
  - Position:
      X: 127.97
      Y: 17.67
      Z: 66.72
  - Position:
      X: 143.01
      Y: 15.97
      Z: 61.93
  - Position:
      X: 157.3
      Y: 16.87
      Z: 63.219997
  - Position:
      X: 168.62
      Y: 16.9
      Z: 47.66
  - Position:
      X: 179.45
      Y: 19.53
      Z: 58.32
  - Position:
      X: 190.67
      Y: 23.94
      Z: 44.32
  - Position:
      X: 211.15
      Y: 19.3
      Z: 38.01
  - Position:
      X: 192.67001
      Y: 20.640001
      Z: 24.14
  - Position:
      X: 191.64
      Y: 17.91
      Z: 18.92
  - Position:
      X: 168.62
      Y: 19.36
      Z: 19.77
  - Position:
      X: 178.75
      Y: 22.57
      Z: 30.9
  - Position:
      X: 172.61
      Y: 22.62
      Z: 37.69
  - Position:
      X: 160.64
      Y: 17.619999
      Z: 31.45
  - Position:
      X: 154.5
      Y: 14.89
      Z: 27.94
  - Position:
      X: 148.2
      Y: 12.77
      Z: 31.45
  - Position:
      X: 132.52
      Y: 16.67
      Z: 37.97
  - Position:
      X: 127.99
      Y: 16.67
      Z: 33.16
  - Position:
      X: 117.94
      Y: 24.91
      Z: 36.29
  - Position:
      X: 112.25
      Y: 26.09
      Z: 39.32
  - Position:
      X: 106.41
      Y: 26.09
      Z: 35.57
  - Position:
      X: 91.19
      Y: 24.03
      Z: 37.6
  - Position:
      X: 94.49
      Y: 24.03
      Z: 38.3
  - Position:
      X: 94.13
      Y: 18.38
      Z: 19.06
  - Position:
      X: 90.54
      Y: 18.38
      Z: 19.85
  ScopePositions: []
  SkullPositions:
  - Position:
      X: 103.97
      Y: 22.68
      Z: 30.18
