{
    "name": "InputControl",
    "maps": [
        {
            "name": "PlayerMovement",
            "id": "2e8e09ed-29a4-4346-8b64-c71824901d75",
            "actions": [
                {
                    "name": "Movement",
                    "type": "PassThrough",
                    "id": "5c59eb9c-67c7-4176-955f-9e9dffe887de",
                    "expectedControlType": "Vector2",
                    "processors": "",
                    "interactions": "",
                    "initialStateCheck": false
                },
                {
                    "name": "Camera",
                    "type": "PassThrough",
                    "id": "d180112d-78b3-4b55-968c-75a2228c26da",
                    "expectedControlType": "Vector2",
                    "processors": "",
                    "interactions": "",
                    "initialStateCheck": false
                },
                {
                    "name": "Roll",
                    "type": "Button",
                    "id": "c97a6c57-829f-4318-8a98-a0f6fc5f0ccb",
                    "expectedControlType": "Button",
                    "processors": "",
                    "interactions": "",
                    "initialStateCheck": false
                },
                {
                    "name": "Sprint",
                    "type": "Button",
                    "id": "0f60fd23-c6ef-4439-a682-65d9e62c47aa",
                    "expectedControlType": "Button",
                    "processors": "",
                    "interactions": "",
                    "initialStateCheck": false
                },
                {
                    "name": "RunMode",
                    "type": "Button",
                    "id": "228e5562-c2c9-4d20-92ec-2a91ece0a292",
                    "expectedControlType": "Button",
                    "processors": "",
                    "interactions": "",
                    "initialStateCheck": false
                }
            ],
            "bindings": [
                {
                    "name": "WASD",
                    "id": "7ec59e4b-21fa-446a-9787-312415d531c1",
                    "path": "2DVector",
                    "interactions": "",
                    "processors": "",
                    "groups": "",
                    "action": "Movement",
                    "isComposite": true,
                    "isPartOfComposite": false
                },
                {
                    "name": "up",
                    "id": "6ad4bead-c204-4df1-b393-43fe5b9fe8a6",
                    "path": "<Keyboard>/w",
                    "interactions": "",
                    "processors": "",
                    "groups": "",
                    "action": "Movement",
                    "isComposite": false,
                    "isPartOfComposite": true
                },
                {
                    "name": "down",
                    "id": "09dde8ec-0892-4a87-99fb-23bfaaa10d6f",
                    "path": "<Keyboard>/s",
                    "interactions": "",
                    "processors": "",
                    "groups": "",
                    "action": "Movement",
                    "isComposite": false,
                    "isPartOfComposite": true
                },
                {
                    "name": "left",
                    "id": "1fa711f9-5549-4a68-97d1-9f5c858d6f9a",
                    "path": "<Keyboard>/a",
                    "interactions": "",
                    "processors": "",
                    "groups": "",
                    "action": "Movement",
                    "isComposite": false,
                    "isPartOfComposite": true
                },
                {
                    "name": "right",
                    "id": "cc7a9634-6bb9-4421-ab26-c68c553dbab3",
                    "path": "<Keyboard>/d",
                    "interactions": "",
                    "processors": "",
                    "groups": "",
                    "action": "Movement",
                    "isComposite": false,
                    "isPartOfComposite": true
                },
                {
                    "name": "Arrows",
                    "id": "c3da1ee4-814b-4ac1-a3dc-e7f3300dedf3",
                    "path": "2DVector",
                    "interactions": "",
                    "processors": "",
                    "groups": "",
                    "action": "Movement",
                    "isComposite": true,
                    "isPartOfComposite": false
                },
                {
                    "name": "up",
                    "id": "211fcc19-254f-436c-bba1-f1fb83d95e5f",
                    "path": "<Keyboard>/upArrow",
                    "interactions": "",
                    "processors": "",
                    "groups": "",
                    "action": "Movement",
                    "isComposite": false,
                    "isPartOfComposite": true
                },
                {
                    "name": "down",
                    "id": "4bdf35ad-fbe6-4551-8e78-e4a9cb0b61cc",
                    "path": "<Keyboard>/downArrow",
                    "interactions": "",
                    "processors": "",
                    "groups": "",
                    "action": "Movement",
                    "isComposite": false,
                    "isPartOfComposite": true
                },
                {
                    "name": "left",
                    "id": "af66aa54-cf12-47e5-87f9-c00949f7eec7",
                    "path": "<Keyboard>/leftArrow",
                    "interactions": "",
                    "processors": "",
                    "groups": "",
                    "action": "Movement",
                    "isComposite": false,
                    "isPartOfComposite": true
                },
                {
                    "name": "right",
                    "id": "225b5716-1103-4586-96a7-4962371634c4",
                    "path": "<Keyboard>/rightArrow",
                    "interactions": "",
                    "processors": "",
                    "groups": "",
                    "action": "Movement",
                    "isComposite": false,
                    "isPartOfComposite": true
                },
                {
                    "name": "",
                    "id": "a4ef8da9-4f20-43e9-b357-eff42c5c5a3f",
                    "path": "<Mouse>/delta",
                    "interactions": "",
                    "processors": "",
                    "groups": "",
                    "action": "Camera",
                    "isComposite": false,
                    "isPartOfComposite": false
                },
                {
                    "name": "",
                    "id": "da3f0b2a-45a6-4fc4-98e8-32824295a9df",
                    "path": "<Keyboard>/leftShift",
                    "interactions": "Hold(duration=1,pressPoint=0.5)",
                    "processors": "",
                    "groups": "",
                    "action": "Sprint",
                    "isComposite": false,
                    "isPartOfComposite": false
                },
                {
                    "name": "",
                    "id": "a7195df4-366f-4294-9c4a-1bac93a8d1c8",
                    "path": "<Keyboard>/x",
                    "interactions": "",
                    "processors": "",
                    "groups": "",
                    "action": "RunMode",
                    "isComposite": false,
                    "isPartOfComposite": false
                },
                {
                    "name": "",
                    "id": "67d0f464-1673-4dbb-aebf-d90865fce45e",
                    "path": "<Keyboard>/leftShift",
                    "interactions": "Tap(duration=0.3,pressPoint=0.2)",
                    "processors": "",
                    "groups": "",
                    "action": "Roll",
                    "isComposite": false,
                    "isPartOfComposite": false
                }
            ]
        },
        {
            "name": "PlayerAction",
            "id": "0e0733a7-180d-4833-89a2-5190caaf22de",
            "actions": [
                {
                    "name": "LMB",
                    "type": "Button",
                    "id": "1712df00-2060-4b87-b4bf-49dc0ba25c15",
                    "expectedControlType": "Button",
                    "processors": "",
                    "interactions": "",
                    "initialStateCheck": false
                },
                {
                    "name": "RMB",
                    "type": "Button",
                    "id": "0f732750-9a0c-4812-baec-d6544e9b9d94",
                    "expectedControlType": "Button",
                    "processors": "",
                    "interactions": "",
                    "initialStateCheck": false
                }
            ],
            "bindings": [
                {
                    "name": "",
                    "id": "fb1971e8-e788-4ecd-b702-da28eef0f087",
                    "path": "<Mouse>/leftButton",
                    "interactions": "",
                    "processors": "",
                    "groups": "",
                    "action": "LMB",
                    "isComposite": false,
                    "isPartOfComposite": false
                },
                {
                    "name": "",
                    "id": "b7e41632-7c02-4a8c-a415-5e8cede946fe",
                    "path": "<Mouse>/rightButton",
                    "interactions": "",
                    "processors": "",
                    "groups": "",
                    "action": "RMB",
                    "isComposite": false,
                    "isPartOfComposite": false
                }
            ]
        }
    ],
    "controlSchemes": []
}