<?xml version="1.0" encoding="UTF-8" standalone="no"?>
<!-- Created with Inkscape (http://www.inkscape.org/) -->

<svg
   xmlns:dc="http://purl.org/dc/elements/1.1/"
   xmlns:cc="http://creativecommons.org/ns#"
   xmlns:rdf="http://www.w3.org/1999/02/22-rdf-syntax-ns#"
   xmlns:svg="http://www.w3.org/2000/svg"
   xmlns="http://www.w3.org/2000/svg"
   xmlns:sodipodi="http://sodipodi.sourceforge.net/DTD/sodipodi-0.dtd"
   xmlns:inkscape="http://www.inkscape.org/namespaces/inkscape"
   width="130.0238mm"
   height="131.02377mm"
   viewBox="0 0 130.0238 131.02377"
   version="1.1"
   id="svg8"
   inkscape:version="0.92.2 2405546, 2018-03-11"
   sodipodi:docname="icon.svg">
  <defs
     id="defs2" />
  <sodipodi:namedview
     id="base"
     pagecolor="#ffffff"
     bordercolor="#666666"
     borderopacity="1.0"
     inkscape:pageopacity="0.0"
     inkscape:pageshadow="2"
     inkscape:zoom="0.70710678"
     inkscape:cx="429.07949"
     inkscape:cy="248.25871"
     inkscape:document-units="mm"
     inkscape:current-layer="layer1"
     showgrid="false"
     inkscape:snap-bbox="true"
     inkscape:snap-bbox-edge-midpoints="true"
     showguides="true"
     inkscape:guide-bbox="true"
     inkscape:bbox-paths="true"
     inkscape:bbox-nodes="true"
     inkscape:snap-intersection-paths="true"
     inkscape:snap-midpoints="true"
     inkscape:snap-object-midpoints="true"
     inkscape:snap-nodes="true"
     inkscape:snap-others="true"
     inkscape:window-width="1366"
     inkscape:window-height="704"
     inkscape:window-x="0"
     inkscape:window-y="0"
     inkscape:window-maximized="1"
     fit-margin-top="0"
     fit-margin-left="0"
     fit-margin-right="0"
     fit-margin-bottom="0"
     inkscape:snap-smooth-nodes="true"
     inkscape:object-paths="true" />
  <metadata
     id="metadata5">
    <rdf:RDF>
      <cc:Work
         rdf:about="">
        <dc:format>image/svg+xml</dc:format>
        <dc:type
           rdf:resource="http://purl.org/dc/dcmitype/StillImage" />
        <dc:title />
      </cc:Work>
    </rdf:RDF>
  </metadata>
  <g
     inkscape:label="Layer 1"
     inkscape:groupmode="layer"
     id="layer1"
     transform="translate(-3.0238095,-150.85713)">
    <path
       style="fill:#01baff;fill-opacity:1;stroke:none;stroke-width:0.26458332px;stroke-linecap:butt;stroke-linejoin:miter;stroke-opacity:1"
       d="m 19.276783,151.85713 h 97.517847 c 16.25298,0 16.25298,0 16.25298,16.25297 v 97.51783 c 0,16.25298 0,16.25298 -16.25298,16.25298 H 19.276783 c -16.2529735,0 -16.2529735,0 -16.2529735,-16.25298 V 168.1101 c 0,-16.25297 0,-16.25297 16.2529735,-16.25297 z m 41.648245,77.38813 7.242968,-3.09406 6.978383,3.22635 -5.333007,2.96177 v 1.88798 l 12.443682,-1.88798 -14.221347,1.96519 -14.221355,-1.96519 12.443682,1.81077 v -1.81077 z"
       id="path817"
       inkscape:connector-curvature="0"
       sodipodi:nodetypes="cccccccccccccccccccc"
       inkscape:export-xdpi="29.302328"
       inkscape:export-ydpi="29.302328"
       inkscape:export-filename="/home/lighty/Desktop/Panda Extension/Panda Extension/icon.png" />
    <path
       style="fill:#000000;stroke:none;stroke-width:0.26458332px;stroke-linecap:butt;stroke-linejoin:miter;stroke-opacity:1;fill-opacity:0.44360903"
       d="m 33.547616,255.07537 26.805535,26.80554 h 56.441479 c 16.25297,0 16.25297,0 16.25298,-16.25298 V 186.3159 L 117.1902,170.45849 Z"
       id="path845"
       inkscape:connector-curvature="0"
       sodipodi:nodetypes="ccccccc"
       inkscape:export-filename="/home/lighty/Desktop/Panda Extension/Panda Extension/icon.png"
       inkscape:export-xdpi="29.302328"
       inkscape:export-ydpi="29.302328" />
    <g
       id="g943"
       transform="translate(2.2550772e-6,2.9400961)"
       inkscape:export-xdpi="29.302328"
       inkscape:export-ydpi="29.302328"
       inkscape:export-filename="/home/lighty/Desktop/Panda Extension/Panda Extension/icon.png">
      <circle
         r="20.327267"
         cy="181.98965"
         cx="102.91504"
         id="path891-3"
         style="fill:#000000;fill-opacity:1;stroke:none;stroke-width:0.22754127;stroke-miterlimit:4;stroke-dasharray:none;stroke-opacity:1" />
      <circle
         r="20.327269"
         cy="181.98967"
         cx="33.156364"
         id="path891-3-6"
         style="fill:#000000;fill-opacity:1;stroke:none;stroke-width:0.22754128;stroke-miterlimit:4;stroke-dasharray:none;stroke-opacity:1" />
      <circle
         r="49.326843"
         cy="216.86902"
         cx="68.035706"
         id="path871"
         style="fill:#ffffff;fill-opacity:1;stroke:none;stroke-width:0.18099999;stroke-miterlimit:4;stroke-dasharray:none;stroke-opacity:1" />
    </g>
    <ellipse
       style="fill:#000000;fill-opacity:1;stroke:none;stroke-width:0.18099999;stroke-miterlimit:4;stroke-dasharray:none;stroke-opacity:1"
       id="path1087-9"
       cx="72.635033"
       cy="219.14694"
       rx="11.914644"
       ry="15.597834"
       transform="matrix(-0.74874699,0.66285589,0.66285589,0.74874699,0,0)"
       inkscape:export-xdpi="29.302328"
       inkscape:export-ydpi="29.302328"
       inkscape:export-filename="/home/lighty/Desktop/Panda Extension/Panda Extension/icon.png" />
    <circle
       style="fill:#ffffff;fill-opacity:1;stroke:none;stroke-width:0.18099999;stroke-miterlimit:4;stroke-dasharray:none;stroke-opacity:1"
       id="path1070"
       cx="85.892426"
       cy="207.24702"
       r="4.9851546"
       inkscape:export-xdpi="29.302328"
       inkscape:export-ydpi="29.302328"
       inkscape:export-filename="/home/lighty/Desktop/Panda Extension/Panda Extension/icon.png" />
    <ellipse
       style="fill:#000000;fill-opacity:1;stroke:none;stroke-width:0.18099999;stroke-miterlimit:4;stroke-dasharray:none;stroke-opacity:1"
       id="path1087"
       cx="174.57654"
       cy="128.89948"
       rx="11.914644"
       ry="15.597834"
       transform="rotate(41.518044)"
       inkscape:export-xdpi="29.302328"
       inkscape:export-ydpi="29.302328"
       inkscape:export-filename="/home/lighty/Desktop/Panda Extension/Panda Extension/icon.png" />
    <circle
       style="fill:#ffffff;fill-opacity:1;stroke:none;stroke-width:0.18099999;stroke-miterlimit:4;stroke-dasharray:none;stroke-opacity:1"
       id="path1070-2"
       cx="50.257038"
       cy="207.24702"
       r="4.9851546"
       inkscape:export-xdpi="29.302328"
       inkscape:export-ydpi="29.302328"
       inkscape:export-filename="/home/lighty/Desktop/Panda Extension/Panda Extension/icon.png" />
    <path
       style="fill:none;stroke:#000000;stroke-width:0.26458332px;stroke-linecap:butt;stroke-linejoin:miter;stroke-opacity:1"
       d="M 68.035706,232.33932 H 64.480365"
       id="path1151"
       inkscape:connector-curvature="0"
       inkscape:export-xdpi="29.302328"
       inkscape:export-ydpi="29.302328"
       inkscape:export-filename="/home/lighty/Desktop/Panda Extension/Panda Extension/icon.png" />
    <path
       style="fill:none;stroke:#000000;stroke-width:0.26458332px;stroke-linecap:butt;stroke-linejoin:miter;stroke-opacity:1"
       d="m 68.035706,232.33932 h 3.555336"
       id="path1155"
       inkscape:connector-curvature="0"
       inkscape:export-xdpi="29.302328"
       inkscape:export-ydpi="29.302328"
       inkscape:export-filename="/home/lighty/Desktop/Panda Extension/Panda Extension/icon.png" />
    <path
       style="fill:#000000;fill-opacity:1;stroke:none;stroke-width:0.26458332px;stroke-linecap:butt;stroke-linejoin:miter;stroke-opacity:1"
       d="m 60.925027,234.53696 c 10e-7,-2.09916 2.586576,-3.09406 7.110679,-3.09406 4.38028,0 7.110673,0.9925 7.110672,3.22635 10e-7,1.76259 -2.432001,2.96177 -5.333006,2.96177 l -0.450527,5.04621 c 6.935985,3.58906 9.731377,0.14579 11.665224,-4.2337 l 1.160045,0.17748 c -0.799973,6.34473 -8.308602,10.11921 -14.152408,5.1446 -7.599671,5.07455 -12.948005,0.93179 -14.135156,-5.60565 l 1.091841,0.009 c 2.437006,4.96462 4.288417,8.37606 11.677558,4.70139 l -0.411915,-5.23924 c -1.777665,0 -5.333006,-1.21007 -5.333007,-3.09406 z"
       id="path1165"
       inkscape:connector-curvature="0"
       sodipodi:nodetypes="sccccccccccccs"
       inkscape:export-xdpi="29.302328"
       inkscape:export-ydpi="29.302328"
       inkscape:export-filename="/home/lighty/Desktop/Panda Extension/Panda Extension/icon.png" />
  </g>
</svg>
