%YAML 1.1
%TAG !u! tag:unity3d.com,2011:
--- !u!114 &11400000
MonoBehaviour:
  m_ObjectHideFlags: 0
  m_CorrespondingSourceObject: {fileID: 0}
  m_PrefabInstance: {fileID: 0}
  m_PrefabAsset: {fileID: 0}
  m_GameObject: {fileID: 0}
  m_Enabled: 1
  m_EditorHideFlags: 0
  m_Script: {fileID: 11500000, guid: 5be51871efa6c3e4eae1703925c8f5ac, type: 3}
  m_Name: LanguagePhrases
  m_EditorClassIdentifier: 
  m_SharedTableData: {fileID: 11400000, guid: 53ba66d2e14411e43a0ed8ad0e9e32c8, type: 2}
  m_Tables:
  - {fileID: 11400000, guid: ffe6907c76cbe8f4dbb67a139693b589, type: 2}
  - {fileID: 11400000, guid: 5f43eeb649868c747844c9e2fa2b4f8b, type: 2}
  m_Extensions: []
  m_Group: String Table
  references:
    version: 2
    RefIds: []
