﻿Jahr,Gesetz,Einspeiseverguetung_Wind,Einspeiseverguetung_Sonne,Schlagworte_Mechanismen,Dummy_EEG
1991,Stromeinspeisegesetz,8.2,8.2,"Einführung Einspeisevergütung,",1
1992,Stromeinspeisegesetz,8.2,8.2,",",0
1993,Stromeinspeisegesetz,8.2,8.2,",",0
1994,Stromeinspeisegesetz,8.2,8.2,",",0
1995,Stromeinspeisegesetz,8.2,8.2,",",0
1996,Stromeinspeisegesetz,8.2,8.2,",",0
1997,Stromeinspeisegesetz,8.2,8.2,",",0
1998,Stromeinspeisegesetz,8.2,8.2,",",0
1999,Stromeinspeisegesetz,8.2,8.2,",",0
2000,Erneuerbare Energien Gesetz 2000,7.7,50.6,"Erhöhung der Einspeisevergütungssätze mit Degression (Wind 1 %; Sonne 5 %; Biomasse 1.5 %),",1
2001,Erneuerbare Energien Gesetz,7.6,48.1,",",0
2002,Erneuerbare Energien Gesetz,9.1,50.3,",",0
2003,Erneuerbare Energien Gesetz,9.1,49,",",0
2004,Novelle Erneuerbare Energien Gesetz,9,50.8,"Erhöhung der Einspeisevergütungssätze,",1
2005,Erneuerbare Energien Gesetz,9,53,",",0
2006,Erneuerbare Energien Gesetz,8.9,53,",",0
2007,Erneuerbare Energien Gesetz,8.8,52,",",0
2008,Erneuerbare Energien Gesetz,8.8,50.2,",",0
2009,Novelle Erneuerbare Energien Gesetz,8.8,48,"Einführung einer gleitenden Degression bei Solarenergie; Nutzung erneuerbarer Energien für die Wärmemeerzeugung; Novelle Kraft-Wärmekopplungsgesetz,",1
2010,Erneuerbare Energien Gesetz,8.8,43.6,",",0
2011,Erneuerbare Energien Gesetz,8.6,40.2,",",0
2012,Novelle Erneuerbare Energien Gesetz,7.3,36.1,"Veränderte Differenzierung nach Anlagengröße, Einführung Marktprämienmodell; Senkung der Einspeisevergütung bei Solarenergie",1
2013,Erneuerbare Energien Gesetz,6.9,32.5,",",0
2014,Novelle Erneuerbare Energien Gesetz,7.2,31,"Senkung der Einspeisevergütungen; Windkraftausbau auf See,",1
2015,Erneuerbare Energien Gesetz,7.2,30.2,",",0
2016,Erneuerbare Energien Gesetz,7.1,29.6,",",0
2017,Novelle Erneuerbare Energien Gesetz,6.6,28.9,"Umstellung des Fördersystems von Einspeisevergütung auf ein Ausschreibungsverfahren,",1
2018,Erneuerbare Energien Gesetz,5.5,27.4,",",0
2019,Erneuerbare Energien Gesetz,5.9,26.6,",",0
2020,Erneuerbare Energien Gesetz,4,20.1,",",0
2021,Novelle Erneuerbare Energien Gesetz,3.9,19.1,"Verbesserung der Bedingungen durch Abschaffung der EEG-Umlage für selbstproduzierten Strom,",1
