Jahr,Gesetz,Einspeisevergütungen auf Wind,Einspeisevergütungen auf Sonne,Einspeisevergütungen auf Wasser,Einspeisevergütungen auf Sonstige,"Schlagworte bzw. Mechanismen"","
1991,Stromeinspeisegesetz,90 % des durschnittlichen Strompreises,90 % des durschnittlichen Strompreises,75 % des durschnittlichen Strompreises,75 % des durschnittlichen Strompreises,"Einführung Einspeisevergütung"","
1994,Anhebung der Einspeisevergütung,,,80 % des durchschnittlichen Strompreises,80 % des durchschnittlichen Strompreises,"Anpassung Einspeisevergütung"","
2000,Einführung Erneuerbare Energien Gesetz,7.7,50.6,7.7,9.5,"Erhöhung der Einspeisevergütungssätze mit Degression (Wind 1 %; Sonne 5 %; Biomasse 1.5 %)"","
2001,Erneuerbare Energien Gesetz,7.6,48.1,7.7,9.4,""","
2002,Erneuerbare Energien Gesetz,9.1,50.3,7.7,9.2,""","
2003,Erneuerbare Energien Gesetz,9.1,49,7.7,9.1,""","
2004,Novelle Erneuerbare Energien Gesetz,9,50.8,,,"Erhöhung der Einspeisevergütungssätze"","
2005,Erneuerbare Energien Gesetz,9,53,,,""","
2006,Erneuerbare Energien Gesetz,8.9,53,,,""","
2007,Erneuerbare Energien Gesetz,8.8,52,,,""","
2008,Erneuerbare Energien Gesetz,8.8,50.2,,,""","
2009,Novelle Erneuerbare Energien Gesetz,8.8,48,,,"Einführung einer gleitenden Degression bei Solarenergie; Nutzung erneuerbarer Energien für die Wärmemeerzeugung; Novelle Kraft-Wärmekopplungsgesetz"","
2010,Erneuerbare Energien Gesetz,8.8,43.6,,,""","
2011,Erneuerbare Energien Gesetz,8.6,40.2,,,""","
2012,Novelle Erneuerbare Energien Gesetz,7.3,36.1,,,"""""Veränderte Differenzierung nach Anlagengröße"","" Einführung Marktprämienmodell; Senkung der Einspeisevergütung bei Solarenergie"""""""
2013,Erneuerbare Energien Gesetz,6.9,32.5,,,""","
2014,Novelle Erneuerbare Energien Gesetz,7.2,31,,,"Senkung der Einspeisevergütungen; Windkraftausbau auf See"","
2015,Erneuerbare Energien Gesetz,7.2,30.2,,,""","
2016,Erneuerbare Energien Gesetz,7.1,29.6,,,""","
2017,Novelle Erneuerbare Energien Gesetz,6.6,28.9,,,"Umstellung des Fördersystems von Einspeisevergütung auf ein Ausschreibungsverfahren"","
2018,Erneuerbare Energien Gesetz,5.5,27.4,,,""","
2019,Erneuerbare Energien Gesetz,5.9,26.6,,,""","
,,,,,,""","
2020,Erneuerbare Energien Gesetz,4,20.1,,,""","
2021,Novelle Erneuerbare Energien Gesetz,3.9,19.1,,,"Verbesserung der Bedingungen durch Abschaffung der EEG-Umlage für selbstproduzierten Strom"","
