
010-1,49,23,0	warp	ToWoodland7	0,0,011-1,46,99
010-1,14,55,0	warp	ToWoodland8	0,0,015-1,92,54
010-1,36,94,0	warp	ToDimondsCove	0,0,010-2,32,44
010-1,56,104,0	warp	ToWoodland9	1,0,016-1,56,21
010-1,131,54,0	warp	ToWoodland10	0,0,007-1,25,53
