
020-4,0,0,0,0	monster	Bat	1017,5,0,0,Mob21::OnBat
020-4,0,0,0,0	monster	Moggun	1066,7,0,0,Mob21::OnMoggun

020-4,0,0,0	script	Mob21	NPCMINUS1,{
OnBat:
	set @mobId, 1017;
	callfunc "MobPoints";
	end;

OnFluffy:
	set @mobId, 1020;
	callfunc "MobPoints";
	end;
}
