
001-1,57,52,0	script	[Tybalt]	NPC107,{
	callfunc "ClearVariables";
	set @npcname$, "Tybalt";
	callfunc "Banker";
	close;
}

001-1,51,29,0	script	[Achar]	NPC49,{
	callfunc "ClearVariables";
	openstorage;
	mes "Komm' bald wieder!";
	close;
}
