kasinowin,64,44,0	script	#zimmer1	NPC127,0,0,{
if (isat("kasinowin", 64, 44)) goto Good_pos;
	end;
Good_pos:
if( hatzimmer == 1 ) goto Aenter;
	end;
Aenter:
	warp "kasinowin", 100,24;
	end;
}

kasinowin,64,50,0	script	#zimmer2	NPC127,0,0,{
if (isat("kasinowin", 64, 50)) goto Good_pos;
	end;
Good_pos:
if( hatzimmer == 2 ) goto Aenter;
	end;
Aenter:
	warp "kasinowin", 122,24;
	end;
}

kasinowin,64,56,0	script	#zimmer3	NPC127,0,0,{
if (isat("kasinowin", 64, 56)) goto Good_pos;
	end;
Good_pos:
if( hatzimmer == 3 ) goto Aenter;
	end;
Aenter:
	warp "kasinowin", 21,130;
	end;
}

kasinowin,64,62,0	script	#zimmer4	NPC127,0,0,{
if (isat("kasinowin", 64, 62)) goto Good_pos;
	end;
Good_pos:
if( hatzimmer == 4 ) goto Aenter;
	end;
Aenter:
	warp "kasinowin", 43,130;
	end;
}

kasinowin,64,68,0	script	#zimmer5	NPC127,0,0,{
if (isat("kasinowin", 64,68)) goto Good_pos;
	end;
Good_pos:
if( hatzimmer == 5 ) goto Aenter;
	end;
Aenter:
	warp "kasinowin", 65,130;
	end;
}

kasinowin,64,74,0	script	#zimmer6	NPC127,0,0,{
if (isat("kasinowin", 64, 74)) goto Good_pos;
	end;
Good_pos:
if( hatzimmer == 6 ) goto Aenter;
	end;
Aenter:
	warp "kasinowin", 87,130;
	end;
}

kasinowin,64,80,0	script	#zimmer7	NPC127,0,0,{
if (isat("kasinowin", 64, 80)) goto Good_pos;
	end;
Good_pos:
if( hatzimmer == 7 ) goto Aenter;
	end;
Aenter:
	warp "kasinowin", 109,130;
	end;
}

kasinowin,75,44,0	script	#zimmer8	NPC127,0,0,{
if (isat("kasinowin", 75, 44)) goto Good_pos;
	end;
Good_pos:
if( hatzimmer == 8 ) goto Aenter;
	end;
Aenter:
	warp "kasinowin", 92,46;
	end;
}

kasinowin,75,50,0	script	#zimmer9	NPC127,0,0,{
if (isat("kasinowin", 75, 50)) goto Good_pos;
	end;
Good_pos:
if( hatzimmer == 9 ) goto Aenter;
	end;
Aenter:
	warp "kasinowin", 114,46;
	end;
}

kasinowin,75,56,0	script	#zimmer10	NPC127,0,0,{
if (isat("kasinowin", 75, 56)) goto Good_pos;
	end;
Good_pos:
if( hatzimmer == 10 ) goto Aenter;
	end;
Aenter:
	warp "kasinowin", 101,108;
	end;
}

kasinowin,75,62,0	script	#zimmer11	NPC127,0,0,{
if (isat("kasinowin", 75, 62)) goto Good_pos;
	end;
Good_pos:
if( hatzimmer == 11 ) goto Aenter;
	end;
Aenter:
	warp "kasinowin", 79,108;
	end;
}

kasinowin,75,68,0	script	#zimmer12	NPC127,0,0,{
if (isat("kasinowin", 75, 68)) goto Good_pos;
	end;
Good_pos:
if( hatzimmer == 12 ) goto Aenter;
	end;
Aenter:
	warp "kasinowin", 57,108;
	end;
}

kasinowin,75,74,0	script	#zimmer13	NPC127,0,0,{
if (isat("kasinowin", 75, 74)) goto Good_pos;
	end;
Good_pos:
if( hatzimmer == 13 ) goto Aenter;
	end;
Aenter:
	warp "kasinowin", 35,108;
	end;
}

kasinowin,75,80,0	script	#zimmer14	NPC127,0,0,{
if (isat("kasinowin", 75, 80)) goto Good_pos;
	end;
Good_pos:
if( hatzimmer == 14 ) goto Aenter;
	end;
Aenter:
	warp "kasinowin", 13,108;
	end;
}

