
021-1,55,146,0	warp	toBazaar	3,0,001-1,44,20
021-1,136,146,0	warp	toSouthTulimshar	0,0,001-1,124,21
021-1,53,134,0	warp	toBuilding1	0,0,021-2,27,29
021-1,55,134,0	warp	toBuilding2	0,0,021-2,33,29
021-1,57,134,0	warp	toBuilding3	0,0,021-2,39,29
021-1,103,100,0	warp	toBakery1	0,0,021-2,91,27
021-1,103,96,0	warp	toBakery2	0,0,021-2,122,23
021-1,49,63,0	warp	toMagicSchool	3,0,024-1,86,72
021-1,53,99,0	warp	toTaylor1	0,0,021-2,25,66
021-1,52,95,0	warp	toTaylor2	0,0,021-2,23,98
021-1,73,21,0	warp	totulim1	1,0,022-1,73,107
021-1,113,21,0	warp	totulim2	1,0,022-1,113,107
021-1,157,97,0	warp	toschloss	0,1,024-4,13,21
