
008-1,54,61,0	warp	HurnscaldWestGate	0,1,009-1,26,36
008-1,79,80,0	warp	HurnscaldSouthGate	2,0,009-1,48,54
008-1,127,61,0	warp	HurnscaldEastGate	0,0,009-1,96,35
008-1,79,49,0	warp	HurnscaldNorthGate	2,0,009-1,48,24
008-1,24,62,0	warp	ToWoodland17	0,2,011-1,122,61
008-1,79,17,0	warp	ToWoodlandMines	2,0,018-1,79,97
008-1,79,102,0	warp	ToWoodland18	2,0,007-1,68,23
008-1,132,101,0	warp	ToWoodland19	1,0,007-1,122,23
