
011-3,0,0,0,0	monster	JackO	1022,1,3600000,1800000,Mob4H

011-3,0,0,0	script	Mob4H	NPCMINUS1,{
	set @mobId, 1022;
	callfunc "MobPoints";
	end;
}

001-3,0,0,0,0	monster	JackO	1022,5,180000,170000,Mob6H

001-3,0,0,0	script	Mob6H	NPCMINUS1,{
	set @mobId, 1022;
	callfunc "MobPoints";
	end;
}

001-2,132,25,0,0	monster	JackO	1022,1,3600000,1800000,Mob8H

001-2,0,0,0	script	Mob8H	NPCMINUS1,{
	set @mobId, 1022;
	callfunc "MobPoints";
	end;
}

020-2,77,64,20,10	monster	JackO	1022,1,3600000,1800000,Mob13H

020-2,0,0,0	script	Mob13H	NPCMINUS1,{
	set @mobId, 1022;
	callfunc "MobPoints";
	end;
}

003-1,0,0,0,0	monster	JackO	1022,1,3600000,1800000,Mob15H

003-1,0,0,0	script	Mob15H	NPCMINUS1,{
	set @mobId, 1022;
	callfunc "MobPoints";
	end;
}

011-4,76,79,6,1	monster	JackO	1022,1,3600000,1800000,Mob17H

011-4,0,0,0	script	Mob17H	NPCMINUS1,{
	set @mobId, 1022;
	callfunc "MobPoints";
	end;
}

009-2,113,47,24,6	monster	JackO	1022,1,3600000,1800000,Mob20H

009-2,0,0,0	script	Mob20H	NPCMINUS1,{
	set @mobId, 1022;
	callfunc "MobPoints";
	end;
}

020-4,0,0,0,0	monster	JackO	1022,1,3600000,1800000,Mob21H

020-4,0,0,0	script	Mob21H	NPCMINUS1,{
	set @mobId, 1022;
	callfunc "MobPoints";
	end;
}

05-3,86,34,0,0	monster	JackO	1022,2,1800000,900000,Mob22H

05-3,0,0,0	script	Mob22H	NPCMINUS1,{
	set @mobId, 1022;
	callfunc "MobPoints";
	end;
}

010-2,26,88,0,0	monster	JackO	1022,1,3600000,1800000,Mob23H

010-2,0,0,0	script	Mob23H	NPCMINUS1,{
	set @mobId, 1022;
	callfunc "MobPoints";
	end;
}

006-1,115,121,0,0	monster	JackO	1022,1,3600000,1800000,Mob24H

006-1,0,0,0	script	Mob24H	NPCMINUS1,{
	set @mobId, 1022;
	callfunc "MobPoints";
	end;
}

006-3,30,125,0,0	monster	JackO	1022,1,3600000,1800000,Mob25H

006-3,0,0,0	script	Mob25H	NPCMINUS1,{
	set @mobId, 1022;
	callfunc "MobPoints";
	end;
}

12-1,19,54,0,0	monster	JackO	1022,1,3600000,1800000,Mob26H

12-1,0,0,0	script	Mob26H	NPCMINUS1,{
	set @mobId, 1022;
	callfunc "MobPoints";
	end;
}

012-3,54,130,0,0	monster	JackO	1022,1,3600000,1800000,Mob27H

012-3,0,0,0	script	Mob27H	NPCMINUS1,{
	set @mobId, 1022;
	callfunc "MobPoints";
	end;
}

004-1,68,20,0,0	monster	JackO	1022,1,3600000,1800000,Mob34H

004-1,0,0,0	script	Mob34H	NPCMINUS1,{
	set @mobId, 1022;
	callfunc "MobPoints";
	end;
}

009-3,26,103,0,0	monster	JackO	1022,1,3600000,1800000,Mob35H

009-3,0,0,0	script	Mob35H	NPCMINUS1,{
	set @mobId, 1022;
	callfunc "MobPoints";
	end;
}

018-2,121,46,0,0	monster	JackO	1022,1,3600000,1800000,Mob38H

018-2,0,0,0	script	Mob38H	NPCMINUS1,{
	set @mobId, 1022;
	callfunc "MobPoints";
	end;
}
