014-3 1
009-1 2
kasinow 3
kasinowin 4
002-3 5
011-5 6
024-3 7
024-4 8
020-3 9
021-1 10
019-1 11
014-1 12
011-3 13
gm 14
012-1 15
006-1 16
026-1 17
007-1 18
017-1 19
020-1 20
015-1 21
kasi-alchem 22
020-4 23
022-1 24
018-1 25
001-2 26
016-1 27
009-2 28
018-3 29
004-2 30
013-3 31
013-2 32
006-3 33
002-1 34
024-1 35
023-1 36
019-5 37
004-1 38
001-3 39
gm-room 40
010-2 41
015-3 42
013-1 43
001-1 44
005-1 45
005-3 46
024-2 47
011-4 48
010-1 49
001-4 50
100-10 51
100-11 52
018-2 53
011-1 54
002-4 55
020-2 56
027-2 57
012-3 58
021-2 59
025-1 60
027-1 61
009-3 62
021-8 63
008-1 64
dragonfinal 65
botcheck 66
003-1 67
