
009-2,20,99,0	script	[Richard]	NPC161,{
	callfunc "ClearVariables";
	set @npcname$, "Richard";
	callfunc "Banker";
	close;
}

009-2,19,99,0	script	[William 1]	NPC48,{
	callfunc "ClearVariables";
	openstorage;
	mes "Komm Bald Wieder!";
	close;
}
