
010-2,27,24,0	warp	ToCellar2	0,0,010-2,35,68
010-2,32,45,0	warp	ToOutdoor10	0,0,010-1,36,95
010-2,40,27,0	warp	To2ndFloor11	1,0,010-2,82,26
010-2,36,68,0	warp	To1stFloor8	0,0,010-2,28,24
010-2,67,27,0	warp	To3rdFloor2	1,0,010-2,67,71
010-2,83,29,0	warp	To1stFloor9	1,0,010-2,40,27
010-2,67,73,0	warp	To2ndFloor12	1,0,010-2,67,28
