
009-1,53,40,0	script	[Soul Menhir 1]	NPC144,{
	callfunc "ClearVariables";
	set @map$, "009-1";
	setarray @Xs, 52, 53, 54, 52, 54, 52, 54;
	setarray @Ys, 39, 39, 39, 40, 40, 41, 41;
	set @x, 0;
	set @y, 0;
	callfunc "SoulMenhir";
	close;
}
