
021-1,105,104,0	shop	[Ara]	NPC163,736:-1,737:-1,738:-1,739:-1

021-1,108,102,0	script	[Itka]	NPC114,{
	mes "[Itka]";
	mes "\"Diese Baeckerei ist die beste!\"";
	close;

OnTimer300000:
	npctalk "Komm zur Baekerei!";
	setnpctimer 0;
	end;

OnInit:
	initnpctimer;
}
