001-1.gat#/00/001-1.wlk#
001-2.gat#/00/001-2.wlk#
001-3.gat#/00/001-3.wlk#
001-4.gat#/00/001-4.wlk#
021-1.gat#/00/021-1.wlk#
021-2.gat#/00/021-2.wlk#
022-1.gat#/00/022-1.wlk#
024-1.gat#/00/024-1.wlk#
024-2.gat#/00/024-2.wlk#
024-3.gat#/00/024-3.wlk#
024-4.gat#/00/024-4.wlk#

003-1.gat#/03/003-1.wlk#
004-1.gat#/03/004-1.wlk#
004-2.gat#/03/004-2.wlk#

002-1.gat#/04/002-1.wlk#
002-2.gat#/04/002-2.wlk#
002-3.gat#/04/002-3.wlk#
002-4.gat#/04/002-4.wlk#
005-1.gat#/04/005-1.wlk#
005-3.gat#/04/005-3.wlk#
006-1.gat#/04/006-1.wlk#
006-3.gat#/04/006-3.wlk#
061-3.gat#/04/061-3.wlk#

007-1.gat#/1X/007-1.wlk#
008-1.gat#/1X/008-1.wlk#
009-1.gat#/1X/009-1.wlk#
009-2.gat#/1X/009-2.wlk#
009-3.gat#/1X/009-3.wlk#
010-1.gat#/1X/010-1.wlk#
010-2.gat#/1X/010-2.wlk#
011-1.gat#/1X/011-1.wlk#
011-3.gat#/1X/011-3.wlk#
011-4.gat#/1X/011-4.wlk#
011-5.gat#/1X/011-5.wlk#
012-1.gat#/1X/012-1.wlk#
012-3.gat#/1X/012-3.wlk#
013-1.gat#/1X/013-1.wlk#
013-2.gat#/1X/013-2.wlk#
013-3.gat#/1X/013-3.wlk#
014-1.gat#/1X/014-1.wlk#
014-3.gat#/1X/014-3.wlk#
015-1.gat#/1X/015-1.wlk#
015-3.gat#/1X/015-3.wlk#
016-1.gat#/1X/016-1.wlk#
017-1.gat#/1X/017-1.wlk#
018-1.gat#/1X/018-1.wlk#
018-2.gat#/1X/018-2.wlk#
018-3.gat#/1X/018-3.wlk#
025-1.gat#/1X/025-1.wlk#
026-1.gat#/1X/026-1.wlk#
027-1.gat#/1X/027-1.wlk#
027-2.gat#/1X/027-2.wlk#
111-4.gat#/1X/111-4.wlk#
019-1.gat#/20/019-1.wlk#
020-1.gat#/20/020-1.wlk#
020-2.gat#/20/020-2.wlk#
020-3.gat#/20/020-3.wlk#
020-4.gat#/20/020-4.wlk#
200-5.gat#/20/200-5.wlk#
201-1.gat#/20/201-1.wlk#
201-2.gat#/20/201-2.wlk#
201-3.gat#/20/201-3.wlk#
202-1.gat#/20/202-1.wlk#
202-2.gat#/20/202-2.wlk#
300-1.gat#/30/300-1.wlk#
300-2.gat#/30/300-2.wlk#
970-1.gat#/9X/970-1.wlk#
970-2.gat#/9X/970-2.wlk#
970-3.gat#/9X/970-3.wlk#
990-1.gat#/9X/990-1.wlk#
990-2.gat#/9X/990-2.wlk#
995-0.gat#/9X/995-0.wlk#
999-9.gat#/9X/999-9.wlk#