//

020-1.gat,65,89,0	script	[Soul Menhir]	144, {
	callfunc "ClearVariables";
	set @map$, "020-1.gat";
	setarray @Xs, 63, 64, 65, 63, 65, 63, 65;
	setarray @Ys, 88, 88, 88, 89, 89, 90, 90;
	set @x, 0;
	set @y, 0;
	callfunc "SoulMenhir";
	close;
}
