// Map: 001-3  This is the Tulimshar Arena -- below Tulimshar.


001-3.gat,0,0,0,0	monster	Maggot	1002,10,0,0,Mob001-3::On1002

001-3.gat,0,0,0	script	Mob001-3	-1,{
On1002t:
	set @mobID, 1002;
	callfunc "MobPoints";
	break;

	end;
}