// Outside the bakery

021-1.gat,105,104,0	shop	[Ara]	163,WhiteCake :-1,ChocolateCake :-1,OrangeCake :-1,AppleCake :-1

021-1.gat,108,102,0	script	[Itka]	114,{
	mes "[Itka]";
	mes "\"Diese Bäckerei ist die beste!\"";
	close;

OnTimer300000:
	npctalk "Komm zur Bäckerei!";
	setnpctimer 0;
	end;

OnInit:
	initnpctimer;
}
