([('main',
   '/home/ant/Documents/programs/python/wos-guide-qt/build/main/main',
   'EXECUTABLE'),
  ('lib-dynload/_struct.cpython-311-x86_64-linux-gnu.so',
   '/usr/lib/python3.11/lib-dynload/_struct.cpython-311-x86_64-linux-gnu.so',
   'EXTENSION'),
  ('lib-dynload/zlib.cpython-311-x86_64-linux-gnu.so',
   '/usr/lib/python3.11/lib-dynload/zlib.cpython-311-x86_64-linux-gnu.so',
   'EXTENSION'),
  ('libpython3.11.so.1.0', '/usr/lib/libpython3.11.so.1.0', 'BINARY'),
  ('ld-linux-x86-64.so.2', '/usr/lib64/ld-linux-x86-64.so.2', 'BINARY'),
  ('PySide6/Qt/plugins/platforminputcontexts/libcomposeplatforminputcontextplugin.so',
   '/home/ant/.local/lib/python3.11/site-packages/PySide6/Qt/plugins/platforminputcontexts/libcomposeplatforminputcontextplugin.so',
   'BINARY'),
  ('PySide6/Qt/plugins/platforms/libqwayland-generic.so',
   '/home/ant/.local/lib/python3.11/site-packages/PySide6/Qt/plugins/platforms/libqwayland-generic.so',
   'BINARY'),
  ('PySide6/Qt/plugins/platformthemes/libqgtk3.so',
   '/home/ant/.local/lib/python3.11/site-packages/PySide6/Qt/plugins/platformthemes/libqgtk3.so',
   'BINARY'),
  ('PySide6/Qt/plugins/generic/libqevdevkeyboardplugin.so',
   '/home/ant/.local/lib/python3.11/site-packages/PySide6/Qt/plugins/generic/libqevdevkeyboardplugin.so',
   'BINARY'),
  ('PySide6/Qt/plugins/imageformats/libqwebp.so',
   '/home/ant/.local/lib/python3.11/site-packages/PySide6/Qt/plugins/imageformats/libqwebp.so',
   'BINARY'),
  ('PySide6/Qt/plugins/wayland-graphics-integration-client/libqt-plugin-wayland-egl.so',
   '/home/ant/.local/lib/python3.11/site-packages/PySide6/Qt/plugins/wayland-graphics-integration-client/libqt-plugin-wayland-egl.so',
   'BINARY'),
  ('PySide6/Qt/plugins/wayland-graphics-integration-client/libvulkan-server.so',
   '/home/ant/.local/lib/python3.11/site-packages/PySide6/Qt/plugins/wayland-graphics-integration-client/libvulkan-server.so',
   'BINARY'),
  ('PySide6/Qt/plugins/imageformats/libqtga.so',
   '/home/ant/.local/lib/python3.11/site-packages/PySide6/Qt/plugins/imageformats/libqtga.so',
   'BINARY'),
  ('PySide6/Qt/plugins/platforms/libqvkkhrdisplay.so',
   '/home/ant/.local/lib/python3.11/site-packages/PySide6/Qt/plugins/platforms/libqvkkhrdisplay.so',
   'BINARY'),
  ('PySide6/Qt/plugins/tls/libqopensslbackend.so',
   '/home/ant/.local/lib/python3.11/site-packages/PySide6/Qt/plugins/tls/libqopensslbackend.so',
   'BINARY'),
  ('PySide6/Qt/plugins/imageformats/libqgif.so',
   '/home/ant/.local/lib/python3.11/site-packages/PySide6/Qt/plugins/imageformats/libqgif.so',
   'BINARY'),
  ('PySide6/Qt/plugins/platforms/libqminimalegl.so',
   '/home/ant/.local/lib/python3.11/site-packages/PySide6/Qt/plugins/platforms/libqminimalegl.so',
   'BINARY'),
  ('PySide6/Qt/plugins/xcbglintegrations/libqxcb-egl-integration.so',
   '/home/ant/.local/lib/python3.11/site-packages/PySide6/Qt/plugins/xcbglintegrations/libqxcb-egl-integration.so',
   'BINARY'),
  ('PySide6/Qt/plugins/wayland-shell-integration/libxdg-shell.so',
   '/home/ant/.local/lib/python3.11/site-packages/PySide6/Qt/plugins/wayland-shell-integration/libxdg-shell.so',
   'BINARY'),
  ('PySide6/Qt/plugins/generic/libqevdevtouchplugin.so',
   '/home/ant/.local/lib/python3.11/site-packages/PySide6/Qt/plugins/generic/libqevdevtouchplugin.so',
   'BINARY'),
  ('PySide6/Qt/plugins/platforms/libqxcb.so',
   '/home/ant/.local/lib/python3.11/site-packages/PySide6/Qt/plugins/platforms/libqxcb.so',
   'BINARY'),
  ('PySide6/Qt/plugins/xcbglintegrations/libqxcb-glx-integration.so',
   '/home/ant/.local/lib/python3.11/site-packages/PySide6/Qt/plugins/xcbglintegrations/libqxcb-glx-integration.so',
   'BINARY'),
  ('PySide6/Qt/plugins/platforms/libqvnc.so',
   '/home/ant/.local/lib/python3.11/site-packages/PySide6/Qt/plugins/platforms/libqvnc.so',
   'BINARY'),
  ('PySide6/Qt/plugins/platforms/libqoffscreen.so',
   '/home/ant/.local/lib/python3.11/site-packages/PySide6/Qt/plugins/platforms/libqoffscreen.so',
   'BINARY'),
  ('PySide6/Qt/plugins/imageformats/libqicns.so',
   '/home/ant/.local/lib/python3.11/site-packages/PySide6/Qt/plugins/imageformats/libqicns.so',
   'BINARY'),
  ('PySide6/Qt/plugins/platforms/libqlinuxfb.so',
   '/home/ant/.local/lib/python3.11/site-packages/PySide6/Qt/plugins/platforms/libqlinuxfb.so',
   'BINARY'),
  ('PySide6/Qt/plugins/platforminputcontexts/libqtvirtualkeyboardplugin.so',
   '/home/ant/.local/lib/python3.11/site-packages/PySide6/Qt/plugins/platforminputcontexts/libqtvirtualkeyboardplugin.so',
   'BINARY'),
  ('PySide6/Qt/plugins/egldeviceintegrations/libqeglfs-emu-integration.so',
   '/home/ant/.local/lib/python3.11/site-packages/PySide6/Qt/plugins/egldeviceintegrations/libqeglfs-emu-integration.so',
   'BINARY'),
  ('PySide6/Qt/plugins/imageformats/libqpdf.so',
   '/home/ant/.local/lib/python3.11/site-packages/PySide6/Qt/plugins/imageformats/libqpdf.so',
   'BINARY'),
  ('PySide6/Qt/plugins/egldeviceintegrations/libqeglfs-x11-integration.so',
   '/home/ant/.local/lib/python3.11/site-packages/PySide6/Qt/plugins/egldeviceintegrations/libqeglfs-x11-integration.so',
   'BINARY'),
  ('PySide6/Qt/plugins/imageformats/libqsvg.so',
   '/home/ant/.local/lib/python3.11/site-packages/PySide6/Qt/plugins/imageformats/libqsvg.so',
   'BINARY'),
  ('PySide6/Qt/plugins/platforminputcontexts/libibusplatforminputcontextplugin.so',
   '/home/ant/.local/lib/python3.11/site-packages/PySide6/Qt/plugins/platforminputcontexts/libibusplatforminputcontextplugin.so',
   'BINARY'),
  ('PySide6/Qt/plugins/wayland-shell-integration/libfullscreen-shell-v1.so',
   '/home/ant/.local/lib/python3.11/site-packages/PySide6/Qt/plugins/wayland-shell-integration/libfullscreen-shell-v1.so',
   'BINARY'),
  ('PySide6/Qt/plugins/tls/libqcertonlybackend.so',
   '/home/ant/.local/lib/python3.11/site-packages/PySide6/Qt/plugins/tls/libqcertonlybackend.so',
   'BINARY'),
  ('PySide6/Qt/plugins/wayland-shell-integration/libwl-shell-plugin.so',
   '/home/ant/.local/lib/python3.11/site-packages/PySide6/Qt/plugins/wayland-shell-integration/libwl-shell-plugin.so',
   'BINARY'),
  ('PySide6/Qt/plugins/wayland-graphics-integration-client/libdmabuf-server.so',
   '/home/ant/.local/lib/python3.11/site-packages/PySide6/Qt/plugins/wayland-graphics-integration-client/libdmabuf-server.so',
   'BINARY'),
  ('PySide6/Qt/plugins/generic/libqtuiotouchplugin.so',
   '/home/ant/.local/lib/python3.11/site-packages/PySide6/Qt/plugins/generic/libqtuiotouchplugin.so',
   'BINARY'),
  ('PySide6/Qt/plugins/platformthemes/libqxdgdesktopportal.so',
   '/home/ant/.local/lib/python3.11/site-packages/PySide6/Qt/plugins/platformthemes/libqxdgdesktopportal.so',
   'BINARY'),
  ('PySide6/Qt/plugins/imageformats/libqwbmp.so',
   '/home/ant/.local/lib/python3.11/site-packages/PySide6/Qt/plugins/imageformats/libqwbmp.so',
   'BINARY'),
  ('PySide6/Qt/plugins/platforms/libqminimal.so',
   '/home/ant/.local/lib/python3.11/site-packages/PySide6/Qt/plugins/platforms/libqminimal.so',
   'BINARY'),
  ('PySide6/Qt/plugins/imageformats/libqjpeg.so',
   '/home/ant/.local/lib/python3.11/site-packages/PySide6/Qt/plugins/imageformats/libqjpeg.so',
   'BINARY'),
  ('PySide6/Qt/plugins/iconengines/libqsvgicon.so',
   '/home/ant/.local/lib/python3.11/site-packages/PySide6/Qt/plugins/iconengines/libqsvgicon.so',
   'BINARY'),
  ('PySide6/Qt/plugins/wayland-decoration-client/libbradient.so',
   '/home/ant/.local/lib/python3.11/site-packages/PySide6/Qt/plugins/wayland-decoration-client/libbradient.so',
   'BINARY'),
  ('PySide6/Qt/plugins/imageformats/libqico.so',
   '/home/ant/.local/lib/python3.11/site-packages/PySide6/Qt/plugins/imageformats/libqico.so',
   'BINARY'),
  ('PySide6/Qt/plugins/wayland-shell-integration/libqt-shell.so',
   '/home/ant/.local/lib/python3.11/site-packages/PySide6/Qt/plugins/wayland-shell-integration/libqt-shell.so',
   'BINARY'),
  ('PySide6/Qt/plugins/wayland-shell-integration/libivi-shell.so',
   '/home/ant/.local/lib/python3.11/site-packages/PySide6/Qt/plugins/wayland-shell-integration/libivi-shell.so',
   'BINARY'),
  ('PySide6/Qt/plugins/egldeviceintegrations/libqeglfs-kms-egldevice-integration.so',
   '/home/ant/.local/lib/python3.11/site-packages/PySide6/Qt/plugins/egldeviceintegrations/libqeglfs-kms-egldevice-integration.so',
   'BINARY'),
  ('PySide6/Qt/plugins/generic/libqevdevtabletplugin.so',
   '/home/ant/.local/lib/python3.11/site-packages/PySide6/Qt/plugins/generic/libqevdevtabletplugin.so',
   'BINARY'),
  ('PySide6/Qt/plugins/platforms/libqwayland-egl.so',
   '/home/ant/.local/lib/python3.11/site-packages/PySide6/Qt/plugins/platforms/libqwayland-egl.so',
   'BINARY'),
  ('PySide6/Qt/plugins/wayland-graphics-integration-client/libshm-emulation-server.so',
   '/home/ant/.local/lib/python3.11/site-packages/PySide6/Qt/plugins/wayland-graphics-integration-client/libshm-emulation-server.so',
   'BINARY'),
  ('PySide6/Qt/plugins/platforms/libqeglfs.so',
   '/home/ant/.local/lib/python3.11/site-packages/PySide6/Qt/plugins/platforms/libqeglfs.so',
   'BINARY'),
  ('PySide6/Qt/plugins/generic/libqevdevmouseplugin.so',
   '/home/ant/.local/lib/python3.11/site-packages/PySide6/Qt/plugins/generic/libqevdevmouseplugin.so',
   'BINARY'),
  ('PySide6/Qt/plugins/imageformats/libqtiff.so',
   '/home/ant/.local/lib/python3.11/site-packages/PySide6/Qt/plugins/imageformats/libqtiff.so',
   'BINARY'),
  ('PySide6/Qt/plugins/networkinformation/libqnetworkmanager.so',
   '/home/ant/.local/lib/python3.11/site-packages/PySide6/Qt/plugins/networkinformation/libqnetworkmanager.so',
   'BINARY'),
  ('PySide6/Qt/plugins/wayland-graphics-integration-client/libdrm-egl-server.so',
   '/home/ant/.local/lib/python3.11/site-packages/PySide6/Qt/plugins/wayland-graphics-integration-client/libdrm-egl-server.so',
   'BINARY'),
  ('PySide6/Qt/plugins/networkinformation/libqglib.so',
   '/home/ant/.local/lib/python3.11/site-packages/PySide6/Qt/plugins/networkinformation/libqglib.so',
   'BINARY'),
  ('lib-dynload/_typing.cpython-311-x86_64-linux-gnu.so',
   '/usr/lib/python3.11/lib-dynload/_typing.cpython-311-x86_64-linux-gnu.so',
   'EXTENSION'),
  ('lib-dynload/_datetime.cpython-311-x86_64-linux-gnu.so',
   '/usr/lib/python3.11/lib-dynload/_datetime.cpython-311-x86_64-linux-gnu.so',
   'EXTENSION'),
  ('lib-dynload/_statistics.cpython-311-x86_64-linux-gnu.so',
   '/usr/lib/python3.11/lib-dynload/_statistics.cpython-311-x86_64-linux-gnu.so',
   'EXTENSION'),
  ('lib-dynload/_contextvars.cpython-311-x86_64-linux-gnu.so',
   '/usr/lib/python3.11/lib-dynload/_contextvars.cpython-311-x86_64-linux-gnu.so',
   'EXTENSION'),
  ('lib-dynload/_decimal.cpython-311-x86_64-linux-gnu.so',
   '/usr/lib/python3.11/lib-dynload/_decimal.cpython-311-x86_64-linux-gnu.so',
   'EXTENSION'),
  ('lib-dynload/_pickle.cpython-311-x86_64-linux-gnu.so',
   '/usr/lib/python3.11/lib-dynload/_pickle.cpython-311-x86_64-linux-gnu.so',
   'EXTENSION'),
  ('lib-dynload/_hashlib.cpython-311-x86_64-linux-gnu.so',
   '/usr/lib/python3.11/lib-dynload/_hashlib.cpython-311-x86_64-linux-gnu.so',
   'EXTENSION'),
  ('lib-dynload/_sha3.cpython-311-x86_64-linux-gnu.so',
   '/usr/lib/python3.11/lib-dynload/_sha3.cpython-311-x86_64-linux-gnu.so',
   'EXTENSION'),
  ('lib-dynload/_blake2.cpython-311-x86_64-linux-gnu.so',
   '/usr/lib/python3.11/lib-dynload/_blake2.cpython-311-x86_64-linux-gnu.so',
   'EXTENSION'),
  ('lib-dynload/_sha256.cpython-311-x86_64-linux-gnu.so',
   '/usr/lib/python3.11/lib-dynload/_sha256.cpython-311-x86_64-linux-gnu.so',
   'EXTENSION'),
  ('lib-dynload/_md5.cpython-311-x86_64-linux-gnu.so',
   '/usr/lib/python3.11/lib-dynload/_md5.cpython-311-x86_64-linux-gnu.so',
   'EXTENSION'),
  ('lib-dynload/_sha1.cpython-311-x86_64-linux-gnu.so',
   '/usr/lib/python3.11/lib-dynload/_sha1.cpython-311-x86_64-linux-gnu.so',
   'EXTENSION'),
  ('lib-dynload/_sha512.cpython-311-x86_64-linux-gnu.so',
   '/usr/lib/python3.11/lib-dynload/_sha512.cpython-311-x86_64-linux-gnu.so',
   'EXTENSION'),
  ('lib-dynload/_random.cpython-311-x86_64-linux-gnu.so',
   '/usr/lib/python3.11/lib-dynload/_random.cpython-311-x86_64-linux-gnu.so',
   'EXTENSION'),
  ('lib-dynload/_bisect.cpython-311-x86_64-linux-gnu.so',
   '/usr/lib/python3.11/lib-dynload/_bisect.cpython-311-x86_64-linux-gnu.so',
   'EXTENSION'),
  ('lib-dynload/grp.cpython-311-x86_64-linux-gnu.so',
   '/usr/lib/python3.11/lib-dynload/grp.cpython-311-x86_64-linux-gnu.so',
   'EXTENSION'),
  ('lib-dynload/_lzma.cpython-311-x86_64-linux-gnu.so',
   '/usr/lib/python3.11/lib-dynload/_lzma.cpython-311-x86_64-linux-gnu.so',
   'EXTENSION'),
  ('lib-dynload/_bz2.cpython-311-x86_64-linux-gnu.so',
   '/usr/lib/python3.11/lib-dynload/_bz2.cpython-311-x86_64-linux-gnu.so',
   'EXTENSION'),
  ('lib-dynload/array.cpython-311-x86_64-linux-gnu.so',
   '/usr/lib/python3.11/lib-dynload/array.cpython-311-x86_64-linux-gnu.so',
   'EXTENSION'),
  ('lib-dynload/select.cpython-311-x86_64-linux-gnu.so',
   '/usr/lib/python3.11/lib-dynload/select.cpython-311-x86_64-linux-gnu.so',
   'EXTENSION'),
  ('lib-dynload/_socket.cpython-311-x86_64-linux-gnu.so',
   '/usr/lib/python3.11/lib-dynload/_socket.cpython-311-x86_64-linux-gnu.so',
   'EXTENSION'),
  ('lib-dynload/binascii.cpython-311-x86_64-linux-gnu.so',
   '/usr/lib/python3.11/lib-dynload/binascii.cpython-311-x86_64-linux-gnu.so',
   'EXTENSION'),
  ('lib-dynload/_csv.cpython-311-x86_64-linux-gnu.so',
   '/usr/lib/python3.11/lib-dynload/_csv.cpython-311-x86_64-linux-gnu.so',
   'EXTENSION'),
  ('lib-dynload/resource.cpython-311-x86_64-linux-gnu.so',
   '/usr/lib/python3.11/lib-dynload/resource.cpython-311-x86_64-linux-gnu.so',
   'EXTENSION'),
  ('lib-dynload/_opcode.cpython-311-x86_64-linux-gnu.so',
   '/usr/lib/python3.11/lib-dynload/_opcode.cpython-311-x86_64-linux-gnu.so',
   'EXTENSION'),
  ('lib-dynload/_posixsubprocess.cpython-311-x86_64-linux-gnu.so',
   '/usr/lib/python3.11/lib-dynload/_posixsubprocess.cpython-311-x86_64-linux-gnu.so',
   'EXTENSION'),
  ('lib-dynload/fcntl.cpython-311-x86_64-linux-gnu.so',
   '/usr/lib/python3.11/lib-dynload/fcntl.cpython-311-x86_64-linux-gnu.so',
   'EXTENSION'),
  ('lib-dynload/unicodedata.cpython-311-x86_64-linux-gnu.so',
   '/usr/lib/python3.11/lib-dynload/unicodedata.cpython-311-x86_64-linux-gnu.so',
   'EXTENSION'),
  ('lib-dynload/_multibytecodec.cpython-311-x86_64-linux-gnu.so',
   '/usr/lib/python3.11/lib-dynload/_multibytecodec.cpython-311-x86_64-linux-gnu.so',
   'EXTENSION'),
  ('lib-dynload/_codecs_jp.cpython-311-x86_64-linux-gnu.so',
   '/usr/lib/python3.11/lib-dynload/_codecs_jp.cpython-311-x86_64-linux-gnu.so',
   'EXTENSION'),
  ('lib-dynload/_codecs_kr.cpython-311-x86_64-linux-gnu.so',
   '/usr/lib/python3.11/lib-dynload/_codecs_kr.cpython-311-x86_64-linux-gnu.so',
   'EXTENSION'),
  ('lib-dynload/_codecs_iso2022.cpython-311-x86_64-linux-gnu.so',
   '/usr/lib/python3.11/lib-dynload/_codecs_iso2022.cpython-311-x86_64-linux-gnu.so',
   'EXTENSION'),
  ('lib-dynload/_codecs_cn.cpython-311-x86_64-linux-gnu.so',
   '/usr/lib/python3.11/lib-dynload/_codecs_cn.cpython-311-x86_64-linux-gnu.so',
   'EXTENSION'),
  ('lib-dynload/_codecs_tw.cpython-311-x86_64-linux-gnu.so',
   '/usr/lib/python3.11/lib-dynload/_codecs_tw.cpython-311-x86_64-linux-gnu.so',
   'EXTENSION'),
  ('lib-dynload/_codecs_hk.cpython-311-x86_64-linux-gnu.so',
   '/usr/lib/python3.11/lib-dynload/_codecs_hk.cpython-311-x86_64-linux-gnu.so',
   'EXTENSION'),
  ('lib-dynload/_heapq.cpython-311-x86_64-linux-gnu.so',
   '/usr/lib/python3.11/lib-dynload/_heapq.cpython-311-x86_64-linux-gnu.so',
   'EXTENSION'),
  ('lib-dynload/termios.cpython-311-x86_64-linux-gnu.so',
   '/usr/lib/python3.11/lib-dynload/termios.cpython-311-x86_64-linux-gnu.so',
   'EXTENSION'),
  ('lib-dynload/_ssl.cpython-311-x86_64-linux-gnu.so',
   '/usr/lib/python3.11/lib-dynload/_ssl.cpython-311-x86_64-linux-gnu.so',
   'EXTENSION'),
  ('PySide6/QtGui.abi3.so',
   '/home/ant/.local/lib/python3.11/site-packages/PySide6/QtGui.abi3.so',
   'EXTENSION'),
  ('PySide6/QtDBus.abi3.so',
   '/home/ant/.local/lib/python3.11/site-packages/PySide6/QtDBus.abi3.so',
   'EXTENSION'),
  ('PySide6/QtNetwork.abi3.so',
   '/home/ant/.local/lib/python3.11/site-packages/PySide6/QtNetwork.abi3.so',
   'EXTENSION'),
  ('shiboken6/Shiboken.abi3.so',
   '/home/ant/.local/lib/python3.11/site-packages/shiboken6/Shiboken.abi3.so',
   'EXTENSION'),
  ('PySide6/QtCore.abi3.so',
   '/home/ant/.local/lib/python3.11/site-packages/PySide6/QtCore.abi3.so',
   'EXTENSION'),
  ('PySide6/QtWidgets.abi3.so',
   '/home/ant/.local/lib/python3.11/site-packages/PySide6/QtWidgets.abi3.so',
   'EXTENSION'),
  ('lib-dynload/_sqlite3.cpython-311-x86_64-linux-gnu.so',
   '/usr/lib/python3.11/lib-dynload/_sqlite3.cpython-311-x86_64-linux-gnu.so',
   'EXTENSION'),
  ('lib-dynload/math.cpython-311-x86_64-linux-gnu.so',
   '/usr/lib/python3.11/lib-dynload/math.cpython-311-x86_64-linux-gnu.so',
   'EXTENSION'),
  ('lib-dynload/_json.cpython-311-x86_64-linux-gnu.so',
   '/usr/lib/python3.11/lib-dynload/_json.cpython-311-x86_64-linux-gnu.so',
   'EXTENSION'),
  ('liblz4.so.1', '/usr/lib/liblz4.so.1', 'BINARY'),
  ('libharfbuzz.so.0', '/usr/lib/libharfbuzz.so.0', 'BINARY'),
  ('libgcrypt.so.20', '/usr/lib/libgcrypt.so.20', 'BINARY'),
  ('liblzma.so.5', '/usr/lib/liblzma.so.5', 'BINARY'),
  ('libgthread-2.0.so.0', '/usr/lib/libgthread-2.0.so.0', 'BINARY'),
  ('libexpat.so.1', '/usr/lib/libexpat.so.1', 'BINARY'),
  ('libQt6Gui.so.6',
   '/home/ant/.local/lib/python3.11/site-packages/PySide6/Qt/plugins/platforminputcontexts/../../lib/libQt6Gui.so.6',
   'BINARY'),
  ('libicui18n.so.56',
   '/home/ant/.local/lib/python3.11/site-packages/PySide6/Qt/plugins/platforminputcontexts/../../lib/libicui18n.so.56',
   'BINARY'),
  ('libgraphite2.so.3', '/usr/lib/libgraphite2.so.3', 'BINARY'),
  ('libdbus-1.so.3', '/usr/lib/libdbus-1.so.3', 'BINARY'),
  ('libgcc_s.so.1', '/usr/lib/libgcc_s.so.1', 'BINARY'),
  ('libicudata.so.56',
   '/home/ant/.local/lib/python3.11/site-packages/PySide6/Qt/plugins/platforminputcontexts/../../lib/libicudata.so.56',
   'BINARY'),
  ('libpng16.so.16', '/usr/lib/libpng16.so.16', 'BINARY'),
  ('libgpg-error.so.0', '/usr/lib/libgpg-error.so.0', 'BINARY'),
  ('libfreetype.so.6', '/usr/lib/libfreetype.so.6', 'BINARY'),
  ('libstdc++.so.6', '/usr/lib/libstdc++.so.6', 'BINARY'),
  ('libxkbcommon.so.0', '/usr/lib/libxkbcommon.so.0', 'BINARY'),
  ('libzstd.so.1', '/usr/lib/libzstd.so.1', 'BINARY'),
  ('libpcre2-8.so.0', '/usr/lib/libpcre2-8.so.0', 'BINARY'),
  ('libicuuc.so.56',
   '/home/ant/.local/lib/python3.11/site-packages/PySide6/Qt/plugins/platforminputcontexts/../../lib/libicuuc.so.56',
   'BINARY'),
  ('libbz2.so.1.0', '/usr/lib/libbz2.so.1.0', 'BINARY'),
  ('libQt6DBus.so.6',
   '/home/ant/.local/lib/python3.11/site-packages/PySide6/Qt/plugins/platforminputcontexts/../../lib/libQt6DBus.so.6',
   'BINARY'),
  ('libsystemd.so.0', '/usr/lib/libsystemd.so.0', 'BINARY'),
  ('libXdmcp.so.6', '/usr/lib/libXdmcp.so.6', 'BINARY'),
  ('libQt6Core.so.6',
   '/home/ant/.local/lib/python3.11/site-packages/PySide6/Qt/plugins/platforminputcontexts/../../lib/libQt6Core.so.6',
   'BINARY'),
  ('libX11.so.6', '/usr/lib/libX11.so.6', 'BINARY'),
  ('libbrotlidec.so.1', '/usr/lib/libbrotlidec.so.1', 'BINARY'),
  ('libXau.so.6', '/usr/lib/libXau.so.6', 'BINARY'),
  ('libz.so.1', '/usr/lib/libz.so.1', 'BINARY'),
  ('libglib-2.0.so.0', '/usr/lib/libglib-2.0.so.0', 'BINARY'),
  ('libfontconfig.so.1', '/usr/lib/libfontconfig.so.1', 'BINARY'),
  ('libcap.so.2', '/usr/lib/libcap.so.2', 'BINARY'),
  ('libbrotlicommon.so.1', '/usr/lib/libbrotlicommon.so.1', 'BINARY'),
  ('libffi.so.8', '/usr/lib/libffi.so.8', 'BINARY'),
  ('libQt6WaylandClient.so.6',
   '/home/ant/.local/lib/python3.11/site-packages/PySide6/Qt/plugins/platforms/../../lib/libQt6WaylandClient.so.6',
   'BINARY'),
  ('libwayland-cursor.so.0', '/usr/lib/libwayland-cursor.so.0', 'BINARY'),
  ('libwayland-client.so.0', '/usr/lib/libwayland-client.so.0', 'BINARY'),
  ('libicuuc.so.73', '/usr/lib/libicuuc.so.73', 'BINARY'),
  ('libgdk-3.so.0', '/usr/lib/libgdk-3.so.0', 'BINARY'),
  ('libepoxy.so.0', '/usr/lib/libepoxy.so.0', 'BINARY'),
  ('libgtk-3.so.0', '/usr/lib/libgtk-3.so.0', 'BINARY'),
  ('libcloudproviders.so.0', '/usr/lib/libcloudproviders.so.0', 'BINARY'),
  ('libjpeg.so.8', '/usr/lib/libjpeg.so.8', 'BINARY'),
  ('libXrender.so.1', '/usr/lib/libXrender.so.1', 'BINARY'),
  ('libXrandr.so.2', '/usr/lib/libXrandr.so.2', 'BINARY'),
  ('libicudata.so.73', '/usr/lib/libicudata.so.73', 'BINARY'),
  ('libXinerama.so.1', '/usr/lib/libXinerama.so.1', 'BINARY'),
  ('libpangocairo-1.0.so.0', '/usr/lib/libpangocairo-1.0.so.0', 'BINARY'),
  ('libXdamage.so.1', '/usr/lib/libXdamage.so.1', 'BINARY'),
  ('libXfixes.so.3', '/usr/lib/libXfixes.so.3', 'BINARY'),
  ('libcairo-gobject.so.2', '/usr/lib/libcairo-gobject.so.2', 'BINARY'),
  ('libthai.so.0', '/usr/lib/libthai.so.0', 'BINARY'),
  ('libgmodule-2.0.so.0', '/usr/lib/libgmodule-2.0.so.0', 'BINARY'),
  ('libxml2.so.2', '/usr/lib/libxml2.so.2', 'BINARY'),
  ('libgdk_pixbuf-2.0.so.0', '/usr/lib/libgdk_pixbuf-2.0.so.0', 'BINARY'),
  ('libatspi.so.0', '/usr/lib/libatspi.so.0', 'BINARY'),
  ('libmount.so.1', '/usr/lib/libmount.so.1', 'BINARY'),
  ('libatk-bridge-2.0.so.0', '/usr/lib/libatk-bridge-2.0.so.0', 'BINARY'),
  ('libgio-2.0.so.0', '/usr/lib/libgio-2.0.so.0', 'BINARY'),
  ('libgobject-2.0.so.0', '/usr/lib/libgobject-2.0.so.0', 'BINARY'),
  ('libatk-1.0.so.0', '/usr/lib/libatk-1.0.so.0', 'BINARY'),
  ('libcairo.so.2', '/usr/lib/libcairo.so.2', 'BINARY'),
  ('libsqlite3.so.0', '/usr/lib/libsqlite3.so.0', 'BINARY'),
  ('libwayland-egl.so.1', '/usr/lib/libwayland-egl.so.1', 'BINARY'),
  ('libXcursor.so.1', '/usr/lib/libXcursor.so.1', 'BINARY'),
  ('libXcomposite.so.1', '/usr/lib/libXcomposite.so.1', 'BINARY'),
  ('libXi.so.6', '/usr/lib/libXi.so.6', 'BINARY'),
  ('libxcb-render.so.0', '/usr/lib/libxcb-render.so.0', 'BINARY'),
  ('libtracker-sparql-3.0.so.0',
   '/usr/lib/libtracker-sparql-3.0.so.0',
   'BINARY'),
  ('libpangoft2-1.0.so.0', '/usr/lib/libpangoft2-1.0.so.0', 'BINARY'),
  ('libfribidi.so.0', '/usr/lib/libfribidi.so.0', 'BINARY'),
  ('libblkid.so.1', '/usr/lib/libblkid.so.1', 'BINARY'),
  ('libjson-glib-1.0.so.0', '/usr/lib/libjson-glib-1.0.so.0', 'BINARY'),
  ('libpango-1.0.so.0', '/usr/lib/libpango-1.0.so.0', 'BINARY'),
  ('libdatrie.so.1', '/usr/lib/libdatrie.so.1', 'BINARY'),
  ('libtiff.so.6', '/usr/lib/libtiff.so.6', 'BINARY'),
  ('libXext.so.6', '/usr/lib/libXext.so.6', 'BINARY'),
  ('libpixman-1.so.0', '/usr/lib/libpixman-1.so.0', 'BINARY'),
  ('libxcb-shm.so.0', '/usr/lib/libxcb-shm.so.0', 'BINARY'),
  ('libQt6OpenGL.so.6',
   '/home/ant/.local/lib/python3.11/site-packages/PySide6/Qt/plugins/wayland-graphics-integration-client/../../lib/libQt6OpenGL.so.6',
   'BINARY'),
  ('libQt6WaylandEglClientHwIntegration.so.6',
   '/home/ant/.local/lib/python3.11/site-packages/PySide6/Qt/plugins/wayland-graphics-integration-client/../../lib/libQt6WaylandEglClientHwIntegration.so.6',
   'BINARY'),
  ('libkrb5support.so.0', '/usr/lib/libkrb5support.so.0', 'BINARY'),
  ('libQt6Network.so.6',
   '/home/ant/.local/lib/python3.11/site-packages/PySide6/Qt/plugins/tls/../../lib/libQt6Network.so.6',
   'BINARY'),
  ('libgssapi_krb5.so.2', '/usr/lib/libgssapi_krb5.so.2', 'BINARY'),
  ('libcom_err.so.2', '/usr/lib/libcom_err.so.2', 'BINARY'),
  ('libkeyutils.so.1', '/usr/lib/libkeyutils.so.1', 'BINARY'),
  ('libk5crypto.so.3', '/usr/lib/libk5crypto.so.3', 'BINARY'),
  ('libkrb5.so.3', '/usr/lib/libkrb5.so.3', 'BINARY'),
  ('libxcb-randr.so.0', '/usr/lib/libxcb-randr.so.0', 'BINARY'),
  ('libxcb-render-util.so.0', '/usr/lib/libxcb-render-util.so.0', 'BINARY'),
  ('libxcb-cursor.so.0', '/usr/lib/libxcb-cursor.so.0', 'BINARY'),
  ('libxcb-keysyms.so.1', '/usr/lib/libxcb-keysyms.so.1', 'BINARY'),
  ('libxcb-icccm.so.4', '/usr/lib/libxcb-icccm.so.4', 'BINARY'),
  ('libQt6XcbQpa.so.6',
   '/home/ant/.local/lib/python3.11/site-packages/PySide6/Qt/plugins/xcbglintegrations/../../lib/libQt6XcbQpa.so.6',
   'BINARY'),
  ('libxcb-shape.so.0', '/usr/lib/libxcb-shape.so.0', 'BINARY'),
  ('libxcb-util.so.1', '/usr/lib/libxcb-util.so.1', 'BINARY'),
  ('libxcb-image.so.0', '/usr/lib/libxcb-image.so.0', 'BINARY'),
  ('libxcb-sync.so.1', '/usr/lib/libxcb-sync.so.1', 'BINARY'),
  ('libxkbcommon-x11.so.0', '/usr/lib/libxkbcommon-x11.so.0', 'BINARY'),
  ('libX11-xcb.so.1', '/usr/lib/libX11-xcb.so.1', 'BINARY'),
  ('libxcb-xkb.so.1', '/usr/lib/libxcb-xkb.so.1', 'BINARY'),
  ('libxcb-xfixes.so.0', '/usr/lib/libxcb-xfixes.so.0', 'BINARY'),
  ('libxcb-glx.so.0', '/usr/lib/libxcb-glx.so.0', 'BINARY'),
  ('libQt6QmlModels.so.6',
   '/home/ant/.local/lib/python3.11/site-packages/PySide6/Qt/plugins/platforminputcontexts/../../lib/libQt6QmlModels.so.6',
   'BINARY'),
  ('libQt6Quick.so.6',
   '/home/ant/.local/lib/python3.11/site-packages/PySide6/Qt/plugins/platforminputcontexts/../../lib/libQt6Quick.so.6',
   'BINARY'),
  ('libQt6Qml.so.6',
   '/home/ant/.local/lib/python3.11/site-packages/PySide6/Qt/plugins/platforminputcontexts/../../lib/libQt6Qml.so.6',
   'BINARY'),
  ('libQt6VirtualKeyboard.so.6',
   '/home/ant/.local/lib/python3.11/site-packages/PySide6/Qt/plugins/platforminputcontexts/../../lib/libQt6VirtualKeyboard.so.6',
   'BINARY'),
  ('libQt6EglFSDeviceIntegration.so.6',
   '/home/ant/.local/lib/python3.11/site-packages/PySide6/Qt/plugins/egldeviceintegrations/../../lib/libQt6EglFSDeviceIntegration.so.6',
   'BINARY'),
  ('libQt6Pdf.so.6',
   '/home/ant/.local/lib/python3.11/site-packages/PySide6/Qt/plugins/imageformats/../../lib/libQt6Pdf.so.6',
   'BINARY'),
  ('libQt6Svg.so.6',
   '/home/ant/.local/lib/python3.11/site-packages/PySide6/Qt/plugins/imageformats/../../lib/libQt6Svg.so.6',
   'BINARY'),
  ('libQt6WlShellIntegration.so.6',
   '/home/ant/.local/lib/python3.11/site-packages/PySide6/Qt/plugins/wayland-shell-integration/../../lib/libQt6WlShellIntegration.so.6',
   'BINARY'),
  ('libQt6EglFsKmsSupport.so.6',
   '/home/ant/.local/lib/python3.11/site-packages/PySide6/Qt/plugins/egldeviceintegrations/../../lib/libQt6EglFsKmsSupport.so.6',
   'BINARY'),
  ('libmpdec.so.3', '/usr/lib/libmpdec.so.3', 'BINARY'),
  ('libcrypto.so.3', '/usr/lib/libcrypto.so.3', 'BINARY'),
  ('libssl.so.3', '/usr/lib/libssl.so.3', 'BINARY'),
  ('libpyside6.abi3.so.6.5',
   '/home/ant/.local/lib/python3.11/site-packages/PySide6/libpyside6.abi3.so.6.5',
   'BINARY'),
  ('libshiboken6.abi3.so.6.5',
   '/home/ant/.local/lib/python3.11/site-packages/shiboken6/libshiboken6.abi3.so.6.5',
   'BINARY'),
  ('libQt6Widgets.so.6',
   '/home/ant/.local/lib/python3.11/site-packages/PySide6/Qt/lib/libQt6Widgets.so.6',
   'BINARY'),
  ('LICENSE',
   '/home/ant/Documents/programs/python/wos-guide-qt/LICENSE',
   'DATA'),
  ('res/WOS-guide-qt.conf',
   '/home/ant/Documents/programs/python/wos-guide-qt/res/WOS-guide-qt.conf',
   'DATA'),
  ('res/images/WOS_ADD.ico',
   '/home/ant/Documents/programs/python/wos-guide-qt/res/images/WOS_ADD.ico',
   'DATA'),
  ('res/images/WOS_ADD.png',
   '/home/ant/Documents/programs/python/wos-guide-qt/res/images/WOS_ADD.png',
   'DATA'),
  ('res/images/WOS_FILTER.ico',
   '/home/ant/Documents/programs/python/wos-guide-qt/res/images/WOS_FILTER.ico',
   'DATA'),
  ('res/images/WOS_UNINSTALL.ico',
   '/home/ant/Documents/programs/python/wos-guide-qt/res/images/WOS_UNINSTALL.ico',
   'DATA'),
  ('res/images/filters.png',
   '/home/ant/Documents/programs/python/wos-guide-qt/res/images/filters.png',
   'DATA'),
  ('res/images/planet-with-rings.png',
   '/home/ant/Documents/programs/python/wos-guide-qt/res/images/planet-with-rings.png',
   'DATA'),
  ('res/images/planet-without-rings.png',
   '/home/ant/Documents/programs/python/wos-guide-qt/res/images/planet-without-rings.png',
   'DATA'),
  ('res/images/revert.svg',
   '/home/ant/Documents/programs/python/wos-guide-qt/res/images/revert.svg',
   'DATA'),
  ('res/images/step-one-gnulinux.png',
   '/home/ant/Documents/programs/python/wos-guide-qt/res/images/step-one-gnulinux.png',
   'DATA'),
  ('res/images/step-one-localhost.png',
   '/home/ant/Documents/programs/python/wos-guide-qt/res/images/step-one-localhost.png',
   'DATA'),
  ('res/images/step-one-windows.jpg',
   '/home/ant/Documents/programs/python/wos-guide-qt/res/images/step-one-windows.jpg',
   'DATA'),
  ('res/images/step-one-windows.png',
   '/home/ant/Documents/programs/python/wos-guide-qt/res/images/step-one-windows.png',
   'DATA'),
  ('res/images/step-three.png',
   '/home/ant/Documents/programs/python/wos-guide-qt/res/images/step-three.png',
   'DATA'),
  ('res/images/step-two.png',
   '/home/ant/Documents/programs/python/wos-guide-qt/res/images/step-two.png',
   'DATA'),
  ('res/images/thumbnail.png',
   '/home/ant/Documents/programs/python/wos-guide-qt/res/images/thumbnail.png',
   'DATA'),
  ('res/universe-maps/planets_export.sql',
   '/home/ant/Documents/programs/python/wos-guide-qt/res/universe-maps/planets_export.sql',
   'DATA'),
  ('res/universe-maps/universe-one.db',
   '/home/ant/Documents/programs/python/wos-guide-qt/res/universe-maps/universe-one.db',
   'DATA'),
  ('base_library.zip',
   '/home/ant/Documents/programs/python/wos-guide-qt/build/main/base_library.zip',
   'DATA'),
  ('PySide6/Qt/translations/qtbase_pt_BR.qm',
   '/home/ant/.local/lib/python3.11/site-packages/PySide6/Qt/translations/qtbase_pt_BR.qm',
   'DATA'),
  ('PySide6/Qt/translations/qtbase_it.qm',
   '/home/ant/.local/lib/python3.11/site-packages/PySide6/Qt/translations/qtbase_it.qm',
   'DATA'),
  ('PySide6/Qt/translations/qt_bg.qm',
   '/home/ant/.local/lib/python3.11/site-packages/PySide6/Qt/translations/qt_bg.qm',
   'DATA'),
  ('PySide6/Qt/translations/qt_gd.qm',
   '/home/ant/.local/lib/python3.11/site-packages/PySide6/Qt/translations/qt_gd.qm',
   'DATA'),
  ('PySide6/Qt/translations/qt_help_es.qm',
   '/home/ant/.local/lib/python3.11/site-packages/PySide6/Qt/translations/qt_help_es.qm',
   'DATA'),
  ('PySide6/Qt/translations/qt_help_nn.qm',
   '/home/ant/.local/lib/python3.11/site-packages/PySide6/Qt/translations/qt_help_nn.qm',
   'DATA'),
  ('PySide6/Qt/translations/qt_ca.qm',
   '/home/ant/.local/lib/python3.11/site-packages/PySide6/Qt/translations/qt_ca.qm',
   'DATA'),
  ('PySide6/Qt/translations/qtbase_uk.qm',
   '/home/ant/.local/lib/python3.11/site-packages/PySide6/Qt/translations/qtbase_uk.qm',
   'DATA'),
  ('PySide6/Qt/translations/qt_hr.qm',
   '/home/ant/.local/lib/python3.11/site-packages/PySide6/Qt/translations/qt_hr.qm',
   'DATA'),
  ('PySide6/Qt/translations/qtbase_gd.qm',
   '/home/ant/.local/lib/python3.11/site-packages/PySide6/Qt/translations/qtbase_gd.qm',
   'DATA'),
  ('PySide6/Qt/translations/qt_da.qm',
   '/home/ant/.local/lib/python3.11/site-packages/PySide6/Qt/translations/qt_da.qm',
   'DATA'),
  ('PySide6/Qt/translations/qtbase_tr.qm',
   '/home/ant/.local/lib/python3.11/site-packages/PySide6/Qt/translations/qtbase_tr.qm',
   'DATA'),
  ('PySide6/Qt/translations/qt_help_hu.qm',
   '/home/ant/.local/lib/python3.11/site-packages/PySide6/Qt/translations/qt_help_hu.qm',
   'DATA'),
  ('PySide6/Qt/translations/qt_pl.qm',
   '/home/ant/.local/lib/python3.11/site-packages/PySide6/Qt/translations/qt_pl.qm',
   'DATA'),
  ('PySide6/Qt/translations/qt_help_pt_BR.qm',
   '/home/ant/.local/lib/python3.11/site-packages/PySide6/Qt/translations/qt_help_pt_BR.qm',
   'DATA'),
  ('PySide6/Qt/translations/qt_sv.qm',
   '/home/ant/.local/lib/python3.11/site-packages/PySide6/Qt/translations/qt_sv.qm',
   'DATA'),
  ('PySide6/Qt/translations/qt_help_uk.qm',
   '/home/ant/.local/lib/python3.11/site-packages/PySide6/Qt/translations/qt_help_uk.qm',
   'DATA'),
  ('PySide6/Qt/translations/qt_fa.qm',
   '/home/ant/.local/lib/python3.11/site-packages/PySide6/Qt/translations/qt_fa.qm',
   'DATA'),
  ('PySide6/Qt/translations/qtbase_cs.qm',
   '/home/ant/.local/lib/python3.11/site-packages/PySide6/Qt/translations/qtbase_cs.qm',
   'DATA'),
  ('PySide6/Qt/translations/qt_pt_PT.qm',
   '/home/ant/.local/lib/python3.11/site-packages/PySide6/Qt/translations/qt_pt_PT.qm',
   'DATA'),
  ('PySide6/Qt/translations/qt_help_tr.qm',
   '/home/ant/.local/lib/python3.11/site-packages/PySide6/Qt/translations/qt_help_tr.qm',
   'DATA'),
  ('PySide6/Qt/translations/qt_cs.qm',
   '/home/ant/.local/lib/python3.11/site-packages/PySide6/Qt/translations/qt_cs.qm',
   'DATA'),
  ('PySide6/Qt/translations/qtbase_fi.qm',
   '/home/ant/.local/lib/python3.11/site-packages/PySide6/Qt/translations/qtbase_fi.qm',
   'DATA'),
  ('PySide6/Qt/translations/qt_uk.qm',
   '/home/ant/.local/lib/python3.11/site-packages/PySide6/Qt/translations/qt_uk.qm',
   'DATA'),
  ('PySide6/Qt/translations/qt_help_gl.qm',
   '/home/ant/.local/lib/python3.11/site-packages/PySide6/Qt/translations/qt_help_gl.qm',
   'DATA'),
  ('PySide6/Qt/translations/qt_help_fr.qm',
   '/home/ant/.local/lib/python3.11/site-packages/PySide6/Qt/translations/qt_help_fr.qm',
   'DATA'),
  ('PySide6/Qt/translations/qt_ja.qm',
   '/home/ant/.local/lib/python3.11/site-packages/PySide6/Qt/translations/qt_ja.qm',
   'DATA'),
  ('PySide6/Qt/translations/qtbase_zh_TW.qm',
   '/home/ant/.local/lib/python3.11/site-packages/PySide6/Qt/translations/qtbase_zh_TW.qm',
   'DATA'),
  ('PySide6/Qt/translations/qtbase_nn.qm',
   '/home/ant/.local/lib/python3.11/site-packages/PySide6/Qt/translations/qtbase_nn.qm',
   'DATA'),
  ('PySide6/Qt/translations/qt_ar.qm',
   '/home/ant/.local/lib/python3.11/site-packages/PySide6/Qt/translations/qt_ar.qm',
   'DATA'),
  ('PySide6/Qt/translations/qt_it.qm',
   '/home/ant/.local/lib/python3.11/site-packages/PySide6/Qt/translations/qt_it.qm',
   'DATA'),
  ('PySide6/Qt/translations/qt_help_bg.qm',
   '/home/ant/.local/lib/python3.11/site-packages/PySide6/Qt/translations/qt_help_bg.qm',
   'DATA'),
  ('PySide6/Qt/translations/qt_he.qm',
   '/home/ant/.local/lib/python3.11/site-packages/PySide6/Qt/translations/qt_he.qm',
   'DATA'),
  ('PySide6/Qt/translations/qt_help_cs.qm',
   '/home/ant/.local/lib/python3.11/site-packages/PySide6/Qt/translations/qt_help_cs.qm',
   'DATA'),
  ('PySide6/Qt/translations/qt_pt_BR.qm',
   '/home/ant/.local/lib/python3.11/site-packages/PySide6/Qt/translations/qt_pt_BR.qm',
   'DATA'),
  ('PySide6/Qt/translations/qtbase_hu.qm',
   '/home/ant/.local/lib/python3.11/site-packages/PySide6/Qt/translations/qtbase_hu.qm',
   'DATA'),
  ('PySide6/Qt/translations/qtbase_ja.qm',
   '/home/ant/.local/lib/python3.11/site-packages/PySide6/Qt/translations/qtbase_ja.qm',
   'DATA'),
  ('PySide6/Qt/translations/qtbase_bg.qm',
   '/home/ant/.local/lib/python3.11/site-packages/PySide6/Qt/translations/qtbase_bg.qm',
   'DATA'),
  ('PySide6/Qt/translations/qt_help_ca.qm',
   '/home/ant/.local/lib/python3.11/site-packages/PySide6/Qt/translations/qt_help_ca.qm',
   'DATA'),
  ('PySide6/Qt/translations/qtbase_ca.qm',
   '/home/ant/.local/lib/python3.11/site-packages/PySide6/Qt/translations/qtbase_ca.qm',
   'DATA'),
  ('PySide6/Qt/translations/qtbase_nl.qm',
   '/home/ant/.local/lib/python3.11/site-packages/PySide6/Qt/translations/qtbase_nl.qm',
   'DATA'),
  ('PySide6/Qt/translations/qt_zh_CN.qm',
   '/home/ant/.local/lib/python3.11/site-packages/PySide6/Qt/translations/qt_zh_CN.qm',
   'DATA'),
  ('PySide6/Qt/translations/qt_help_sl.qm',
   '/home/ant/.local/lib/python3.11/site-packages/PySide6/Qt/translations/qt_help_sl.qm',
   'DATA'),
  ('PySide6/Qt/translations/qt_help_ru.qm',
   '/home/ant/.local/lib/python3.11/site-packages/PySide6/Qt/translations/qt_help_ru.qm',
   'DATA'),
  ('PySide6/Qt/translations/qt_sl.qm',
   '/home/ant/.local/lib/python3.11/site-packages/PySide6/Qt/translations/qt_sl.qm',
   'DATA'),
  ('PySide6/Qt/translations/qt_help_hr.qm',
   '/home/ant/.local/lib/python3.11/site-packages/PySide6/Qt/translations/qt_help_hr.qm',
   'DATA'),
  ('PySide6/Qt/translations/qt_help_sk.qm',
   '/home/ant/.local/lib/python3.11/site-packages/PySide6/Qt/translations/qt_help_sk.qm',
   'DATA'),
  ('PySide6/Qt/translations/qt_help_nl.qm',
   '/home/ant/.local/lib/python3.11/site-packages/PySide6/Qt/translations/qt_help_nl.qm',
   'DATA'),
  ('PySide6/Qt/translations/qt_ru.qm',
   '/home/ant/.local/lib/python3.11/site-packages/PySide6/Qt/translations/qt_ru.qm',
   'DATA'),
  ('PySide6/Qt/translations/qtbase_de.qm',
   '/home/ant/.local/lib/python3.11/site-packages/PySide6/Qt/translations/qtbase_de.qm',
   'DATA'),
  ('PySide6/Qt/translations/qt_lt.qm',
   '/home/ant/.local/lib/python3.11/site-packages/PySide6/Qt/translations/qt_lt.qm',
   'DATA'),
  ('PySide6/Qt/translations/qt_help_zh_CN.qm',
   '/home/ant/.local/lib/python3.11/site-packages/PySide6/Qt/translations/qt_help_zh_CN.qm',
   'DATA'),
  ('PySide6/Qt/translations/qtbase_pl.qm',
   '/home/ant/.local/lib/python3.11/site-packages/PySide6/Qt/translations/qtbase_pl.qm',
   'DATA'),
  ('PySide6/Qt/translations/qt_zh_TW.qm',
   '/home/ant/.local/lib/python3.11/site-packages/PySide6/Qt/translations/qt_zh_TW.qm',
   'DATA'),
  ('PySide6/Qt/translations/qt_help_da.qm',
   '/home/ant/.local/lib/python3.11/site-packages/PySide6/Qt/translations/qt_help_da.qm',
   'DATA'),
  ('PySide6/Qt/translations/qtbase_fa.qm',
   '/home/ant/.local/lib/python3.11/site-packages/PySide6/Qt/translations/qtbase_fa.qm',
   'DATA'),
  ('PySide6/Qt/translations/qt_en.qm',
   '/home/ant/.local/lib/python3.11/site-packages/PySide6/Qt/translations/qt_en.qm',
   'DATA'),
  ('PySide6/Qt/translations/qtbase_sk.qm',
   '/home/ant/.local/lib/python3.11/site-packages/PySide6/Qt/translations/qtbase_sk.qm',
   'DATA'),
  ('PySide6/Qt/translations/qtbase_es.qm',
   '/home/ant/.local/lib/python3.11/site-packages/PySide6/Qt/translations/qtbase_es.qm',
   'DATA'),
  ('PySide6/Qt/translations/qt_help_de.qm',
   '/home/ant/.local/lib/python3.11/site-packages/PySide6/Qt/translations/qt_help_de.qm',
   'DATA'),
  ('PySide6/Qt/translations/qtbase_en.qm',
   '/home/ant/.local/lib/python3.11/site-packages/PySide6/Qt/translations/qtbase_en.qm',
   'DATA'),
  ('PySide6/Qt/translations/qt_fi.qm',
   '/home/ant/.local/lib/python3.11/site-packages/PySide6/Qt/translations/qt_fi.qm',
   'DATA'),
  ('PySide6/Qt/translations/qt_help_ko.qm',
   '/home/ant/.local/lib/python3.11/site-packages/PySide6/Qt/translations/qt_help_ko.qm',
   'DATA'),
  ('PySide6/Qt/translations/qtbase_he.qm',
   '/home/ant/.local/lib/python3.11/site-packages/PySide6/Qt/translations/qtbase_he.qm',
   'DATA'),
  ('PySide6/Qt/translations/qt_sk.qm',
   '/home/ant/.local/lib/python3.11/site-packages/PySide6/Qt/translations/qt_sk.qm',
   'DATA'),
  ('PySide6/Qt/translations/qt_help_zh_TW.qm',
   '/home/ant/.local/lib/python3.11/site-packages/PySide6/Qt/translations/qt_help_zh_TW.qm',
   'DATA'),
  ('PySide6/Qt/translations/qtbase_da.qm',
   '/home/ant/.local/lib/python3.11/site-packages/PySide6/Qt/translations/qtbase_da.qm',
   'DATA'),
  ('PySide6/Qt/translations/qtbase_ru.qm',
   '/home/ant/.local/lib/python3.11/site-packages/PySide6/Qt/translations/qtbase_ru.qm',
   'DATA'),
  ('PySide6/Qt/translations/qt_hu.qm',
   '/home/ant/.local/lib/python3.11/site-packages/PySide6/Qt/translations/qt_hu.qm',
   'DATA'),
  ('PySide6/Qt/translations/qtbase_hr.qm',
   '/home/ant/.local/lib/python3.11/site-packages/PySide6/Qt/translations/qtbase_hr.qm',
   'DATA'),
  ('PySide6/Qt/translations/qt_fr.qm',
   '/home/ant/.local/lib/python3.11/site-packages/PySide6/Qt/translations/qt_fr.qm',
   'DATA'),
  ('PySide6/Qt/translations/qtbase_lv.qm',
   '/home/ant/.local/lib/python3.11/site-packages/PySide6/Qt/translations/qtbase_lv.qm',
   'DATA'),
  ('PySide6/Qt/translations/qt_tr.qm',
   '/home/ant/.local/lib/python3.11/site-packages/PySide6/Qt/translations/qt_tr.qm',
   'DATA'),
  ('PySide6/Qt/translations/qt_lv.qm',
   '/home/ant/.local/lib/python3.11/site-packages/PySide6/Qt/translations/qt_lv.qm',
   'DATA'),
  ('PySide6/Qt/translations/qt_help_it.qm',
   '/home/ant/.local/lib/python3.11/site-packages/PySide6/Qt/translations/qt_help_it.qm',
   'DATA'),
  ('PySide6/Qt/translations/qt_ko.qm',
   '/home/ant/.local/lib/python3.11/site-packages/PySide6/Qt/translations/qt_ko.qm',
   'DATA'),
  ('PySide6/Qt/translations/qt_help_pl.qm',
   '/home/ant/.local/lib/python3.11/site-packages/PySide6/Qt/translations/qt_help_pl.qm',
   'DATA'),
  ('PySide6/Qt/translations/qt_help_ja.qm',
   '/home/ant/.local/lib/python3.11/site-packages/PySide6/Qt/translations/qt_help_ja.qm',
   'DATA'),
  ('PySide6/Qt/translations/qtbase_fr.qm',
   '/home/ant/.local/lib/python3.11/site-packages/PySide6/Qt/translations/qtbase_fr.qm',
   'DATA'),
  ('PySide6/Qt/translations/qtbase_ar.qm',
   '/home/ant/.local/lib/python3.11/site-packages/PySide6/Qt/translations/qtbase_ar.qm',
   'DATA'),
  ('PySide6/Qt/translations/qt_nl.qm',
   '/home/ant/.local/lib/python3.11/site-packages/PySide6/Qt/translations/qt_nl.qm',
   'DATA'),
  ('PySide6/Qt/translations/qtbase_ko.qm',
   '/home/ant/.local/lib/python3.11/site-packages/PySide6/Qt/translations/qtbase_ko.qm',
   'DATA'),
  ('PySide6/Qt/translations/qt_help_en.qm',
   '/home/ant/.local/lib/python3.11/site-packages/PySide6/Qt/translations/qt_help_en.qm',
   'DATA'),
  ('PySide6/Qt/translations/qt_help_ar.qm',
   '/home/ant/.local/lib/python3.11/site-packages/PySide6/Qt/translations/qt_help_ar.qm',
   'DATA'),
  ('PySide6/Qt/translations/qt_es.qm',
   '/home/ant/.local/lib/python3.11/site-packages/PySide6/Qt/translations/qt_es.qm',
   'DATA'),
  ('PySide6/Qt/translations/qt_de.qm',
   '/home/ant/.local/lib/python3.11/site-packages/PySide6/Qt/translations/qt_de.qm',
   'DATA'),
  ('PySide6/Qt/translations/qt_gl.qm',
   '/home/ant/.local/lib/python3.11/site-packages/PySide6/Qt/translations/qt_gl.qm',
   'DATA'),
  ('PySide6/Qt/translations/qtbase_zh_CN.qm',
   '/home/ant/.local/lib/python3.11/site-packages/PySide6/Qt/translations/qtbase_zh_CN.qm',
   'DATA'),
  ('PySide6/Qt/translations/qt_nn.qm',
   '/home/ant/.local/lib/python3.11/site-packages/PySide6/Qt/translations/qt_nn.qm',
   'DATA')],)
