('/home/ant/Documents/programs/python/wos-guide-qt/build/main/main',
 False,
 False,
 True,
 None,
 None,
 False,
 False,
 None,
 True,
 True,
 False,
 None,
 None,
 None,
 '/home/ant/Documents/programs/python/wos-guide-qt/build/main/main.pkg',
 [('PYZ-00.pyz',
   '/home/ant/Documents/programs/python/wos-guide-qt/build/main/PYZ-00.pyz',
   'PYZ'),
  ('lib-dynload/_struct.cpython-311-x86_64-linux-gnu.so',
   '/usr/lib/python3.11/lib-dynload/_struct.cpython-311-x86_64-linux-gnu.so',
   'EXTENSION'),
  ('lib-dynload/zlib.cpython-311-x86_64-linux-gnu.so',
   '/usr/lib/python3.11/lib-dynload/zlib.cpython-311-x86_64-linux-gnu.so',
   'EXTENSION'),
  ('struct',
   '/home/ant/Documents/programs/python/wos-guide-qt/build/main/localpycs/struct.pyc',
   'PYMODULE'),
  ('pyimod01_archive',
   '/home/ant/Documents/programs/python/wos-guide-qt/build/main/localpycs/pyimod01_archive.pyc',
   'PYMODULE'),
  ('pyimod02_importers',
   '/home/ant/Documents/programs/python/wos-guide-qt/build/main/localpycs/pyimod02_importers.pyc',
   'PYMODULE'),
  ('pyimod03_ctypes',
   '/home/ant/Documents/programs/python/wos-guide-qt/build/main/localpycs/pyimod03_ctypes.pyc',
   'PYMODULE'),
  ('pyiboot01_bootstrap',
   '/usr/lib/python3.11/site-packages/PyInstaller/loader/pyiboot01_bootstrap.py',
   'PYSOURCE'),
  ('pyi_rth_inspect',
   '/usr/lib/python3.11/site-packages/PyInstaller/hooks/rthooks/pyi_rth_inspect.py',
   'PYSOURCE'),
  ('pyi_rth_pyside6',
   '/usr/lib/python3.11/site-packages/PyInstaller/hooks/rthooks/pyi_rth_pyside6.py',
   'PYSOURCE'),
  ('main',
   '/home/ant/Documents/programs/python/wos-guide-qt/src/main.py',
   'PYSOURCE')],
 [],
 False,
 False,
 1691326903,
 [('run',
   '/usr/lib/python3.11/site-packages/PyInstaller/bootloader/Linux-64bit-intel/run',
   'EXECUTABLE')])
