%YAML 1.1
%TAG !u! tag:unity3d.com,2011:
--- !u!114 &11400000
MonoBehaviour:
  m_ObjectHideFlags: 0
  m_CorrespondingSourceObject: {fileID: 0}
  m_PrefabInstance: {fileID: 0}
  m_PrefabAsset: {fileID: 0}
  m_GameObject: {fileID: 0}
  m_Enabled: 1
  m_EditorHideFlags: 0
  m_Script: {fileID: 11500000, guid: 355a0009206a5a04e88b3cc4224c65d2, type: 3}
  m_Name: Director
  m_EditorClassIdentifier: 
  _Builder: {fileID: 11400000, guid: 136d708e10deba645b52bf81e4081c57, type: 2}
  MenuScene: 0
  Levels: 02000000
