%YAML 1.1
%TAG !u! tag:unity3d.com,2011:
--- !u!1 &5592256020593864180
GameObject:
  m_ObjectHideFlags: 0
  m_CorrespondingSourceObject: {fileID: 0}
  m_PrefabInstance: {fileID: 0}
  m_PrefabAsset: {fileID: 0}
  serializedVersion: 6
  m_Component:
  - component: {fileID: 696985944064886735}
  - component: {fileID: -5871042786089412551}
  - component: {fileID: 6673089413191069233}
  m_Layer: 0
  m_Name: DirectorView
  m_TagString: Untagged
  m_Icon: {fileID: 0}
  m_NavMeshLayer: 0
  m_StaticEditorFlags: 0
  m_IsActive: 1
--- !u!4 &696985944064886735
Transform:
  m_ObjectHideFlags: 0
  m_CorrespondingSourceObject: {fileID: 0}
  m_PrefabInstance: {fileID: 0}
  m_PrefabAsset: {fileID: 0}
  m_GameObject: {fileID: 5592256020593864180}
  serializedVersion: 2
  m_LocalRotation: {x: 0, y: 0, z: 0, w: 1}
  m_LocalPosition: {x: 0, y: 0, z: 0}
  m_LocalScale: {x: 1, y: 1, z: 1}
  m_ConstrainProportionsScale: 0
  m_Children: []
  m_Father: {fileID: 0}
  m_LocalEulerAnglesHint: {x: 0, y: 0, z: 0}
--- !u!114 &-5871042786089412551
MonoBehaviour:
  m_ObjectHideFlags: 0
  m_CorrespondingSourceObject: {fileID: 0}
  m_PrefabInstance: {fileID: 0}
  m_PrefabAsset: {fileID: 0}
  m_GameObject: {fileID: 5592256020593864180}
  m_Enabled: 1
  m_EditorHideFlags: 0
  m_Script: {fileID: 11500000, guid: 838460174e3eeff409e76d4e6af37b0c, type: 3}
  m_Name: 
  m_EditorClassIdentifier: 
  Director: {fileID: 11400000, guid: 51f32e85e2e3b14468efc816b4810fd5, type: 2}
--- !u!114 &6673089413191069233
MonoBehaviour:
  m_ObjectHideFlags: 0
  m_CorrespondingSourceObject: {fileID: 0}
  m_PrefabInstance: {fileID: 0}
  m_PrefabAsset: {fileID: 0}
  m_GameObject: {fileID: 5592256020593864180}
  m_Enabled: 1
  m_EditorHideFlags: 0
  m_Script: {fileID: 11500000, guid: bf504a4b43df5454fb100a587ede6655, type: 3}
  m_Name: 
  m_EditorClassIdentifier: 
  SpawnPoints2Player:
  - {fileID: 0}
  - {fileID: 0}
  SpawnPoints3Player:
  - {fileID: 0}
  - {fileID: 0}
  - {fileID: 0}
  SpawnPoints4Player:
  - {fileID: 0}
  - {fileID: 0}
  - {fileID: 0}
  - {fileID: 0}
